hbase-builds mailing list archives

Site index · List index
Message view « Date » · « Thread »
Top « Date » · « Thread »
From Apache Jenkins Server <jenk...@builds.apache.org>
Subject Build failed in Jenkins: HBase-1.2-IT » IntegrationTestBigLinkedList,latest1.7,Hadoop #348
Date Thu, 17 Dec 2015 20:25:34 GMT
See <https://builds.apache.org/job/HBase-1.2-IT/it.test=IntegrationTestBigLinkedList,jdk=latest1.7,label=Hadoop/348/changes>

Changes:

[matteo.bertozzi] HBASE-14730 region server needs to log warnings when there are

[anoopsamjohn] HBASE-14999 Remove ref to org.mortbay.log.Log.

------------------------------------------
[...truncated 48624 lines...]
     bool UseOptoBiasInlining                       = true            {C2 product}       

     bool UsePPCLWSYNC                              = true            {product}          

     bool UsePSAdaptiveSurvivorSizePolicy           = true            {product}          

     bool UseParNewGC                               = false           {product}          

     bool UseParallelGC                            := true            {product}          

     bool UseParallelOldGC                          = true            {product}          

     bool UsePerfData                               = true            {product}          

     bool UsePopCountInstruction                    = true            {product}          

     bool UseRDPCForConstantTableBase               = false           {C2 product}       

     bool UseSHM                                    = false           {product}          

     intx UseSSE                                    = 4               {product}          

     bool UseSSE42Intrinsics                        = true            {product}          

     bool UseSerialGC                               = false           {product}          

     bool UseSharedSpaces                           = false           {product}          

     bool UseSignalChaining                         = true            {product}          

     bool UseSplitVerifier                          = true            {product}          

     bool UseStoreImmI16                            = false           {ARCH product}     

     bool UseStringCache                            = false           {product}          

     bool UseSuperWord                              = true            {C2 product}       

     bool UseTLAB                                   = true            {pd product}       

     bool UseThreadPriorities                       = true            {pd product}       

     bool UseTransparentHugePages                   = false           {product}          

     bool UseTypeProfile                            = true            {product}          

     bool UseUnalignedLoadStores                    = true            {ARCH product}     

     bool UseVMInterruptibleIO                      = false           {product}          

     bool UseVectoredExceptions                     = false           {pd product}       

     bool UseXMMForArrayCopy                        = true            {product}          

     bool UseXmmI2D                                 = false           {ARCH product}     

     bool UseXmmI2F                                 = false           {ARCH product}     

     bool UseXmmLoadAndClearUpper                   = true            {ARCH product}     

     bool UseXmmRegToRegMoveAll                     = true            {ARCH product}     

     bool VMThreadHintNoPreempt                     = false           {product}          

     intx VMThreadPriority                          = -1              {product}          

     intx VMThreadStackSize                         = 1024            {pd product}       

     intx ValueMapInitialSize                       = 11              {C1 product}       

     intx ValueMapMaxLoopSize                       = 8               {C1 product}       

     intx ValueSearchLimit                          = 1000            {C2 product}       

     bool VerifyMergedCPBytecodes                   = true            {product}          

     intx WorkAroundNPTLTimedWaitHang               = 1               {product}          

    uintx YoungGenerationSizeIncrement              = 20              {product}          

    uintx YoungGenerationSizeSupplement             = 80              {product}          

    uintx YoungGenerationSizeSupplementDecay        = 8               {product}          

    uintx YoungPLABSize                             = 4096            {product}          

     bool ZeroTLAB                                  = false           {product}          

     intx hashCode                                  = 0               {product}          

Running org.apache.hadoop.hbase.test.IntegrationTestBigLinkedList
SUREFIRE-859: [GC 194048K->13674K(740864K), 0.0263760 secs]
SUREFIRE-859: [GC 207722K->70275K(740864K), 0.1216400 secs]
SUREFIRE-859: [GC 264323K->112498K(740864K), 0.0686260 secs]
SUREFIRE-859: [GC 306546K->133026K(934912K), 0.0724170 secs]
SUREFIRE-859: [GC 521122K->166797K(934912K), 0.1230170 secs]
SUREFIRE-859: [GC 554893K->183784K(1373696K), 0.0560480 secs]
SUREFIRE-859: [GC 959976K->261889K(1378304K), 0.1224140 secs]
SUREFIRE-859: [GC 1038081K->341798K(1718272K), 0.1694100 secs]
SUREFIRE-859: [GC 1425702K->479766K(1756160K), 0.2031730 secs]
SUREFIRE-859: [GC 1563670K->681391K(1467904K), 0.2097290 secs]
SUREFIRE-859: [Full GC 681391K->525175K(1841152K), 0.9246800 secs]
SUREFIRE-859: [GC 1310715K->677765K(1990144K), 0.0957180 secs]
SUREFIRE-859: [GC 1463685K->759601K(1951232K), 0.1711060 secs]
SUREFIRE-859: [GC 1552689K->892610K(1974272K), 0.1783250 secs]
SUREFIRE-859: [Full GC 892610K->752539K(2344448K), 0.7199160 secs]
SUREFIRE-859: [GC 1545627K->1029153K(2314752K), 0.1396200 secs]
SUREFIRE-859: [GC 1806881K->1171058K(2356224K), 0.2331300 secs]
SUREFIRE-859: [GC 1948786K->1295066K(2313728K), 0.1944830 secs]
SUREFIRE-859: [Full GC 1295066K->991445K(2735104K), 1.0500190 secs]
SUREFIRE-859: [GC 1785042K->1076375K(2764288K), 0.0834940 secs]
SUREFIRE-859: [GC 1869975K->1132620K(2778624K), 0.0868460 secs]
SUREFIRE-859: [GC 1973324K->1181738K(2795008K), 0.1160190 secs]
SUREFIRE-859: [GC 2022442K->1231703K(2767360K), 0.2786390 secs]
SUREFIRE-859: [GC 2037036K->1234609K(2738176K), 0.1190040 secs]
SUREFIRE-859: [GC 2039985K->1304003K(2690048K), 0.1262370 secs]
SUREFIRE-859: [GC 1988547K->1317426K(2700288K), 0.1156290 secs]
SUREFIRE-859: [GC 2001970K->1299958K(2638848K), 0.1432520 secs]
SUREFIRE-859: [GC 1861622K->1441080K(2669568K), 0.1396760 secs]
SUREFIRE-859: [GC 2002744K->1465932K(2574336K), 0.1722380 secs]
SUREFIRE-859: [GC 1932364K->1594487K(2621952K), 0.1581860 secs]
SUREFIRE-859: [GC 2060919K->1727444K(2621952K), 0.1837430 secs]
SUREFIRE-859: [GC 2193876K->1828849K(2621952K), 0.3582220 secs]
SUREFIRE-859: [GC 2295225K->2107568K(2749952K), 0.4002610 secs]
SUREFIRE-859: [Full GC 2107568K->698062K(2478080K), 0.8928580 secs]
SUREFIRE-859: [GC 1164494K->800840K(2478080K), 0.0564150 secs]
SUREFIRE-859: [GC 1267272K->1113457K(2478080K), 0.1096430 secs]
SUREFIRE-859: [GC 1579889K->1210463K(2478080K), 0.1478790 secs]
SUREFIRE-859: [GC 1676895K->1376015K(2478080K), 0.1166330 secs]
SUREFIRE-859: [Full GC 1376015K->889424K(2832384K), 0.6345490 secs]
SUREFIRE-859: [GC 1355856K->977203K(2832384K), 0.0906780 secs]
SUREFIRE-859: [GC 1443635K->1079502K(2832384K), 0.1136590 secs]
SUREFIRE-859: [GC 1545934K->1148707K(2832384K), 0.0931890 secs]
SUREFIRE-859: [GC 1615139K->1196795K(2832384K), 0.0490870 secs]
SUREFIRE-859: [GC 1663227K->1291589K(2832384K), 0.0553260 secs]
SUREFIRE-859: [GC 1758021K->1373447K(2832384K), 0.0651540 secs]
SUREFIRE-859: [GC 1839879K->1437753K(2832384K), 0.0811270 secs]
SUREFIRE-859: [GC 1904185K->1499221K(2832384K), 0.0853410 secs]
SUREFIRE-859: [GC 1963964K->1587554K(2431488K), 0.0760630 secs]
SUREFIRE-859: [GC 2053986K->1691768K(2843136K), 0.2249560 secs]
SUREFIRE-859: [GC 2183288K->1718112K(2818048K), 0.0927150 secs]
SUREFIRE-859: [Full GC 1718112K->465302K(2335232K), 0.5670850 secs]
SUREFIRE-859: [GC 956822K->510489K(2365440K), 0.0801730 secs]
SUREFIRE-859: [GC 1047065K->584903K(2351616K), 0.0806150 secs]
SUREFIRE-859: [GC 1121479K->649299K(2354176K), 0.0896140 secs]
SUREFIRE-859: [GC 1241171K->681429K(2368000K), 0.0607930 secs]
SUREFIRE-859: [GC 1273301K->696921K(2338304K), 0.0517970 secs]
SUREFIRE-859: [GC 1333316K->684301K(2366976K), 0.0614200 secs]
SUREFIRE-859: [GC 1320717K->654737K(2377728K), 0.0723630 secs]
SUREFIRE-859: [GC 1342865K->683424K(2387968K), 0.0692340 secs]
SUREFIRE-859: [GC 1371552K->652183K(2391040K), 0.0667980 secs]
SUREFIRE-859: [GC 1387927K->649638K(2407936K), 0.0501350 secs]
SUREFIRE-859: [GC 1385382K->709084K(2411520K), 0.0505630 secs]
SUREFIRE-859: [GC 1478620K->720321K(2425856K), 0.0553130 secs]
SUREFIRE-859: [GC 1489857K->683119K(2457600K), 0.0449610 secs]
SUREFIRE-859: [GC 1497199K->667397K(2455040K), 0.0541790 secs]
Tests run: 1, Failures: 0, Errors: 1, Skipped: 0, Time elapsed: 503.8 sec <<< FAILURE!
- in org.apache.hadoop.hbase.test.IntegrationTestBigLinkedList
testContinuousIngest(org.apache.hadoop.hbase.test.IntegrationTestBigLinkedList)  Time elapsed:
503.682 sec  <<< ERROR!
java.lang.RuntimeException: Verify.run failed with return code: 1
	at org.apache.hadoop.hbase.test.IntegrationTestBigLinkedList$Loop.runVerify(IntegrationTestBigLinkedList.java:1261)
	at org.apache.hadoop.hbase.test.IntegrationTestBigLinkedList$Loop.run(IntegrationTestBigLinkedList.java:1298)
	at org.apache.hadoop.util.ToolRunner.run(ToolRunner.java:70)
	at org.apache.hadoop.hbase.test.IntegrationTestBigLinkedList.testContinuousIngest(IntegrationTestBigLinkedList.java:1577)


Results :

Tests in error: 
  IntegrationTestBigLinkedList.testContinuousIngest:1577 » Runtime Verify.run fa...

Tests run: 1, Failures: 0, Errors: 1, Skipped: 0

[WARNING] File encoding has not been set, using platform encoding ISO-8859-1, i.e. build is
platform dependent! The file encoding for reports output files should be provided by the POM
property ${project.reporting.outputEncoding}.
[INFO] 
[INFO] --- maven-failsafe-plugin:2.18.1:verify (verify) @ hbase-it ---
[INFO] Failsafe report directory: <https://builds.apache.org/job/HBase-1.2-IT/it.test=IntegrationTestBigLinkedList,jdk=latest1.7,label=Hadoop/ws/hbase-it/target/failsafe-reports>
[WARNING] File encoding has not been set, using platform encoding ISO-8859-1, i.e. build is
platform dependent! The file encoding for reports output files should be provided by the POM
property ${project.reporting.outputEncoding}.
[INFO] ------------------------------------------------------------------------
[INFO] Reactor Summary:
[INFO] 
[INFO] Apache HBase ...................................... SUCCESS [1:05.288s]
[INFO] Apache HBase - Checkstyle ......................... SUCCESS [3.923s]
[INFO] Apache HBase - Resource Bundle .................... SUCCESS [0.284s]
[INFO] Apache HBase - Annotations ........................ SUCCESS [1.277s]
[INFO] Apache HBase - Protocol ........................... SUCCESS [20.239s]
[INFO] Apache HBase - Common ............................. SUCCESS [1:12.679s]
[INFO] Apache HBase - Procedure .......................... SUCCESS [1.625s]
[INFO] Apache HBase - Client ............................. SUCCESS [15.917s]
[INFO] Apache HBase - Hadoop Compatibility ............... SUCCESS [0.863s]
[INFO] Apache HBase - Hadoop Two Compatibility ........... SUCCESS [4.209s]
[INFO] Apache HBase - Prefix Tree ........................ SUCCESS [1.367s]
[INFO] Apache HBase - Server ............................. SUCCESS [1:06.983s]
[INFO] Apache HBase - Testing Util ....................... SUCCESS [4.017s]
[INFO] Apache HBase - Thrift ............................. SUCCESS [6.582s]
[INFO] Apache HBase - Rest ............................... SUCCESS [3.363s]
[INFO] Apache HBase - Shell .............................. SUCCESS [6.611s]
[INFO] Apache HBase - Integration Tests .................. FAILURE [8:32.705s]
[INFO] Apache HBase - Examples ........................... SKIPPED
[INFO] Apache HBase - External Block Cache ............... SKIPPED
[INFO] Apache HBase - Assembly ........................... SKIPPED
[INFO] Apache HBase - Shaded ............................. SKIPPED
[INFO] Apache HBase - Shaded - Client .................... SKIPPED
[INFO] Apache HBase - Shaded - Server .................... SKIPPED
[INFO] ------------------------------------------------------------------------
[INFO] BUILD FAILURE
[INFO] ------------------------------------------------------------------------
[INFO] Total time: 13:27.553s
[INFO] Finished at: Thu Dec 17 20:25:32 UTC 2015
[INFO] Final Memory: 138M/1108M
[INFO] ------------------------------------------------------------------------
[ERROR] Failed to execute goal org.apache.maven.plugins:maven-failsafe-plugin:2.18.1:verify
(verify) on project hbase-it: There are test failures.
[ERROR] 
[ERROR] Please refer to <https://builds.apache.org/job/HBase-1.2-IT/it.test=IntegrationTestBigLinkedList,jdk=latest1.7,label=Hadoop/ws/hbase-it/target/failsafe-reports>
for the individual test results.
[ERROR] -> [Help 1]
[ERROR] 
[ERROR] To see the full stack trace of the errors, re-run Maven with the -e switch.
[ERROR] Re-run Maven using the -X switch to enable full debug logging.
[ERROR] 
[ERROR] For more information about the errors and possible solutions, please read the following
articles:
[ERROR] [Help 1] http://cwiki.apache.org/confluence/display/MAVEN/MojoFailureException
[ERROR] 
[ERROR] After correcting the problems, you can resume the build with the command
[ERROR]   mvn <goals> -rf :hbase-it
Build step 'Invoke top-level Maven targets' marked build as failure
Performing Post build task...
Match found for :.* : True
Logical operation result is TRUE
Running script  : # Post-build task script. TODO: Check this in and have all builds reference
check-in.
pwd && ls
# NOTE!!!! The below code has been copied and pasted from ./dev-tools/run-test.sh
# Do not change here without syncing there and vice-versa.
ZOMBIE_TESTS_COUNT=`jps -v | grep surefirebooter | grep -e '-Dhbase.test' | wc -l`
if [[ $ZOMBIE_TESTS_COUNT != 0 ]] ; then
 echo "Suspicious java process found - waiting 30s to see if there are just slow to stop"
 sleep 30
 ZOMBIE_TESTS_COUNT=`jps -v | grep surefirebooter | grep -e '-Dhbase.test' | wc -l`
 if [[ $ZOMBIE_TESTS_COUNT != 0 ]] ; then
   echo " {color:red}There appear to be $ZOMBIE_TESTS_COUNT zombie tests{color}, they should
have been killed by surefire but survived"
   jps -v | grep surefirebooter | grep -e '-Dhbase.test'
   jps -v | grep surefirebooter | grep -e '-Dhbase.test' | cut -d ' ' -f 1 | xargs -n 1 jstack
   # Exit with error
   exit 1
 else
   echo "We're ok: there is no zombie test, but some tests took some time to stop"
 fi
else
  echo "We're ok: there is no zombie test"
fi
[Hadoop] $ /bin/bash -xe /tmp/hudson8206044690118165211.sh
+ pwd
<https://builds.apache.org/job/HBase-1.2-IT/it.test=IntegrationTestBigLinkedList,jdk=latest1.7,label=Hadoop/ws/>
+ ls
bin
CHANGES.txt
conf
dev-support
hbase-annotations
hbase-assembly
hbase-checkstyle
hbase-client
hbase-common
hbase-examples
hbase-external-blockcache
hbase-hadoop2-compat
hbase-hadoop-compat
hbase-it
hbase-native-client
hbase-prefix-tree
hbase-procedure
hbase-protocol
hbase-resource-bundle
hbase-rest
hbase-server
hbase-shaded
hbase-shell
hbase-testing-util
hbase-thrift
LICENSE.txt
NOTICE.txt
pom.xml
README.txt
src
target
++ jps -v
++ grep surefirebooter
++ wc -l
++ grep -e -Dhbase.test
+ ZOMBIE_TESTS_COUNT=0
+ [[ 0 != 0 ]]
+ echo 'We'\''re ok: there is no zombie test'
We're ok: there is no zombie test
POST BUILD TASK : SUCCESS
END OF POST BUILD TASK : 0
Archiving artifacts

Mime
View raw message