hbase-builds mailing list archives

Site index · List index
Message view « Date » · « Thread »
Top « Date » · « Thread »
From Apache Jenkins Server <jenk...@builds.apache.org>
Subject Build failed in Jenkins: HBase-1.2-IT » IntegrationTestBigLinkedList,latest1.7,Hadoop #364
Date Thu, 24 Dec 2015 15:59:27 GMT
See <https://builds.apache.org/job/HBase-1.2-IT/it.test=IntegrationTestBigLinkedList,jdk=latest1.7,label=Hadoop/364/changes>

Changes:

[tedyu] HBASE-15032 hbase shell scan filter string assumes UTF-8 encoding

------------------------------------------
[...truncated 2277 lines...]
     bool UseCodeCacheFlushing                      = true            {product}          

     bool UseCompiler                               = true            {product}          

     bool UseCompilerSafepoints                     = true            {product}          

     bool UseCompressedOops                        := true            {lp64_product}     

     bool UseConcMarkSweepGC                        = false           {product}          

     bool UseCondCardMark                           = false           {C2 product}       

     bool UseCountLeadingZerosInstruction           = false           {ARCH product}     

     bool UseCounterDecay                           = true            {product}          

     bool UseDivMod                                 = true            {C2 product}       

     bool UseDynamicNumberOfGCThreads               = false           {product}          

     bool UseFPUForSpilling                         = false           {C2 product}       

     bool UseFastAccessorMethods                    = false           {product}          

     bool UseFastEmptyMethods                       = false           {product}          

     bool UseFastJNIAccessors                       = true            {product}          

     bool UseFastStosb                              = false           {ARCH product}     

     bool UseG1GC                                   = false           {product}          

     bool UseGCLogFileRotation                      = false           {product}          

     bool UseGCOverheadLimit                        = true            {product}          

     bool UseGCTaskAffinity                         = false           {product}          

     bool UseHeavyMonitors                          = false           {product}          

     bool UseHugeTLBFS                              = false           {product}          

     bool UseInlineCaches                           = true            {product}          

     bool UseInterpreter                            = true            {product}          

     bool UseJumpTables                             = true            {C2 product}       

     bool UseLWPSynchronization                     = true            {product}          

     bool UseLargePages                             = false           {pd product}       

     bool UseLargePagesIndividualAllocation         = false           {pd product}       

     bool UseLinuxPosixThreadCPUClocks              = true            {product}          

     bool UseLockedTracing                          = false           {product}          

     bool UseLoopCounter                            = true            {product}          

     bool UseLoopPredicate                          = true            {C2 product}       

     bool UseMaximumCompactionOnSystemGC            = true            {product}          

     bool UseMembar                                 = false           {pd product}       

     bool UseNUMA                                   = false           {product}          

     bool UseNUMAInterleaving                       = false           {product}          

     bool UseNewLongLShift                          = false           {ARCH product}     

     bool UseOSErrorReporting                       = false           {pd product}       

     bool UseOldInlining                            = true            {C2 product}       

     bool UseOnStackReplacement                     = true            {pd product}       

     bool UseOnlyInlinedBimorphic                   = true            {C2 product}       

     bool UseOprofile                               = false           {product}          

     bool UseOptoBiasInlining                       = true            {C2 product}       

     bool UsePPCLWSYNC                              = true            {product}          

     bool UsePSAdaptiveSurvivorSizePolicy           = true            {product}          

     bool UseParNewGC                               = false           {product}          

     bool UseParallelGC                            := true            {product}          

     bool UseParallelOldGC                          = true            {product}          

     bool UsePerfData                               = true            {product}          

     bool UsePopCountInstruction                    = true            {product}          

     bool UseRDPCForConstantTableBase               = false           {C2 product}       

     bool UseSHM                                    = false           {product}          

     intx UseSSE                                    = 4               {product}          

     bool UseSSE42Intrinsics                        = true            {product}          

     bool UseSerialGC                               = false           {product}          

     bool UseSharedSpaces                           = false           {product}          

     bool UseSignalChaining                         = true            {product}          

     bool UseSplitVerifier                          = true            {product}          

     bool UseStoreImmI16                            = false           {ARCH product}     

     bool UseStringCache                            = false           {product}          

     bool UseSuperWord                              = true            {C2 product}       

     bool UseTLAB                                   = true            {pd product}       

     bool UseThreadPriorities                       = true            {pd product}       

     bool UseTransparentHugePages                   = false           {product}          

     bool UseTypeProfile                            = true            {product}          

     bool UseUnalignedLoadStores                    = true            {ARCH product}     

     bool UseVMInterruptibleIO                      = false           {product}          

     bool UseVectoredExceptions                     = false           {pd product}       

     bool UseXMMForArrayCopy                        = true            {product}          

     bool UseXmmI2D                                 = false           {ARCH product}     

     bool UseXmmI2F                                 = false           {ARCH product}     

     bool UseXmmLoadAndClearUpper                   = true            {ARCH product}     

     bool UseXmmRegToRegMoveAll                     = true            {ARCH product}     

     bool VMThreadHintNoPreempt                     = false           {product}          

     intx VMThreadPriority                          = -1              {product}          

     intx VMThreadStackSize                         = 1024            {pd product}       

     intx ValueMapInitialSize                       = 11              {C1 product}       

     intx ValueMapMaxLoopSize                       = 8               {C1 product}       

     intx ValueSearchLimit                          = 1000            {C2 product}       

     bool VerifyMergedCPBytecodes                   = true            {product}          

     intx WorkAroundNPTLTimedWaitHang               = 1               {product}          

    uintx YoungGenerationSizeIncrement              = 20              {product}          

    uintx YoungGenerationSizeSupplement             = 80              {product}          

    uintx YoungGenerationSizeSupplementDecay        = 8               {product}          

    uintx YoungPLABSize                             = 4096            {product}          

     bool ZeroTLAB                                  = false           {product}          

     intx hashCode                                  = 0               {product}          

Running org.apache.hadoop.hbase.test.IntegrationTestBigLinkedList
SUREFIRE-859: [GC 194048K->14382K(740864K), 0.0751150 secs]
SUREFIRE-859: [GC 208430K->70147K(934912K), 0.1270120 secs]
SUREFIRE-859: [GC 458243K->126457K(934912K), 0.1643250 secs]
SUREFIRE-859: [GC 514553K->162732K(1323008K), 0.1000240 secs]
SUREFIRE-859: [GC 938924K->252631K(1323008K), 0.1450890 secs]
SUREFIRE-859: [GC 1028823K->350113K(1729536K), 0.0719350 secs]
SUREFIRE-859: [GC 1422753K->396429K(1750528K), 0.2071590 secs]
SUREFIRE-859: [GC 1469069K->520932K(1535488K), 0.7196180 secs]
SUREFIRE-859: [GC 1378532K->665497K(1643008K), 0.1926450 secs]
SUREFIRE-859: [GC 1523097K->807162K(1554432K), 0.5126200 secs]
SUREFIRE-859: [Full GC 807162K->561458K(1923072K), 1.4775680 secs]
SUREFIRE-859: [GC 1268530K->730963K(1998336K), 0.0825350 secs]
SUREFIRE-859: [GC 1438035K->800802K(1961984K), 0.1837360 secs]
SUREFIRE-859: [GC 1519650K->887114K(1986048K), 0.7883970 secs]
SUREFIRE-859: [Full GC 887114K->755335K(2295296K), 1.5197950 secs]
SUREFIRE-859: [GC 1474183K->845128K(2305024K), 0.1187160 secs]
SUREFIRE-859: [GC 1610568K->877940K(2323456K), 0.2610610 secs]
SUREFIRE-859: [GC 1643380K->891528K(2344448K), 0.0355510 secs]
SUREFIRE-859: [GC 1682056K->895680K(2346496K), 0.0566830 secs]
SUREFIRE-859: [GC 1686208K->881714K(2346496K), 0.0252790 secs]
SUREFIRE-859: [GC 1684527K->890767K(2347008K), 0.0782360 secs]
SUREFIRE-859: [GC 1693583K->917600K(2343936K), 0.0650920 secs]

Results :

Tests run: 0, Failures: 0, Errors: 0, Skipped: 0

[WARNING] File encoding has not been set, using platform encoding ISO-8859-1, i.e. build is
platform dependent! The file encoding for reports output files should be provided by the POM
property ${project.reporting.outputEncoding}.
[INFO] 
[INFO] --- maven-failsafe-plugin:2.18.1:verify (verify) @ hbase-it ---
[INFO] Failsafe report directory: <https://builds.apache.org/job/HBase-1.2-IT/it.test=IntegrationTestBigLinkedList,jdk=latest1.7,label=Hadoop/ws/hbase-it/target/failsafe-reports>
[WARNING] File encoding has not been set, using platform encoding ISO-8859-1, i.e. build is
platform dependent! The file encoding for reports output files should be provided by the POM
property ${project.reporting.outputEncoding}.
[INFO] ------------------------------------------------------------------------
[INFO] Reactor Summary:
[INFO] 
[INFO] Apache HBase ...................................... SUCCESS [3.573s]
[INFO] Apache HBase - Checkstyle ......................... SUCCESS [0.762s]
[INFO] Apache HBase - Resource Bundle .................... SUCCESS [0.405s]
[INFO] Apache HBase - Annotations ........................ SUCCESS [1.365s]
[INFO] Apache HBase - Protocol ........................... SUCCESS [18.893s]
[INFO] Apache HBase - Common ............................. SUCCESS [11.938s]
[INFO] Apache HBase - Procedure .......................... SUCCESS [1.956s]
[INFO] Apache HBase - Client ............................. SUCCESS [7.124s]
[INFO] Apache HBase - Hadoop Compatibility ............... SUCCESS [0.446s]
[INFO] Apache HBase - Hadoop Two Compatibility ........... SUCCESS [1.732s]
[INFO] Apache HBase - Prefix Tree ........................ SUCCESS [1.685s]
[INFO] Apache HBase - Server ............................. SUCCESS [36.900s]
[INFO] Apache HBase - Testing Util ....................... SUCCESS [1.763s]
[INFO] Apache HBase - Thrift ............................. SUCCESS [6.828s]
[INFO] Apache HBase - Rest ............................... SUCCESS [3.295s]
[INFO] Apache HBase - Shell .............................. SUCCESS [1.158s]
[INFO] Apache HBase - Integration Tests .................. FAILURE [30:03.226s]
[INFO] Apache HBase - Examples ........................... SKIPPED
[INFO] Apache HBase - External Block Cache ............... SKIPPED
[INFO] Apache HBase - Assembly ........................... SKIPPED
[INFO] Apache HBase - Shaded ............................. SKIPPED
[INFO] Apache HBase - Shaded - Client .................... SKIPPED
[INFO] Apache HBase - Shaded - Server .................... SKIPPED
[INFO] ------------------------------------------------------------------------
[INFO] BUILD FAILURE
[INFO] ------------------------------------------------------------------------
[INFO] Total time: 31:45.052s
[INFO] Finished at: Thu Dec 24 15:59:17 UTC 2015
[INFO] Final Memory: 209M/4327M
[INFO] ------------------------------------------------------------------------
[ERROR] Failed to execute goal org.apache.maven.plugins:maven-failsafe-plugin:2.18.1:verify
(verify) on project hbase-it: There was a timeout or other error in the fork -> [Help 1]
[ERROR] 
[ERROR] To see the full stack trace of the errors, re-run Maven with the -e switch.
[ERROR] Re-run Maven using the -X switch to enable full debug logging.
[ERROR] 
[ERROR] For more information about the errors and possible solutions, please read the following
articles:
[ERROR] [Help 1] http://cwiki.apache.org/confluence/display/MAVEN/MojoFailureException
[ERROR] 
[ERROR] After correcting the problems, you can resume the build with the command
[ERROR]   mvn <goals> -rf :hbase-it
Build step 'Invoke top-level Maven targets' marked build as failure
Performing Post build task...
Match found for :.* : True
Logical operation result is TRUE
Running script  : # Post-build task script. TODO: Check this in and have all builds reference
check-in.
pwd && ls
# NOTE!!!! The below code has been copied and pasted from ./dev-tools/run-test.sh
# Do not change here without syncing there and vice-versa.
ZOMBIE_TESTS_COUNT=`jps -v | grep surefirebooter | grep -e '-Dhbase.test' | wc -l`
if [[ $ZOMBIE_TESTS_COUNT != 0 ]] ; then
 echo "Suspicious java process found - waiting 30s to see if there are just slow to stop"
 sleep 30
 ZOMBIE_TESTS_COUNT=`jps -v | grep surefirebooter | grep -e '-Dhbase.test' | wc -l`
 if [[ $ZOMBIE_TESTS_COUNT != 0 ]] ; then
   echo " {color:red}There appear to be $ZOMBIE_TESTS_COUNT zombie tests{color}, they should
have been killed by surefire but survived"
   jps -v | grep surefirebooter | grep -e '-Dhbase.test'
   jps -v | grep surefirebooter | grep -e '-Dhbase.test' | cut -d ' ' -f 1 | xargs -n 1 jstack
   # Exit with error
   exit 1
 else
   echo "We're ok: there is no zombie test, but some tests took some time to stop"
 fi
else
  echo "We're ok: there is no zombie test"
fi
[Hadoop] $ /bin/bash -xe /tmp/hudson8886919803696970129.sh
+ pwd
<https://builds.apache.org/job/HBase-1.2-IT/it.test=IntegrationTestBigLinkedList,jdk=latest1.7,label=Hadoop/ws/>
+ ls
bin
CHANGES.txt
conf
dev-support
hbase-annotations
hbase-assembly
hbase-checkstyle
hbase-client
hbase-common
hbase-examples
hbase-external-blockcache
hbase-hadoop2-compat
hbase-hadoop-compat
hbase-it
hbase-native-client
hbase-prefix-tree
hbase-procedure
hbase-protocol
hbase-resource-bundle
hbase-rest
hbase-server
hbase-shaded
hbase-shell
hbase-testing-util
hbase-thrift
LICENSE.txt
NOTICE.txt
pom.xml
README.txt
src
target
++ jps -v
++ grep surefirebooter
++ wc -l
++ grep -e -Dhbase.test
+ ZOMBIE_TESTS_COUNT=0
+ [[ 0 != 0 ]]
+ echo 'We'\''re ok: there is no zombie test'
We're ok: there is no zombie test
POST BUILD TASK : SUCCESS
END OF POST BUILD TASK : 0
Archiving artifacts
ERROR: Failed to archive {hbase-it/target/MiniMRCluster_776583178/MiniMRCluster_776583178-logDir-nm-0_1/application_1450970979929_0001/container_1450970979929_0001_01_000001/stdout=hbase-it/target/MiniMRCluster_776583178/MiniMRCluster_776583178-logDir-nm-0_1/application_1450970979929_0001/container_1450970979929_0001_01_000001/stdout,
hbase-it/target/MiniMRCluster_776583178/MiniMRCluster_776583178-logDir-nm-1_0/application_1450970979929_0002/container_1450970979929_0002_01_000002/stderr=hbase-it/target/MiniMRCluster_776583178/MiniMRCluster_776583178-logDir-nm-1_0/application_1450970979929_0002/container_1450970979929_0002_01_000002/stderr,
hbase-it/target/MiniMRCluster_776583178/MiniMRCluster_776583178-logDir-nm-1_0/application_1450970979929_0002/container_1450970979929_0002_01_000002/syslog=hbase-it/target/MiniMRCluster_776583178/MiniMRCluster_776583178-logDir-nm-1_0/application_1450970979929_0002/container_1450970979929_0002_01_000002/syslog,
hbase-it/target/MiniMRCluster_776583178/MiniMRCluster_776583178-logDir-nm-0_1/application_1450970979929_0001/container_1450970979929_0001_01_000002/syslog=hbase-it/target/MiniMRCluster_776583178/MiniMRCluster_776583178-logDir-nm-0_1/application_1450970979929_0001/container_1450970979929_0001_01_000002/syslog,
hbase-it/target/MiniMRCluster_776583178/MiniMRCluster_776583178-logDir-nm-0_1/application_1450970979929_0001/container_1450970979929_0001_01_000002/stderr=hbase-it/target/MiniMRCluster_776583178/MiniMRCluster_776583178-logDir-nm-0_1/application_1450970979929_0001/container_1450970979929_0001_01_000002/stderr,
hbase-it/target/MiniMRCluster_776583178/MiniMRCluster_776583178-logDir-nm-1_0/application_1450970979929_0002/container_1450970979929_0002_01_000003/stderr=hbase-it/target/MiniMRCluster_776583178/MiniMRCluster_776583178-logDir-nm-1_0/application_1450970979929_0002/container_1450970979929_0002_01_000003/stderr,
hbase-it/target/MiniMRCluster_776583178/MiniMRCluster_776583178-logDir-nm-0_1/application_1450970979929_0001/container_1450970979929_0001_01_000002/stdout=hbase-it/target/MiniMRCluster_776583178/MiniMRCluster_776583178-logDir-nm-0_1/application_1450970979929_0001/container_1450970979929_0001_01_000002/stdout,
hbase-it/target/MiniMRCluster_776583178/MiniMRCluster_776583178-logDir-nm-1_0/application_1450970979929_0002/container_1450970979929_0002_01_000002/stdout=hbase-it/target/MiniMRCluster_776583178/MiniMRCluster_776583178-logDir-nm-1_0/application_1450970979929_0002/container_1450970979929_0002_01_000002/stdout,
hbase-it/target/MiniMRCluster_776583178/MiniMRCluster_776583178-logDir-nm-1_1/application_1450970979929_0002/container_1450970979929_0002_01_000004/stderr=hbase-it/target/MiniMRCluster_776583178/MiniMRCluster_776583178-logDir-nm-1_1/application_1450970979929_0002/container_1450970979929_0002_01_000004/stderr,
hbase-it/target/MiniMRCluster_776583178/MiniMRCluster_776583178-logDir-nm-1_2/application_1450970979929_0002/container_1450970979929_0002_01_000001/syslog=hbase-it/target/MiniMRCluster_776583178/MiniMRCluster_776583178-logDir-nm-1_2/application_1450970979929_0002/container_1450970979929_0002_01_000001/syslog,
hbase-it/target/MiniMRCluster_776583178/MiniMRCluster_776583178-logDir-nm-0_2/application_1450970979929_0002/container_1450970979929_0002_02_000001/stderr=hbase-it/target/MiniMRCluster_776583178/MiniMRCluster_776583178-logDir-nm-0_2/application_1450970979929_0002/container_1450970979929_0002_02_000001/stderr,
hbase-it/target/MiniMRCluster_776583178/MiniMRCluster_776583178-logDir-nm-1_2/application_1450970979929_0002/container_1450970979929_0002_01_000001/stdout=hbase-it/target/MiniMRCluster_776583178/MiniMRCluster_776583178-logDir-nm-1_2/application_1450970979929_0002/container_1450970979929_0002_01_000001/stdout,
hbase-it/target/MiniMRCluster_776583178/MiniMRCluster_776583178-logDir-nm-1_2/application_1450970979929_0002/container_1450970979929_0002_01_000001/stderr=hbase-it/target/MiniMRCluster_776583178/MiniMRCluster_776583178-logDir-nm-1_2/application_1450970979929_0002/container_1450970979929_0002_01_000001/stderr,
hbase-it/target/MiniMRCluster_776583178/MiniMRCluster_776583178-logDir-nm-1_1/application_1450970979929_0002/container_1450970979929_0002_01_000004/syslog=hbase-it/target/MiniMRCluster_776583178/MiniMRCluster_776583178-logDir-nm-1_1/application_1450970979929_0002/container_1450970979929_0002_01_000004/syslog,
hbase-it/target/MiniMRCluster_776583178/MiniMRCluster_776583178-logDir-nm-1_1/application_1450970979929_0002/container_1450970979929_0002_01_000004/stdout=hbase-it/target/MiniMRCluster_776583178/MiniMRCluster_776583178-logDir-nm-1_1/application_1450970979929_0002/container_1450970979929_0002_01_000004/stdout,
hbase-it/target/MiniMRCluster_776583178/MiniMRCluster_776583178-logDir-nm-0_1/application_1450970979929_0001/container_1450970979929_0001_01_000001/syslog=hbase-it/target/MiniMRCluster_776583178/MiniMRCluster_776583178-logDir-nm-0_1/application_1450970979929_0001/container_1450970979929_0001_01_000001/syslog,
hbase-it/target/MiniMRCluster_776583178/MiniMRCluster_776583178-logDir-nm-1_0/application_1450970979929_0002/container_1450970979929_0002_01_000003/stdout=hbase-it/target/MiniMRCluster_776583178/MiniMRCluster_776583178-logDir-nm-1_0/application_1450970979929_0002/container_1450970979929_0002_01_000003/stdout,
hbase-it/target/MiniMRCluster_776583178/MiniMRCluster_776583178-logDir-nm-1_0/application_1450970979929_0002/container_1450970979929_0002_01_000003/syslog=hbase-it/target/MiniMRCluster_776583178/MiniMRCluster_776583178-logDir-nm-1_0/application_1450970979929_0002/container_1450970979929_0002_01_000003/syslog,
hbase-it/target/MiniMRCluster_776583178/MiniMRCluster_776583178-logDir-nm-1_3/application_1450970979929_0002/container_1450970979929_0002_02_000002/stdout=hbase-it/target/MiniMRCluster_776583178/MiniMRCluster_776583178-logDir-nm-1_3/application_1450970979929_0002/container_1450970979929_0002_02_000002/stdout,
hbase-it/target/failsafe-reports/failsafe-summary.xml=hbase-it/target/failsafe-reports/failsafe-summary.xml,
hbase-it/target/MiniMRCluster_776583178/MiniMRCluster_776583178-logDir-nm-0_2/application_1450970979929_0002/container_1450970979929_0002_02_000001/stdout=hbase-it/target/MiniMRCluster_776583178/MiniMRCluster_776583178-logDir-nm-0_2/application_1450970979929_0002/container_1450970979929_0002_02_000001/stdout,
hbase-it/target/MiniMRCluster_776583178/MiniMRCluster_776583178-logDir-nm-1_3/application_1450970979929_0002/container_1450970979929_0002_02_000002/stderr=hbase-it/target/MiniMRCluster_776583178/MiniMRCluster_776583178-logDir-nm-1_3/application_1450970979929_0002/container_1450970979929_0002_02_000002/stderr,
hbase-it/target/MiniMRCluster_776583178/MiniMRCluster_776583178-logDir-nm-0_1/application_1450970979929_0001/container_1450970979929_0001_01_000001/stderr=hbase-it/target/MiniMRCluster_776583178/MiniMRCluster_776583178-logDir-nm-0_1/application_1450970979929_0001/container_1450970979929_0001_01_000001/stderr,
hbase-it/target/failsafe-reports/org.apache.hadoop.hbase.test.IntegrationTestBigLinkedList-output.txt=hbase-it/target/failsafe-reports/org.apache.hadoop.hbase.test.IntegrationTestBigLinkedList-output.txt,
hbase-it/target/MiniMRCluster_776583178/MiniMRCluster_776583178-logDir-nm-0_2/application_1450970979929_0002/container_1450970979929_0002_02_000001/syslog=hbase-it/target/MiniMRCluster_776583178/MiniMRCluster_776583178-logDir-nm-0_2/application_1450970979929_0002/container_1450970979929_0002_02_000001/syslog,
hbase-it/target/MiniMRCluster_776583178/MiniMRCluster_776583178-logDir-nm-1_3/application_1450970979929_0002/container_1450970979929_0002_02_000002/syslog=hbase-it/target/MiniMRCluster_776583178/MiniMRCluster_776583178-logDir-nm-1_3/application_1450970979929_0002/container_1450970979929_0002_02_000002/syslog}
due to internal error; falling back to full archiving
java.lang.IllegalStateException: checksum mismatch after transfer (3616444605239734829 vs.
73778202); /x1/jenkins/jenkins-home/jobs/HBase-1.2-IT/configurations/axis-it.test/IntegrationTestBigLinkedList/axis-jdk/latest1.7/axis-label/Hadoop/builds/364/archive/hbase-it/target/MiniMRCluster_776583178/MiniMRCluster_776583178-logDir-nm-0_2/application_1450970979929_0002/container_1450970979929_0002_02_000001/syslog
may be corrupted
	at jsync.protocol.FileSequenceReader.read(FileSequenceReader.java:45)
	at com.cloudbees.jenkins.plugins.jsync.archiver.JSyncArtifactManager.remoteSync(JSyncArtifactManager.java:148)
	at com.cloudbees.jenkins.plugins.jsync.archiver.JSyncArtifactManager.archive(JSyncArtifactManager.java:72)
	at hudson.tasks.ArtifactArchiver.perform(ArtifactArchiver.java:219)
	at hudson.tasks.BuildStepCompatibilityLayer.perform(BuildStepCompatibilityLayer.java:74)
	at hudson.tasks.BuildStepMonitor$1.perform(BuildStepMonitor.java:20)
	at hudson.model.AbstractBuild$AbstractBuildExecution.perform(AbstractBuild.java:776)
	at hudson.model.AbstractBuild$AbstractBuildExecution.performAllBuildSteps(AbstractBuild.java:723)
	at hudson.model.Build$BuildExecution.post2(Build.java:183)
	at hudson.model.AbstractBuild$AbstractBuildExecution.post(AbstractBuild.java:670)
	at hudson.model.Run.execute(Run.java:1763)
	at hudson.matrix.MatrixRun.run(MatrixRun.java:146)
	at hudson.model.ResourceController.execute(ResourceController.java:98)
	at hudson.model.Executor.run(Executor.java:381)

Mime
View raw message