hbase-builds mailing list archives

Site index · List index
Message view « Date » · « Thread »
Top « Date » · « Thread »
From Apache Jenkins Server <jenk...@builds.apache.org>
Subject Build failed in Jenkins: HBase-1.3 » latest1.7,Hadoop #439
Date Wed, 16 Dec 2015 03:00:03 GMT
See <https://builds.apache.org/job/HBase-1.3/jdk=latest1.7,label=Hadoop/439/changes>

Changes:

[enis] HBASE-14977 ChoreService.shutdown may result in

[matteo.bertozzi] HBASE-14947 WALProcedureStore improvements

------------------------------------------
[...truncated 44340 lines...]
Tests run: 3, Failures: 0, Errors: 0, Skipped: 0, Time elapsed: 2.909 sec - in org.apache.hadoop.hbase.regionserver.TestCacheOnWriteInSchema
Tests run: 6, Failures: 0, Errors: 0, Skipped: 0, Time elapsed: 5.402 sec - in org.apache.hadoop.hbase.regionserver.TestSeekOptimizations
Tests run: 1, Failures: 0, Errors: 0, Skipped: 0, Time elapsed: 35.438 sec - in org.apache.hadoop.hbase.regionserver.TestScannerRetriableFailure
Running org.apache.hadoop.hbase.regionserver.TestSCVFWithMiniCluster
Tests run: 5, Failures: 0, Errors: 0, Skipped: 0, Time elapsed: 0.351 sec - in org.apache.hadoop.hbase.regionserver.TestSCVFWithMiniCluster
Running org.apache.hadoop.hbase.regionserver.wal.TestProtobufLog
Tests run: 1, Failures: 0, Errors: 0, Skipped: 0, Time elapsed: 1.521 sec - in org.apache.hadoop.hbase.regionserver.wal.TestProtobufLog
Running org.apache.hadoop.hbase.regionserver.wal.TestWALReplay
Running org.apache.hadoop.hbase.regionserver.wal.TestLogRolling
Running org.apache.hadoop.hbase.regionserver.wal.TestWALReplayCompressed
Running org.apache.hadoop.hbase.regionserver.wal.TestLogRollPeriod
Tests run: 9, Failures: 0, Errors: 0, Skipped: 0, Time elapsed: 39.574 sec - in org.apache.hadoop.hbase.regionserver.wal.TestWALReplay
Tests run: 9, Failures: 0, Errors: 0, Skipped: 0, Time elapsed: 39.972 sec - in org.apache.hadoop.hbase.regionserver.wal.TestWALReplayCompressed
Running org.apache.hadoop.hbase.regionserver.wal.TestLogRollAbort
Running org.apache.hadoop.hbase.regionserver.wal.TestSecureWALReplay
Tests run: 2, Failures: 0, Errors: 0, Skipped: 0, Time elapsed: 62.758 sec - in org.apache.hadoop.hbase.regionserver.wal.TestLogRollPeriod
Tests run: 2, Failures: 0, Errors: 0, Skipped: 0, Time elapsed: 29.208 sec - in org.apache.hadoop.hbase.regionserver.wal.TestLogRollAbort
Tests run: 1, Failures: 0, Errors: 1, Skipped: 0, Time elapsed: 360.434 sec <<< FAILURE!
- in org.apache.hadoop.hbase.regionserver.TestRSKilledWhenInitializing
testRSTermnationAfterRegisteringToMasterBeforeCreatingEphemeralNod(org.apache.hadoop.hbase.regionserver.TestRSKilledWhenInitializing)
 Time elapsed: 179.744 sec  <<< ERROR!
org.junit.runners.model.TestTimedOutException: test timed out after 180000 milliseconds
	at java.lang.Object.wait(Native Method)
	at java.lang.Thread.join(Thread.java:1281)
	at java.lang.Thread.join(Thread.java:1355)
	at org.apache.zookeeper.server.SyncRequestProcessor.shutdown(SyncRequestProcessor.java:213)
	at org.apache.zookeeper.server.PrepRequestProcessor.shutdown(PrepRequestProcessor.java:770)
	at org.apache.zookeeper.server.ZooKeeperServer.shutdown(ZooKeeperServer.java:478)
	at org.apache.zookeeper.server.NIOServerCnxnFactory.shutdown(NIOServerCnxnFactory.java:266)
	at org.apache.hadoop.hbase.zookeeper.MiniZooKeeperCluster.shutdown(MiniZooKeeperCluster.java:301)
	at org.apache.hadoop.hbase.HBaseTestingUtility.shutdownMiniZKCluster(HBaseTestingUtility.java:814)
	at org.apache.hadoop.hbase.HBaseTestingUtility.shutdownMiniCluster(HBaseTestingUtility.java:1122)
	at org.apache.hadoop.hbase.regionserver.TestRSKilledWhenInitializing.testRSTermnationAfterRegisteringToMasterBeforeCreatingEphemeralNod(TestRSKilledWhenInitializing.java:104)

Running org.apache.hadoop.hbase.regionserver.wal.TestReadOldRootAndMetaEdits
Tests run: 1, Failures: 0, Errors: 0, Skipped: 0, Time elapsed: 0.356 sec - in org.apache.hadoop.hbase.regionserver.wal.TestReadOldRootAndMetaEdits
Running org.apache.hadoop.hbase.regionserver.wal.TestFSHLog
Tests run: 6, Failures: 0, Errors: 0, Skipped: 0, Time elapsed: 4.448 sec - in org.apache.hadoop.hbase.regionserver.wal.TestFSHLog
Running org.apache.hadoop.hbase.regionserver.wal.TestDurability
Running org.apache.hadoop.hbase.regionserver.TestMinorCompaction
Tests run: 3, Failures: 0, Errors: 0, Skipped: 0, Time elapsed: 2.506 sec - in org.apache.hadoop.hbase.regionserver.wal.TestDurability
Tests run: 6, Failures: 0, Errors: 0, Skipped: 0, Time elapsed: 3.675 sec - in org.apache.hadoop.hbase.regionserver.TestMinorCompaction
Running org.apache.hadoop.hbase.regionserver.TestWALLockup
Tests run: 1, Failures: 0, Errors: 0, Skipped: 0, Time elapsed: 2.962 sec - in org.apache.hadoop.hbase.regionserver.TestWALLockup
Running org.apache.hadoop.hbase.regionserver.TestDefaultMemStore
Tests run: 9, Failures: 0, Errors: 0, Skipped: 0, Time elapsed: 44.554 sec - in org.apache.hadoop.hbase.regionserver.wal.TestSecureWALReplay
Running org.apache.hadoop.hbase.regionserver.TestRegionMergeTransactionOnCluster
Running org.apache.hadoop.hbase.regionserver.TestServerCustomProtocol
Tests run: 24, Failures: 0, Errors: 0, Skipped: 0, Time elapsed: 21.479 sec - in org.apache.hadoop.hbase.regionserver.TestDefaultMemStore
Tests run: 4, Failures: 0, Errors: 0, Skipped: 0, Time elapsed: 31.218 sec - in org.apache.hadoop.hbase.regionserver.TestRegionMergeTransactionOnCluster
Running org.apache.hadoop.hbase.regionserver.TestCorruptedRegionStoreFile
Running org.apache.hadoop.hbase.regionserver.TestRegionFavoredNodes
Tests run: 1, Failures: 0, Errors: 0, Skipped: 0, Time elapsed: 8.924 sec - in org.apache.hadoop.hbase.regionserver.TestRegionFavoredNodes
Running org.apache.hadoop.hbase.regionserver.TestPerColumnFamilyFlush
Tests run: 7, Failures: 0, Errors: 0, Skipped: 0, Time elapsed: 55.99 sec - in org.apache.hadoop.hbase.regionserver.TestServerCustomProtocol
Running org.apache.hadoop.hbase.regionserver.TestRowTooBig
Tests run: 2, Failures: 0, Errors: 0, Skipped: 0, Time elapsed: 13.988 sec - in org.apache.hadoop.hbase.regionserver.TestRowTooBig
Running org.apache.hadoop.hbase.regionserver.TestScannerHeartbeatMessages
Tests run: 1, Failures: 0, Errors: 0, Skipped: 0, Time elapsed: 27.471 sec - in org.apache.hadoop.hbase.regionserver.TestScannerHeartbeatMessages
Running org.apache.hadoop.hbase.regionserver.TestCompactionWithCoprocessor
Tests run: 1, Failures: 0, Errors: 1, Skipped: 0, Time elapsed: 540.492 sec <<< FAILURE!
- in org.apache.hadoop.hbase.regionserver.TestRSKilledWhenInitializing
testRSTermnationAfterRegisteringToMasterBeforeCreatingEphemeralNod(org.apache.hadoop.hbase.regionserver.TestRSKilledWhenInitializing)
 Time elapsed: 179.343 sec  <<< ERROR!
org.junit.runners.model.TestTimedOutException: test timed out after 180000 milliseconds
	at java.lang.Object.wait(Native Method)
	at java.lang.Thread.join(Thread.java:1281)
	at java.lang.Thread.join(Thread.java:1355)
	at org.apache.zookeeper.server.SyncRequestProcessor.shutdown(SyncRequestProcessor.java:213)
	at org.apache.zookeeper.server.PrepRequestProcessor.shutdown(PrepRequestProcessor.java:770)
	at org.apache.zookeeper.server.ZooKeeperServer.shutdown(ZooKeeperServer.java:478)
	at org.apache.zookeeper.server.NIOServerCnxnFactory.shutdown(NIOServerCnxnFactory.java:266)
	at org.apache.hadoop.hbase.zookeeper.MiniZooKeeperCluster.shutdown(MiniZooKeeperCluster.java:301)
	at org.apache.hadoop.hbase.HBaseTestingUtility.shutdownMiniZKCluster(HBaseTestingUtility.java:814)
	at org.apache.hadoop.hbase.HBaseTestingUtility.shutdownMiniCluster(HBaseTestingUtility.java:1122)
	at org.apache.hadoop.hbase.regionserver.TestRSKilledWhenInitializing.testRSTermnationAfterRegisteringToMasterBeforeCreatingEphemeralNod(TestRSKilledWhenInitializing.java:104)

Running org.apache.hadoop.hbase.regionserver.TestAtomicOperation
Tests run: 2, Failures: 0, Errors: 0, Skipped: 0, Time elapsed: 129.058 sec - in org.apache.hadoop.hbase.regionserver.TestCorruptedRegionStoreFile
Running org.apache.hadoop.hbase.regionserver.TestSplitLogWorker
Tests run: 6, Failures: 0, Errors: 0, Skipped: 1, Time elapsed: 115.227 sec - in org.apache.hadoop.hbase.regionserver.TestPerColumnFamilyFlush
Running org.apache.hadoop.hbase.regionserver.TestRegionReplicaFailover
Tests run: 5, Failures: 0, Errors: 0, Skipped: 0, Time elapsed: 24.37 sec - in org.apache.hadoop.hbase.regionserver.TestCompactionWithCoprocessor
Running org.apache.hadoop.hbase.regionserver.TestSplitWalDataLoss
Tests run: 8, Failures: 0, Errors: 0, Skipped: 0, Time elapsed: 20.275 sec - in org.apache.hadoop.hbase.regionserver.TestAtomicOperation
Running org.apache.hadoop.hbase.regionserver.TestMajorCompaction
Tests run: 1, Failures: 0, Errors: 0, Skipped: 0, Time elapsed: 21.276 sec - in org.apache.hadoop.hbase.regionserver.TestSplitWalDataLoss
Running org.apache.hadoop.hbase.regionserver.TestClusterId
Tests run: 5, Failures: 0, Errors: 0, Skipped: 0, Time elapsed: 297.614 sec - in org.apache.hadoop.hbase.regionserver.wal.TestLogRolling
Running org.apache.hadoop.hbase.regionserver.TestCompactionState
Tests run: 7, Failures: 0, Errors: 0, Skipped: 0, Time elapsed: 49.764 sec - in org.apache.hadoop.hbase.regionserver.TestMajorCompaction
Running org.apache.hadoop.hbase.regionserver.TestFSErrorsExposed
Tests run: 2, Failures: 0, Errors: 0, Skipped: 0, Time elapsed: 38.787 sec - in org.apache.hadoop.hbase.regionserver.TestClusterId
Running org.apache.hadoop.hbase.regionserver.TestRegionReplicas
Tests run: 3, Failures: 0, Errors: 0, Skipped: 0, Time elapsed: 36.961 sec - in org.apache.hadoop.hbase.regionserver.TestFSErrorsExposed
Tests run: 5, Failures: 0, Errors: 0, Skipped: 0, Time elapsed: 58.064 sec - in org.apache.hadoop.hbase.regionserver.TestCompactionState
Running org.apache.hadoop.hbase.regionserver.TestCompoundBloomFilter
Running org.apache.hadoop.hbase.regionserver.TestEncryptionKeyRotation
Tests run: 2, Failures: 0, Errors: 0, Skipped: 0, Time elapsed: 17.851 sec - in org.apache.hadoop.hbase.regionserver.TestEncryptionKeyRotation
Running org.apache.hadoop.hbase.regionserver.handler.TestOpenRegionHandler
Tests run: 6, Failures: 0, Errors: 0, Skipped: 0, Time elapsed: 3.178 sec - in org.apache.hadoop.hbase.regionserver.handler.TestOpenRegionHandler
Running org.apache.hadoop.hbase.regionserver.handler.TestCloseRegionHandler
Tests run: 3, Failures: 0, Errors: 0, Skipped: 0, Time elapsed: 2.575 sec - in org.apache.hadoop.hbase.regionserver.handler.TestCloseRegionHandler
Running org.apache.hadoop.hbase.regionserver.TestRegionServerMetrics
Tests run: 10, Failures: 0, Errors: 0, Skipped: 0, Time elapsed: 32.836 sec - in org.apache.hadoop.hbase.regionserver.TestRegionServerMetrics
Running org.apache.hadoop.hbase.regionserver.TestFlushRegionEntry
Tests run: 1, Failures: 0, Errors: 0, Skipped: 0, Time elapsed: 1.059 sec - in org.apache.hadoop.hbase.regionserver.TestFlushRegionEntry
Running org.apache.hadoop.hbase.TestLocalHBaseCluster
Tests run: 6, Failures: 0, Errors: 0, Skipped: 0, Time elapsed: 206.555 sec - in org.apache.hadoop.hbase.regionserver.TestRegionReplicaFailover
Tests run: 1, Failures: 0, Errors: 0, Skipped: 0, Time elapsed: 13.542 sec - in org.apache.hadoop.hbase.TestLocalHBaseCluster
Running org.apache.hadoop.hbase.migration.TestUpgradeTo96
Tests run: 5, Failures: 0, Errors: 0, Skipped: 0, Time elapsed: 2.461 sec - in org.apache.hadoop.hbase.migration.TestUpgradeTo96
Running org.apache.hadoop.hbase.migration.TestNamespaceUpgrade
Running org.apache.hadoop.hbase.quotas.TestQuotaThrottle
Tests run: 5, Failures: 0, Errors: 0, Skipped: 0, Time elapsed: 27.576 sec - in org.apache.hadoop.hbase.migration.TestNamespaceUpgrade
Running org.apache.hadoop.hbase.quotas.TestQuotaAdmin
Tests run: 3, Failures: 0, Errors: 0, Skipped: 0, Time elapsed: 160.9 sec - in org.apache.hadoop.hbase.regionserver.TestCompoundBloomFilter
Tests run: 12, Failures: 0, Errors: 0, Skipped: 0, Time elapsed: 30.558 sec - in org.apache.hadoop.hbase.quotas.TestQuotaThrottle
Tests run: 3, Failures: 0, Errors: 0, Skipped: 0, Time elapsed: 3.481 sec - in org.apache.hadoop.hbase.quotas.TestQuotaAdmin
Running org.apache.hadoop.hbase.quotas.TestQuotaTableUtil
Tests run: 7, Failures: 0, Errors: 0, Skipped: 0, Time elapsed: 202.594 sec - in org.apache.hadoop.hbase.regionserver.TestRegionReplicas
Tests run: 3, Failures: 0, Errors: 0, Skipped: 0, Time elapsed: 1.468 sec - in org.apache.hadoop.hbase.quotas.TestQuotaTableUtil
Running org.apache.hadoop.hbase.constraint.TestConstraint
Running org.apache.hadoop.hbase.TestServerSideScanMetricsFromClientSide
Tests run: 2, Failures: 0, Errors: 0, Skipped: 0, Time elapsed: 3.331 sec - in org.apache.hadoop.hbase.TestServerSideScanMetricsFromClientSide
Tests run: 5, Failures: 0, Errors: 0, Skipped: 0, Time elapsed: 29.627 sec - in org.apache.hadoop.hbase.constraint.TestConstraint

Results :

Tests in error: 
org.apache.hadoop.hbase.regionserver.TestRSKilledWhenInitializing.testRSTermnationAfterRegisteringToMasterBeforeCreatingEphemeralNod(org.apache.hadoop.hbase.regionserver.TestRSKilledWhenInitializing)
  Run 1: TestRSKilledWhenInitializing.testRSTermnationAfterRegisteringToMasterBeforeCreatingEphemeralNod:104->Object.wait:-2
» TestTimedOut
  Run 2: TestRSKilledWhenInitializing.testRSTermnationAfterRegisteringToMasterBeforeCreatingEphemeralNod:104->Object.wait:-2
» TestTimedOut
  Run 3: TestRSKilledWhenInitializing.testRSTermnationAfterRegisteringToMasterBeforeCreatingEphemeralNod:104->Object.wait:-2
» TestTimedOut


Tests run: 2390, Failures: 0, Errors: 1, Skipped: 38

[INFO] ------------------------------------------------------------------------
[INFO] Reactor Summary:
[INFO] 
[INFO] Apache HBase ...................................... SUCCESS [52.487s]
[INFO] Apache HBase - Checkstyle ......................... SUCCESS [4.763s]
[INFO] Apache HBase - Resource Bundle .................... SUCCESS [0.211s]
[INFO] Apache HBase - Annotations ........................ SUCCESS [1.084s]
[INFO] Apache HBase - Protocol ........................... SUCCESS [15.978s]
[INFO] Apache HBase - Common ............................. SUCCESS [2:11.154s]
[INFO] Apache HBase - Procedure .......................... SUCCESS [3:25.176s]
[INFO] Apache HBase - Client ............................. SUCCESS [1:21.840s]
[INFO] Apache HBase - Hadoop Compatibility ............... SUCCESS [8.201s]
[INFO] Apache HBase - Hadoop Two Compatibility ........... SUCCESS [8.920s]
[INFO] Apache HBase - Prefix Tree ........................ SUCCESS [10.118s]
[INFO] Apache HBase - Server ............................. FAILURE [2:01:28.602s]
[INFO] Apache HBase - Testing Util ....................... SKIPPED
[INFO] Apache HBase - Thrift ............................. SKIPPED
[INFO] Apache HBase - Rest ............................... SKIPPED
[INFO] Apache HBase - Shell .............................. SKIPPED
[INFO] Apache HBase - Integration Tests .................. SKIPPED
[INFO] Apache HBase - Examples ........................... SKIPPED
[INFO] Apache HBase - External Block Cache ............... SKIPPED
[INFO] Apache HBase - Assembly ........................... SKIPPED
[INFO] Apache HBase - Shaded ............................. SKIPPED
[INFO] Apache HBase - Shaded - Client .................... SKIPPED
[INFO] Apache HBase - Shaded - Server .................... SKIPPED
[INFO] ------------------------------------------------------------------------
[INFO] BUILD FAILURE
[INFO] ------------------------------------------------------------------------
[INFO] Total time: 2:10:27.771s
[INFO] Finished at: Wed Dec 16 02:57:31 UTC 2015
[INFO] Final Memory: 444M/651M
[INFO] ------------------------------------------------------------------------
[ERROR] Failed to execute goal org.apache.maven.plugins:maven-surefire-plugin:2.18.1:test
(secondPartTestsExecution) on project hbase-server: There was a timeout or other error in
the fork -> [Help 1]
[ERROR] 
[ERROR] To see the full stack trace of the errors, re-run Maven with the -e switch.
[ERROR] Re-run Maven using the -X switch to enable full debug logging.
[ERROR] 
[ERROR] For more information about the errors and possible solutions, please read the following
articles:
[ERROR] [Help 1] http://cwiki.apache.org/confluence/display/MAVEN/MojoFailureException
[ERROR] 
[ERROR] After correcting the problems, you can resume the build with the command
[ERROR]   mvn <goals> -rf :hbase-server
Build step 'Invoke top-level Maven targets' marked build as failure
Performing Post build task...
Match found for :.* : True
Logical operation result is TRUE
Running script  : # Post-build task script. TODO: Check this in and have all builds reference
check-in.
pwd && ls
# NOTE!!!! The below code has been copied and pasted from ./dev-tools/run-test.sh
# Do not change here without syncing there and vice-versa.
ZOMBIE_TESTS_COUNT=`jps -v | grep surefirebooter | grep -e '-Dhbase.test' | wc -l`
if [[ $ZOMBIE_TESTS_COUNT != 0 ]] ; then
 echo "Suspicious java process found - waiting 30s to see if there are just slow to stop"
 sleep 30
 ZOMBIE_TESTS_COUNT=`jps -v | grep surefirebooter | grep -e '-Dhbase.test' | wc -l`
 if [[ $ZOMBIE_TESTS_COUNT != 0 ]] ; then
   echo " {color:red}There appear to be $ZOMBIE_TESTS_COUNT zombie tests{color}, they should
have been killed by surefire but survived"
   jps -v | grep surefirebooter | grep -e '-Dhbase.test'
   jps -v | grep surefirebooter | grep -e '-Dhbase.test' | cut -d ' ' -f 1 | xargs -n 1 jstack
   # Exit with error
   exit 1
 else
   echo "We're ok: there is no zombie test, but some tests took some time to stop"
 fi
else
  echo "We're ok: there is no zombie test"
fi
[Hadoop] $ /bin/bash -xe /tmp/hudson1225415327974369626.sh
+ pwd
<https://builds.apache.org/job/HBase-1.3/jdk=latest1.7,label=Hadoop/ws/>
+ ls
bin
CHANGES.txt
conf
dev-support
hbase-annotations
hbase-assembly
hbase-checkstyle
hbase-client
hbase-common
hbase-examples
hbase-external-blockcache
hbase-hadoop2-compat
hbase-hadoop-compat
hbase-it
hbase-native-client
hbase-prefix-tree
hbase-procedure
hbase-protocol
hbase-resource-bundle
hbase-rest
hbase-server
hbase-shaded
hbase-shell
hbase-testing-util
hbase-thrift
LICENSE.txt
NOTICE.txt
pom.xml
README.txt
src
target
++ jps -v
++ grep surefirebooter
++ grep -e -Dhbase.test
++ wc -l
+ ZOMBIE_TESTS_COUNT=0
+ [[ 0 != 0 ]]
+ echo 'We'\''re ok: there is no zombie test'
We're ok: there is no zombie test
POST BUILD TASK : SUCCESS
END OF POST BUILD TASK : 0
Archiving artifacts
Recording test results

Mime
View raw message