hbase-builds mailing list archives

Site index · List index
Message view « Date » · « Thread »
Top « Date » · « Thread »
From Stack <st...@duboce.net>
Subject Re: Build failed in Jenkins: HBase-Trunk_matrix » latest1.8,Hadoop #424
Date Mon, 02 Nov 2015 22:41:03 GMT
This should be fixed now.
St.Ack

On Mon, Nov 2, 2015 at 2:32 PM, Apache Jenkins Server <
jenkins@builds.apache.org> wrote:

> See <
> https://builds.apache.org/job/HBase-Trunk_matrix/jdk=latest1.8,label=Hadoop/424/changes
> >
>
> Changes:
>
> [stack] HBASE-13014 Java Tool For Region Moving
>
> ------------------------------------------
> [...truncated 614 lines...]
> [INFO] <
> https://builds.apache.org/job/HBase-Trunk_matrix/jdk=latest1.8,label=Hadoop/ws/hbase-prefix-tree/src/test/java/org/apache/hadoop/hbase/util/bytes/TestByteRange.java>:
> Recompile with -Xlint:deprecation for details.
> [INFO]
> [INFO] --- maven-surefire-plugin:2.18.1:test (default-test) @
> hbase-prefix-tree ---
> [INFO] Tests are skipped.
> [INFO]
> [INFO] --- maven-surefire-plugin:2.18.1:test (secondPartTestsExecution) @
> hbase-prefix-tree ---
> [INFO] Tests are skipped.
> [INFO]
> [INFO] --- maven-source-plugin:2.2.1:jar-no-fork (attach-sources) @
> hbase-prefix-tree ---
> [INFO] Building jar: <
> https://builds.apache.org/job/HBase-Trunk_matrix/jdk=latest1.8,label=Hadoop/ws/hbase-prefix-tree/target/hbase-prefix-tree-2.0.0-SNAPSHOT-sources.jar
> >
> [INFO]
> [INFO] --- maven-jar-plugin:2.4:test-jar (default) @ hbase-prefix-tree ---
> [INFO] Building jar: <
> https://builds.apache.org/job/HBase-Trunk_matrix/jdk=latest1.8,label=Hadoop/ws/hbase-prefix-tree/target/hbase-prefix-tree-2.0.0-SNAPSHOT-tests.jar
> >
> [INFO]
> [INFO] --- maven-jar-plugin:2.4:jar (default-jar) @ hbase-prefix-tree ---
> [INFO] Building jar: <
> https://builds.apache.org/job/HBase-Trunk_matrix/jdk=latest1.8,label=Hadoop/ws/hbase-prefix-tree/target/hbase-prefix-tree-2.0.0-SNAPSHOT.jar
> >
> [INFO]
> [INFO] --- findbugs-maven-plugin:3.0.0:findbugs (default-cli) @
> hbase-prefix-tree ---
> [INFO] Fork Value is true
>      [java] Warnings generated: 1
> [INFO] Done FindBugs Analysis....
> [INFO]
> [INFO]
> ------------------------------------------------------------------------
> [INFO] Building Apache HBase - Server 2.0.0-SNAPSHOT
> [INFO]
> ------------------------------------------------------------------------
> [INFO]
> [INFO] --- maven-clean-plugin:2.5:clean (default-clean) @ hbase-server ---
> [INFO]
> [INFO] --- maven-enforcer-plugin:1.0.1:enforce (enforce) @ hbase-server ---
> [INFO]
> [INFO] --- buildnumber-maven-plugin:1.3:create-timestamp (default) @
> hbase-server ---
> [INFO]
> [INFO] --- build-helper-maven-plugin:1.9.1:add-source
> (jspcSource-packageInfo-source) @ hbase-server ---
> [INFO] Source directory: <
> https://builds.apache.org/job/HBase-Trunk_matrix/jdk=latest1.8,label=Hadoop/ws/hbase-server/target/generated-jamon>
> added.
> [INFO] Source directory: <
> https://builds.apache.org/job/HBase-Trunk_matrix/jdk=latest1.8,label=Hadoop/ws/hbase-server/target/generated-sources/java>
> added.
> [INFO]
> [INFO] --- jamon-maven-plugin:2.4.1:translate (default) @ hbase-server ---
> [INFO] Translating 10 templates from <
> https://builds.apache.org/job/HBase-Trunk_matrix/jdk=latest1.8,label=Hadoop/ws/hbase-server/src/main/jamon>
> to <
> https://builds.apache.org/job/HBase-Trunk_matrix/jdk=latest1.8,label=Hadoop/ws/hbase-server/target/generated-jamon
> >
> [INFO]
> [INFO] --- maven-antrun-plugin:1.8:run (generate) @ hbase-server ---
> [INFO] Executing tasks
>
> main:
>     [mkdir] Created dir: <
> https://builds.apache.org/job/HBase-Trunk_matrix/jdk=latest1.8,label=Hadoop/ws/hbase-server/target/hbase-webapps
> >
>      [copy] Copying 20 files to <
> https://builds.apache.org/job/HBase-Trunk_matrix/jdk=latest1.8,label=Hadoop/ws/hbase-server/target/hbase-webapps
> >
> [INFO] Logging to org.slf4j.impl.SimpleLogger(org.mortbay.log) via
> org.mortbay.log.Slf4jLog
>     [mkdir] Created dir: <
> https://builds.apache.org/job/HBase-Trunk_matrix/jdk=latest1.8,label=Hadoop/ws/hbase-server/target/hbase-webapps/master/WEB-INF
> >
>     [mkdir] Created dir: <
> https://builds.apache.org/job/HBase-Trunk_matrix/jdk=latest1.8,label=Hadoop/ws/hbase-server/target/hbase-webapps/regionserver/WEB-INF
> >
> [INFO] Executed tasks
> [INFO]
> [INFO] --- maven-remote-resources-plugin:1.5:process (default) @
> hbase-server ---
> [INFO]
> [INFO] --- maven-resources-plugin:2.6:resources (default-resources) @
> hbase-server ---
> [INFO] Using 'UTF-8' encoding to copy filtered resources.
> [INFO] Copying 22 resources
> [INFO] Copying 2 resources
> [INFO]
> [INFO] --- maven-compiler-plugin:3.2:compile (default-compile) @
> hbase-server ---
> [INFO] Compiling 808 source files to <
> https://builds.apache.org/job/HBase-Trunk_matrix/jdk=latest1.8,label=Hadoop/ws/hbase-server/target/classes
> >
> [INFO] <
> https://builds.apache.org/job/HBase-Trunk_matrix/jdk=latest1.8,label=Hadoop/ws/hbase-server/src/main/java/org/apache/hadoop/hbase/wal/WALSplitter.java>:
> Some input files use or override a deprecated API.
> [INFO] <
> https://builds.apache.org/job/HBase-Trunk_matrix/jdk=latest1.8,label=Hadoop/ws/hbase-server/src/main/java/org/apache/hadoop/hbase/wal/WALSplitter.java>:
> Recompile with -Xlint:deprecation for details.
> [INFO] <
> https://builds.apache.org/job/HBase-Trunk_matrix/jdk=latest1.8,label=Hadoop/ws/hbase-server/src/main/java/org/apache/hadoop/hbase/coprocessor/CoprocessorHost.java>:
> Some input files use unchecked or unsafe operations.
> [INFO] <
> https://builds.apache.org/job/HBase-Trunk_matrix/jdk=latest1.8,label=Hadoop/ws/hbase-server/src/main/java/org/apache/hadoop/hbase/coprocessor/CoprocessorHost.java>:
> Recompile with -Xlint:unchecked for details.
> [INFO] Some messages have been simplified; recompile with -Xdiags:verbose
> to get full output
> [INFO] -------------------------------------------------------------
> [WARNING] COMPILATION WARNING :
> [INFO] -------------------------------------------------------------
> [WARNING] <
> https://builds.apache.org/job/HBase-Trunk_matrix/jdk=latest1.8,label=Hadoop/ws/hbase-server/src/main/java/org/apache/hadoop/hbase/regionserver/HRegionServer.java>:[190,16]
> sun.misc.Signal is internal proprietary API and may be removed in a future
> release
> [WARNING] <
> https://builds.apache.org/job/HBase-Trunk_matrix/jdk=latest1.8,label=Hadoop/ws/hbase-server/src/main/java/org/apache/hadoop/hbase/regionserver/HRegionServer.java>:[191,16]
> sun.misc.SignalHandler is internal proprietary API and may be removed in a
> future release
> [WARNING] <
> https://builds.apache.org/job/HBase-Trunk_matrix/jdk=latest1.8,label=Hadoop/ws/hbase-server/src/main/java/org/apache/hadoop/hbase/regionserver/HRegionServer.java>:[611,25]
> sun.misc.Signal is internal proprietary API and may be removed in a future
> release
> [WARNING] <
> https://builds.apache.org/job/HBase-Trunk_matrix/jdk=latest1.8,label=Hadoop/ws/hbase-server/src/main/java/org/apache/hadoop/hbase/regionserver/HRegionServer.java>:[611,44]
> sun.misc.SignalHandler is internal proprietary API and may be removed in a
> future release
> [WARNING] <
> https://builds.apache.org/job/HBase-Trunk_matrix/jdk=latest1.8,label=Hadoop/ws/hbase-server/src/main/java/org/apache/hadoop/hbase/regionserver/HRegionServer.java>:[612,28]
> sun.misc.Signal is internal proprietary API and may be removed in a future
> release
> [WARNING] <
> https://builds.apache.org/job/HBase-Trunk_matrix/jdk=latest1.8,label=Hadoop/ws/hbase-server/src/main/java/org/apache/hadoop/hbase/regionserver/HRegionServer.java>:[611,7]
> sun.misc.Signal is internal proprietary API and may be removed in a future
> release
> [INFO] 6 warnings
> [INFO] -------------------------------------------------------------
> [INFO] -------------------------------------------------------------
> [ERROR] COMPILATION ERROR :
> [INFO] -------------------------------------------------------------
> [ERROR] <
> https://builds.apache.org/job/HBase-Trunk_matrix/jdk=latest1.8,label=Hadoop/ws/hbase-server/src/main/java/org/apache/hadoop/hbase/util/RegionMover.java>:[50,38]
> cannot find symbol
>   symbol:   class HConnectionManager
>   location: package org.apache.hadoop.hbase.client
> [ERROR] <
> https://builds.apache.org/job/HBase-Trunk_matrix/jdk=latest1.8,label=Hadoop/ws/hbase-server/src/main/java/org/apache/hadoop/hbase/util/RegionMover.java>:[57,41]
> cannot find symbol
>   symbol:   class MetaRegionTracker
>   location: package org.apache.hadoop.hbase.zookeeper
> [ERROR] <
> https://builds.apache.org/job/HBase-Trunk_matrix/jdk=latest1.8,label=Hadoop/ws/hbase-server/src/main/java/org/apache/hadoop/hbase/util/RegionMover.java>:[365,42]
> cannot find symbol
>   symbol:   method currentTimeMillis()
>   location: class org.apache.hadoop.hbase.util.EnvironmentEdgeManager
> [ERROR] <
> https://builds.apache.org/job/HBase-Trunk_matrix/jdk=latest1.8,label=Hadoop/ws/hbase-server/src/main/java/org/apache/hadoop/hbase/util/RegionMover.java>:[366,35]
> cannot find symbol
>   symbol:   method currentTimeMillis()
>   location: class org.apache.hadoop.hbase.util.EnvironmentEdgeManager
> [ERROR] <
> https://builds.apache.org/job/HBase-Trunk_matrix/jdk=latest1.8,label=Hadoop/ws/hbase-server/src/main/java/org/apache/hadoop/hbase/util/RegionMover.java>:[553,46]
> cannot find symbol
>   symbol:   method currentTimeMillis()
>   location: class org.apache.hadoop.hbase.util.EnvironmentEdgeManager
> [ERROR] <
> https://builds.apache.org/job/HBase-Trunk_matrix/jdk=latest1.8,label=Hadoop/ws/hbase-server/src/main/java/org/apache/hadoop/hbase/util/RegionMover.java>:[566,38]
> cannot find symbol
>   symbol:   method currentTimeMillis()
>   location: class org.apache.hadoop.hbase.util.EnvironmentEdgeManager
> [ERROR] <
> https://builds.apache.org/job/HBase-Trunk_matrix/jdk=latest1.8,label=Hadoop/ws/hbase-server/src/main/java/org/apache/hadoop/hbase/util/RegionMover.java>:[583,46]
> cannot find symbol
>   symbol:   method currentTimeMillis()
>   location: class org.apache.hadoop.hbase.util.EnvironmentEdgeManager
> [ERROR] <
> https://builds.apache.org/job/HBase-Trunk_matrix/jdk=latest1.8,label=Hadoop/ws/hbase-server/src/main/java/org/apache/hadoop/hbase/util/RegionMover.java>:[668,24]
> cannot find symbol
>   symbol:   variable HConnectionManager
>   location: class org.apache.hadoop.hbase.util.RegionMover
> [ERROR] <
> https://builds.apache.org/job/HBase-Trunk_matrix/jdk=latest1.8,label=Hadoop/ws/hbase-server/src/main/java/org/apache/hadoop/hbase/util/RegionMover.java>:[831,48]
> incompatible types: org.apache.hadoop.conf.Configuration cannot be
> converted to org.apache.hadoop.hbase.client.ClusterConnection
> [ERROR] <
> https://builds.apache.org/job/HBase-Trunk_matrix/jdk=latest1.8,label=Hadoop/ws/hbase-server/src/main/java/org/apache/hadoop/hbase/util/RegionMover.java>:[879,7]
> cannot find symbol
>   symbol:   class MetaRegionTracker
>   location: class org.apache.hadoop.hbase.util.RegionMover
> [ERROR] <
> https://builds.apache.org/job/HBase-Trunk_matrix/jdk=latest1.8,label=Hadoop/ws/hbase-server/src/main/java/org/apache/hadoop/hbase/util/RegionMover.java>:[879,39]
> cannot find symbol
>   symbol:   class MetaRegionTracker
>   location: class org.apache.hadoop.hbase.util.RegionMover
> [ERROR] <
> https://builds.apache.org/job/HBase-Trunk_matrix/jdk=latest1.8,label=Hadoop/ws/hbase-server/src/main/java/org/apache/hadoop/hbase/util/RegionMover.java>:[897,50]
> incompatible types: org.apache.hadoop.conf.Configuration cannot be
> converted to org.apache.hadoop.hbase.client.ClusterConnection
> [INFO] 12 errors
> [INFO] -------------------------------------------------------------
> [INFO]
> ------------------------------------------------------------------------
> [INFO] Reactor Summary:
> [INFO]
> [INFO] Apache HBase ...................................... SUCCESS [
> 2.570 s]
> [INFO] Apache HBase - Checkstyle ......................... SUCCESS [
> 0.517 s]
> [INFO] Apache HBase - Resource Bundle .................... SUCCESS [
> 0.230 s]
> [INFO] Apache HBase - Annotations ........................ SUCCESS [
> 6.423 s]
> [INFO] Apache HBase - Protocol ........................... SUCCESS [01:27
> min]
> [INFO] Apache HBase - Common ............................. SUCCESS [
> 25.232 s]
> [INFO] Apache HBase - Procedure .......................... SUCCESS [
> 10.151 s]
> [INFO] Apache HBase - Client ............................. SUCCESS [
> 44.425 s]
> [INFO] Apache HBase - Hadoop Compatibility ............... SUCCESS [
> 4.353 s]
> [INFO] Apache HBase - Hadoop Two Compatibility ........... SUCCESS [
> 8.133 s]
> [INFO] Apache HBase - Prefix Tree ........................ SUCCESS [
> 8.684 s]
> [INFO] Apache HBase - Server ............................. FAILURE [
> 6.942 s]
> [INFO] Apache HBase - Testing Util ....................... SKIPPED
> [INFO] Apache HBase - Thrift ............................. SKIPPED
> [INFO] Apache HBase - Shell .............................. SKIPPED
> [INFO] Apache HBase - Integration Tests .................. SKIPPED
> [INFO] Apache HBase - Examples ........................... SKIPPED
> [INFO] Apache HBase - Rest ............................... SKIPPED
> [INFO] Apache HBase - External Block Cache ............... SKIPPED
> [INFO] Apache HBase - Assembly ........................... SKIPPED
> [INFO] Apache HBase - Shaded ............................. SKIPPED
> [INFO] Apache HBase - Shaded - Client .................... SKIPPED
> [INFO] Apache HBase - Shaded - Server .................... SKIPPED
> [INFO] Apache HBase - Spark .............................. SKIPPED
> [INFO]
> ------------------------------------------------------------------------
> [INFO] BUILD FAILURE
> [INFO]
> ------------------------------------------------------------------------
> [INFO] Total time: 03:26 min
> [INFO] Finished at: 2015-11-02T22:32:26+00:00
> [INFO] Final Memory: 125M/2320M
> [INFO]
> ------------------------------------------------------------------------
> [ERROR] Failed to execute goal
> org.apache.maven.plugins:maven-compiler-plugin:3.2:compile
> (default-compile) on project hbase-server: Compilation failure: Compilation
> failure:
> [ERROR] <
> https://builds.apache.org/job/HBase-Trunk_matrix/jdk=latest1.8,label=Hadoop/ws/hbase-server/src/main/java/org/apache/hadoop/hbase/util/RegionMover.java>:[50,38]
> cannot find symbol
> [ERROR] symbol:   class HConnectionManager
> [ERROR] location: package org.apache.hadoop.hbase.client
> [ERROR] <
> https://builds.apache.org/job/HBase-Trunk_matrix/jdk=latest1.8,label=Hadoop/ws/hbase-server/src/main/java/org/apache/hadoop/hbase/util/RegionMover.java>:[57,41]
> cannot find symbol
> [ERROR] symbol:   class MetaRegionTracker
> [ERROR] location: package org.apache.hadoop.hbase.zookeeper
> [ERROR] <
> https://builds.apache.org/job/HBase-Trunk_matrix/jdk=latest1.8,label=Hadoop/ws/hbase-server/src/main/java/org/apache/hadoop/hbase/util/RegionMover.java>:[365,42]
> cannot find symbol
> [ERROR] symbol:   method currentTimeMillis()
> [ERROR] location: class org.apache.hadoop.hbase.util.EnvironmentEdgeManager
> [ERROR] <
> https://builds.apache.org/job/HBase-Trunk_matrix/jdk=latest1.8,label=Hadoop/ws/hbase-server/src/main/java/org/apache/hadoop/hbase/util/RegionMover.java>:[366,35]
> cannot find symbol
> [ERROR] symbol:   method currentTimeMillis()
> [ERROR] location: class org.apache.hadoop.hbase.util.EnvironmentEdgeManager
> [ERROR] <
> https://builds.apache.org/job/HBase-Trunk_matrix/jdk=latest1.8,label=Hadoop/ws/hbase-server/src/main/java/org/apache/hadoop/hbase/util/RegionMover.java>:[553,46]
> cannot find symbol
> [ERROR] symbol:   method currentTimeMillis()
> [ERROR] location: class org.apache.hadoop.hbase.util.EnvironmentEdgeManager
> [ERROR] <
> https://builds.apache.org/job/HBase-Trunk_matrix/jdk=latest1.8,label=Hadoop/ws/hbase-server/src/main/java/org/apache/hadoop/hbase/util/RegionMover.java>:[566,38]
> cannot find symbol
> [ERROR] symbol:   method currentTimeMillis()
> [ERROR] location: class org.apache.hadoop.hbase.util.EnvironmentEdgeManager
> [ERROR] <
> https://builds.apache.org/job/HBase-Trunk_matrix/jdk=latest1.8,label=Hadoop/ws/hbase-server/src/main/java/org/apache/hadoop/hbase/util/RegionMover.java>:[583,46]
> cannot find symbol
> [ERROR] symbol:   method currentTimeMillis()
> [ERROR] location: class org.apache.hadoop.hbase.util.EnvironmentEdgeManager
> [ERROR] <
> https://builds.apache.org/job/HBase-Trunk_matrix/jdk=latest1.8,label=Hadoop/ws/hbase-server/src/main/java/org/apache/hadoop/hbase/util/RegionMover.java>:[668,24]
> cannot find symbol
> [ERROR] symbol:   variable HConnectionManager
> [ERROR] location: class org.apache.hadoop.hbase.util.RegionMover
> [ERROR] <
> https://builds.apache.org/job/HBase-Trunk_matrix/jdk=latest1.8,label=Hadoop/ws/hbase-server/src/main/java/org/apache/hadoop/hbase/util/RegionMover.java>:[831,48]
> incompatible types: org.apache.hadoop.conf.Configuration cannot be
> converted to org.apache.hadoop.hbase.client.ClusterConnection
> [ERROR] <
> https://builds.apache.org/job/HBase-Trunk_matrix/jdk=latest1.8,label=Hadoop/ws/hbase-server/src/main/java/org/apache/hadoop/hbase/util/RegionMover.java>:[879,7]
> cannot find symbol
> [ERROR] symbol:   class MetaRegionTracker
> [ERROR] location: class org.apache.hadoop.hbase.util.RegionMover
> [ERROR] <
> https://builds.apache.org/job/HBase-Trunk_matrix/jdk=latest1.8,label=Hadoop/ws/hbase-server/src/main/java/org/apache/hadoop/hbase/util/RegionMover.java>:[879,39]
> cannot find symbol
> [ERROR] symbol:   class MetaRegionTracker
> [ERROR] location: class org.apache.hadoop.hbase.util.RegionMover
> [ERROR] <
> https://builds.apache.org/job/HBase-Trunk_matrix/jdk=latest1.8,label=Hadoop/ws/hbase-server/src/main/java/org/apache/hadoop/hbase/util/RegionMover.java>:[897,50]
> incompatible types: org.apache.hadoop.conf.Configuration cannot be
> converted to org.apache.hadoop.hbase.client.ClusterConnection
> [ERROR] -> [Help 1]
> [ERROR]
> [ERROR] To see the full stack trace of the errors, re-run Maven with the
> -e switch.
> [ERROR] Re-run Maven using the -X switch to enable full debug logging.
> [ERROR]
> [ERROR] For more information about the errors and possible solutions,
> please read the following articles:
> [ERROR] [Help 1]
> http://cwiki.apache.org/confluence/display/MAVEN/MojoFailureException
> [ERROR]
> [ERROR] After correcting the problems, you can resume the build with the
> command
> [ERROR]   mvn <goals> -rf :hbase-server
> Build step 'Invoke top-level Maven targets' marked build as failure
> Performing Post build task...
> Match found for :.* : True
> Logical operation result is TRUE
> Running script  :   ZOMBIE_TESTS_COUNT=`jps | grep surefirebooter | wc -l`
>   if [[ $ZOMBIE_TESTS_COUNT != 0 ]] ; then
>     #It seems sometimes the tests are not dying immediately. Let's give
> them 10s
>     echo "Suspicious java process found - waiting 10s to see if there are
> just slow to stop"
>     sleep 10
>     ZOMBIE_TESTS_COUNT=`jps | grep surefirebooter | wc -l`
>     if [[ $ZOMBIE_TESTS_COUNT != 0 ]] ; then
>       echo "There are $ZOMBIE_TESTS_COUNT zombie tests, they should have
> been killed by surefire but survived"
>       echo "************ BEGIN zombies jstack extract"
>       ZB_STACK=`jps | grep surefirebooter | cut -d ' ' -f 1 | xargs -n 1
> jstack | grep ".test" | grep "\.java"`
>       jps | grep surefirebooter | cut -d ' ' -f 1 | xargs -n 1 jstack
>       echo "************ END  zombies jstack extract"
>       JIRA_COMMENT="$JIRA_COMMENT
>
>      {color:red}-1 core zombie tests{color}.  There are
> ${ZOMBIE_TESTS_COUNT} zombie test(s): ${ZB_STACK}"
>       BAD=1
>       jps | grep surefirebooter | cut -d ' ' -f 1 | xargs kill -9
>     else
>       echo "We're ok: there is no zombie test, but some tests took some
> time to stop"
>     fi
>   else
>     echo "We're ok: there is no zombie test"
>   fi
> [Hadoop] $ /bin/bash -xe /tmp/hudson4404440567128713132.sh
> ++ jps
> ++ wc -l
> ++ grep surefirebooter
> + ZOMBIE_TESTS_COUNT=1
> + [[ 1 != 0 ]]
> + echo 'Suspicious java process found - waiting 10s to see if there are
> just slow to stop'
> Suspicious java process found - waiting 10s to see if there are just slow
> to stop
> + sleep 10
> ++ jps
> ++ grep surefirebooter
> ++ wc -l
> + ZOMBIE_TESTS_COUNT=1
> + [[ 1 != 0 ]]
> + echo 'There are 1 zombie tests, they should have been killed by surefire
> but survived'
> There are 1 zombie tests, they should have been killed by surefire but
> survived
> + echo '************ BEGIN zombies jstack extract'
> ************ BEGIN zombies jstack extract
> ++ jps
> ++ grep surefirebooter
> ++ cut -d ' ' -f 1
> ++ xargs -n 1 jstack
> ++ grep '\.java'
> ++ grep .test
> + ZB_STACK=
> POST BUILD TASK : FAILURE
> END OF POST BUILD TASK : 0
> Archiving artifacts
> Compressed 2.08 MB of artifacts by 28.6% relative to #407
> Recording test results
> ERROR: Publisher 'Publish JUnit test result report' failed: No test report
> files were found. Configuration error?
> [FINDBUGS] Skipping publisher since build result is FAILURE
> [CHECKSTYLE] Skipping publisher since build result is FAILURE
>

Mime
  • Unnamed multipart/alternative (inline, None, 0 bytes)
View raw message