hbase-builds mailing list archives

Site index · List index
Message view « Date » · « Thread »
Top « Date » · « Thread »
From Stack <st...@duboce.net>
Subject Re: Build failed in Jenkins: HBase-Trunk_matrix » latest1.8,Hadoop #502
Date Thu, 26 Nov 2015 01:33:32 GMT
This failed with following:

FATAL: command execution failedjava.io.IOException
<http://stacktrace.jenkins-ci.org/search?query=java.io.IOException>:
Cannot run program "/bin/bash" (in directory
"/home/jenkins/jenkins-slave/workspace/HBase-Trunk_matrix/jdk/latest1.8/label/Hadoop"):
error=2, No such file or directory


Let me try it again.


St.Ack


On Wed, Nov 25, 2015 at 3:13 PM, Apache Jenkins Server <
jenkins@builds.apache.org> wrote:

> See <
> https://builds.apache.org/job/HBase-Trunk_matrix/jdk=latest1.8,label=Hadoop/502/changes
> >
>
> Changes:
>
> [stack] HBASE-14859 Better checkstyle reporting. Reports file names, error
> names
>
> ------------------------------------------
> [...truncated 966 lines...]
> [INFO] <
> https://builds.apache.org/job/HBase-Trunk_matrix/jdk=latest1.8,label=Hadoop/ws/hbase-it/src/test/java/org/apache/hadoop/hbase/chaos/factories/MonkeyFactory.java>:
> Some input files use unchecked or unsafe operations.
> [INFO] <
> https://builds.apache.org/job/HBase-Trunk_matrix/jdk=latest1.8,label=Hadoop/ws/hbase-it/src/test/java/org/apache/hadoop/hbase/chaos/factories/MonkeyFactory.java>:
> Recompile with -Xlint:unchecked for details.
> [INFO]
> [INFO] --- maven-surefire-plugin:2.18.1:test (default-test) @ hbase-it ---
> [INFO] Tests are skipped.
> [INFO]
> [INFO] --- maven-surefire-plugin:2.18.1:test (secondPartTestsExecution) @
> hbase-it ---
> [INFO] Tests are skipped.
> [INFO]
> [INFO] --- maven-jar-plugin:2.4:test-jar (default) @ hbase-it ---
> [INFO] Building jar: <
> https://builds.apache.org/job/HBase-Trunk_matrix/jdk=latest1.8,label=Hadoop/ws/hbase-it/target/hbase-it-2.0.0-SNAPSHOT-tests.jar
> >
> [INFO]
> [INFO] --- maven-jar-plugin:2.4:jar (default-jar) @ hbase-it ---
> [INFO] Building jar: <
> https://builds.apache.org/job/HBase-Trunk_matrix/jdk=latest1.8,label=Hadoop/ws/hbase-it/target/hbase-it-2.0.0-SNAPSHOT.jar
> >
> [INFO]
> [INFO] --- findbugs-maven-plugin:3.0.0:findbugs (default-cli) @ hbase-it
> ---
> [INFO]
> [INFO]
> ------------------------------------------------------------------------
> [INFO] Building Apache HBase - Examples 2.0.0-SNAPSHOT
> [INFO]
> ------------------------------------------------------------------------
> [INFO]
> [INFO] --- maven-clean-plugin:2.5:clean (default-clean) @ hbase-examples
> ---
> [INFO]
> [INFO] --- maven-enforcer-plugin:1.0.1:enforce (enforce) @ hbase-examples
> ---
> [INFO]
> [INFO] --- buildnumber-maven-plugin:1.3:create-timestamp (default) @
> hbase-examples ---
> [INFO]
> [INFO] --- maven-remote-resources-plugin:1.5:process (default) @
> hbase-examples ---
> [INFO]
> [INFO] --- maven-resources-plugin:2.6:resources (default-resources) @
> hbase-examples ---
> [INFO] Using 'UTF-8' encoding to copy filtered resources.
> [INFO] skip non existing resourceDirectory <
> https://builds.apache.org/job/HBase-Trunk_matrix/jdk=latest1.8,label=Hadoop/ws/hbase-examples/src/main/resources
> >
> [INFO] Copying 3 resources
> [INFO]
> [INFO] --- maven-compiler-plugin:3.2:compile (default-compile) @
> hbase-examples ---
> [INFO] Compiling 13 source files to <
> https://builds.apache.org/job/HBase-Trunk_matrix/jdk=latest1.8,label=Hadoop/ws/hbase-examples/target/classes
> >
> [INFO] <
> https://builds.apache.org/job/HBase-Trunk_matrix/jdk=latest1.8,label=Hadoop/ws/hbase-examples/src/main/java/org/apache/hadoop/hbase/mapreduce/SampleUploader.java>:
> Some input files use or override a deprecated API.
> [INFO] <
> https://builds.apache.org/job/HBase-Trunk_matrix/jdk=latest1.8,label=Hadoop/ws/hbase-examples/src/main/java/org/apache/hadoop/hbase/mapreduce/SampleUploader.java>:
> Recompile with -Xlint:deprecation for details.
> [INFO]
> [INFO] --- maven-dependency-plugin:2.8:build-classpath
> (create-mrapp-generated-classpath) @ hbase-examples ---
> [INFO] Wrote classpath file '<
> https://builds.apache.org/job/HBase-Trunk_matrix/jdk=latest1.8,label=Hadoop/ws/hbase-examples/target/test-classes/mrapp-generated-classpath'
> .>
> [INFO]
> [INFO] --- maven-resources-plugin:2.6:testResources
> (default-testResources) @ hbase-examples ---
> [INFO] Using 'UTF-8' encoding to copy filtered resources.
> [INFO] Copying 1 resource
> [INFO] Copying 3 resources
> [INFO]
> [INFO] --- maven-compiler-plugin:3.2:testCompile (default-testCompile) @
> hbase-examples ---
> [INFO] Compiling 5 source files to <
> https://builds.apache.org/job/HBase-Trunk_matrix/jdk=latest1.8,label=Hadoop/ws/hbase-examples/target/test-classes
> >
> [INFO] <
> https://builds.apache.org/job/HBase-Trunk_matrix/jdk=latest1.8,label=Hadoop/ws/hbase-examples/src/test/java/org/apache/hadoop/hbase/coprocessor/example/TestRowCountEndpoint.java>:
> <
> https://builds.apache.org/job/HBase-Trunk_matrix/jdk=latest1.8,label=Hadoop/ws/hbase-examples/src/test/java/org/apache/hadoop/hbase/coprocessor/example/TestRowCountEndpoint.java>
> uses or overrides a deprecated API.
> [INFO] <
> https://builds.apache.org/job/HBase-Trunk_matrix/jdk=latest1.8,label=Hadoop/ws/hbase-examples/src/test/java/org/apache/hadoop/hbase/coprocessor/example/TestRowCountEndpoint.java>:
> Recompile with -Xlint:deprecation for details.
> [INFO]
> [INFO] --- maven-surefire-plugin:2.18.1:test (default-test) @
> hbase-examples ---
> [INFO] Tests are skipped.
> [INFO]
> [INFO] --- maven-surefire-plugin:2.18.1:test (secondPartTestsExecution) @
> hbase-examples ---
> [INFO] Tests are skipped.
> [INFO]
> [INFO] --- maven-source-plugin:2.2.1:jar-no-fork (attach-sources) @
> hbase-examples ---
> [INFO] Building jar: <
> https://builds.apache.org/job/HBase-Trunk_matrix/jdk=latest1.8,label=Hadoop/ws/hbase-examples/target/hbase-examples-2.0.0-SNAPSHOT-sources.jar
> >
> [INFO]
> [INFO] --- maven-jar-plugin:2.4:test-jar (default) @ hbase-examples ---
> [INFO] Building jar: <
> https://builds.apache.org/job/HBase-Trunk_matrix/jdk=latest1.8,label=Hadoop/ws/hbase-examples/target/hbase-examples-2.0.0-SNAPSHOT-tests.jar
> >
> [INFO]
> [INFO] --- maven-jar-plugin:2.4:jar (default-jar) @ hbase-examples ---
> [INFO] Building jar: <
> https://builds.apache.org/job/HBase-Trunk_matrix/jdk=latest1.8,label=Hadoop/ws/hbase-examples/target/hbase-examples-2.0.0-SNAPSHOT.jar
> >
> [INFO]
> [INFO] --- findbugs-maven-plugin:3.0.0:findbugs (default-cli) @
> hbase-examples ---
> [INFO] Fork Value is true
>      [java] Couldn't open <
> https://builds.apache.org/job/HBase-Trunk_matrix/jdk=latest1.8,label=Hadoop/502/artifact/hbase-examples/target/findbugsTemp.xml>
> for output: java.io.FileNotFoundException: <
> https://builds.apache.org/job/HBase-Trunk_matrix/jdk=latest1.8,label=Hadoop/502/artifact/hbase-examples/target/findbugsTemp.xml>
> (No such file or directory)
> [INFO]
> ------------------------------------------------------------------------
> [INFO] Reactor Summary:
> [INFO]
> [INFO] Apache HBase ...................................... SUCCESS [
> 7.825 s]
> [INFO] Apache HBase - Checkstyle ......................... SUCCESS [
> 2.015 s]
> [INFO] Apache HBase - Resource Bundle .................... SUCCESS [
> 0.501 s]
> [INFO] Apache HBase - Annotations ........................ SUCCESS [
> 19.732 s]
> [INFO] Apache HBase - Protocol ........................... SUCCESS [03:20
> min]
> [INFO] Apache HBase - Common ............................. SUCCESS [01:10
> min]
> [INFO] Apache HBase - Procedure .......................... SUCCESS [
> 31.520 s]
> [INFO] Apache HBase - Client ............................. SUCCESS [01:40
> min]
> [INFO] Apache HBase - Hadoop Compatibility ............... SUCCESS [
> 13.809 s]
> [INFO] Apache HBase - Hadoop Two Compatibility ........... SUCCESS [
> 24.099 s]
> [INFO] Apache HBase - Prefix Tree ........................ SUCCESS [
> 25.246 s]
> [INFO] Apache HBase - Server ............................. SUCCESS [04:14
> min]
> [INFO] Apache HBase - Testing Util ....................... SUCCESS [
> 4.343 s]
> [INFO] Apache HBase - Thrift ............................. SUCCESS [02:02
> min]
> [INFO] Apache HBase - Shell .............................. SUCCESS [
> 3.609 s]
> [INFO] Apache HBase - Integration Tests .................. SUCCESS [
> 6.974 s]
> [INFO] Apache HBase - Examples ........................... FAILURE [
> 10.322 s]
> [INFO] Apache HBase - Rest ............................... SKIPPED
> [INFO] Apache HBase - External Block Cache ............... SKIPPED
> [INFO] Apache HBase - Assembly ........................... SKIPPED
> [INFO] Apache HBase - Shaded ............................. SKIPPED
> [INFO] Apache HBase - Shaded - Client .................... SKIPPED
> [INFO] Apache HBase - Shaded - Server .................... SKIPPED
> [INFO] Apache HBase - Spark .............................. SKIPPED
> [INFO]
> ------------------------------------------------------------------------
> [INFO] BUILD FAILURE
> [INFO]
> ------------------------------------------------------------------------
> [INFO] Total time: 15:03 min
> [INFO] Finished at: 2015-11-25T23:13:45+00:00
> [INFO] Final Memory: 174M/2113M
> [INFO]
> ------------------------------------------------------------------------
> [ERROR] Failed to execute goal
> org.codehaus.mojo:findbugs-maven-plugin:3.0.0:findbugs (default-cli) on
> project hbase-examples: Execution default-cli of goal
> org.codehaus.mojo:findbugs-maven-plugin:3.0.0:findbugs failed: Java
> returned: 1 -> [Help 1]
> [ERROR]
> [ERROR] To see the full stack trace of the errors, re-run Maven with the
> -e switch.
> [ERROR] Re-run Maven using the -X switch to enable full debug logging.
> [ERROR]
> [ERROR] For more information about the errors and possible solutions,
> please read the following articles:
> [ERROR] [Help 1]
> http://cwiki.apache.org/confluence/display/MAVEN/PluginExecutionException
> [ERROR]
> [ERROR] After correcting the problems, you can resume the build with the
> command
> [ERROR]   mvn <goals> -rf :hbase-examples
> Build step 'Invoke top-level Maven targets' marked build as failure
> Performing Post build task...
> Match found for :.* : True
> Logical operation result is TRUE
> Running script  : # Run zombie detector script
> ./dev-support/zombie-detector.sh --jenkins ${BUILD_ID}
> [Hadoop] $ /bin/bash -xe /tmp/hudson8795692575708292152.sh
> FATAL: command execution failed
> java.io.IOException: Cannot run program "/bin/bash" (in directory "<
> https://builds.apache.org/job/HBase-Trunk_matrix/jdk=latest1.8,label=Hadoop/ws/")>:
> error=2, No such file or directory
>         at java.lang.ProcessBuilder.start(ProcessBuilder.java:1047)
>         at hudson.Proc$LocalProc.<init>(Proc.java:244)
>         at hudson.Proc$LocalProc.<init>(Proc.java:216)
>         at hudson.Launcher$LocalLauncher.launch(Launcher.java:803)
>         at hudson.Launcher$ProcStarter.start(Launcher.java:381)
>         at hudson.Launcher$RemoteLaunchCallable.call(Launcher.java:1136)
>         at hudson.Launcher$RemoteLaunchCallable.call(Launcher.java:1101)
>         at hudson.remoting.UserRequest.perform(UserRequest.java:121)
>         at hudson.remoting.UserRequest.perform(UserRequest.java:49)
>         at hudson.remoting.Request$2.run(Request.java:326)
>         at
> hudson.remoting.InterceptingExecutorService$1.call(InterceptingExecutorService.java:68)
>         at java.util.concurrent.FutureTask.run(FutureTask.java:262)
>         at
> java.util.concurrent.ThreadPoolExecutor.runWorker(ThreadPoolExecutor.java:1145)
>         at
> java.util.concurrent.ThreadPoolExecutor$Worker.run(ThreadPoolExecutor.java:615)
>         at java.lang.Thread.run(Thread.java:745)
>         at ......remote call to H7(Native Method)
>         at
> hudson.remoting.Channel.attachCallSiteStackTrace(Channel.java:1413)
>         at hudson.remoting.UserResponse.retrieve(UserRequest.java:221)
>         at hudson.remoting.Channel.call(Channel.java:778)
>         at hudson.Launcher$RemoteLauncher.launch(Launcher.java:916)
>         at hudson.Launcher$ProcStarter.start(Launcher.java:381)
>         at
> hudson.tasks.CommandInterpreter.perform(CommandInterpreter.java:97)
>         at
> hudson.tasks.CommandInterpreter.perform(CommandInterpreter.java:66)
>         at
> hudson.plugins.postbuildtask.PostbuildTask.perform(PostbuildTask.java:123)
>         at
> hudson.tasks.BuildStepMonitor$1.perform(BuildStepMonitor.java:20)
>         at
> hudson.model.AbstractBuild$AbstractBuildExecution.perform(AbstractBuild.java:776)
>         at
> hudson.model.AbstractBuild$AbstractBuildExecution.performAllBuildSteps(AbstractBuild.java:723)
>         at hudson.model.Build$BuildExecution.post2(Build.java:183)
>         at
> hudson.model.AbstractBuild$AbstractBuildExecution.post(AbstractBuild.java:670)
>         at hudson.model.Run.execute(Run.java:1763)
>         at hudson.matrix.MatrixRun.run(MatrixRun.java:146)
>         at
> hudson.model.ResourceController.execute(ResourceController.java:98)
>         at hudson.model.Executor.run(Executor.java:381)
> Caused by: java.io.IOException: error=2, No such file or directory
>         at java.lang.UNIXProcess.forkAndExec(Native Method)
>         at java.lang.UNIXProcess.<init>(UNIXProcess.java:186)
>         at java.lang.ProcessImpl.start(ProcessImpl.java:130)
>         at java.lang.ProcessBuilder.start(ProcessBuilder.java:1028)
>         at hudson.Proc$LocalProc.<init>(Proc.java:244)
>         at hudson.Proc$LocalProc.<init>(Proc.java:216)
>         at hudson.Launcher$LocalLauncher.launch(Launcher.java:803)
>         at hudson.Launcher$ProcStarter.start(Launcher.java:381)
>         at hudson.Launcher$RemoteLaunchCallable.call(Launcher.java:1136)
>         at hudson.Launcher$RemoteLaunchCallable.call(Launcher.java:1101)
>         at hudson.remoting.UserRequest.perform(UserRequest.java:121)
>         at hudson.remoting.UserRequest.perform(UserRequest.java:49)
>         at hudson.remoting.Request$2.run(Request.java:326)
>         at
> hudson.remoting.InterceptingExecutorService$1.call(InterceptingExecutorService.java:68)
>         at java.util.concurrent.FutureTask.run(FutureTask.java:262)
>         at
> java.util.concurrent.ThreadPoolExecutor.runWorker(ThreadPoolExecutor.java:1145)
>         at
> java.util.concurrent.ThreadPoolExecutor$Worker.run(ThreadPoolExecutor.java:615)
>         at java.lang.Thread.run(Thread.java:745)
> POST BUILD TASK : FAILURE
> END OF POST BUILD TASK : 0
> Archiving artifacts
> ERROR: Build step failed with exception
> <
> https://builds.apache.org/job/HBase-Trunk_matrix/jdk=latest1.8,label=Hadoop/ws/>
> does not exist.
>         at
> org.apache.tools.ant.types.AbstractFileSet.getDirectoryScanner(AbstractFileSet.java:483)
>         at
> org.apache.tools.ant.types.AbstractFileSet.getDirectoryScanner(AbstractFileSet.java:460)
>         at
> hudson.tasks.ArtifactArchiver$ListFiles.invoke(ArtifactArchiver.java:268)
>         at
> hudson.tasks.ArtifactArchiver$ListFiles.invoke(ArtifactArchiver.java:252)
>         at hudson.FilePath$FileCallableWrapper.call(FilePath.java:2688)
>         at hudson.remoting.UserRequest.perform(UserRequest.java:121)
>         at hudson.remoting.UserRequest.perform(UserRequest.java:49)
>         at hudson.remoting.Request$2.run(Request.java:326)
>         at
> hudson.remoting.InterceptingExecutorService$1.call(InterceptingExecutorService.java:68)
>         at java.util.concurrent.FutureTask.run(FutureTask.java:262)
>         at
> java.util.concurrent.ThreadPoolExecutor.runWorker(ThreadPoolExecutor.java:1145)
>         at
> java.util.concurrent.ThreadPoolExecutor$Worker.run(ThreadPoolExecutor.java:615)
>         at java.lang.Thread.run(Thread.java:745)
>         at ......remote call to H7(Native Method)
>         at
> hudson.remoting.Channel.attachCallSiteStackTrace(Channel.java:1413)
>         at hudson.remoting.UserResponse.retrieve(UserRequest.java:221)
>         at hudson.remoting.Channel.call(Channel.java:778)
>         at hudson.FilePath.act(FilePath.java:978)
>         at hudson.FilePath.act(FilePath.java:967)
>         at hudson.tasks.ArtifactArchiver.perform(ArtifactArchiver.java:217)
>         at
> hudson.tasks.BuildStepCompatibilityLayer.perform(BuildStepCompatibilityLayer.java:74)
>         at
> hudson.tasks.BuildStepMonitor$1.perform(BuildStepMonitor.java:20)
>         at
> hudson.model.AbstractBuild$AbstractBuildExecution.perform(AbstractBuild.java:776)
>         at
> hudson.model.AbstractBuild$AbstractBuildExecution.performAllBuildSteps(AbstractBuild.java:723)
>         at hudson.model.Build$BuildExecution.post2(Build.java:183)
>         at
> hudson.model.AbstractBuild$AbstractBuildExecution.post(AbstractBuild.java:670)
>         at hudson.model.Run.execute(Run.java:1763)
>         at hudson.matrix.MatrixRun.run(MatrixRun.java:146)
>         at
> hudson.model.ResourceController.execute(ResourceController.java:98)
>         at hudson.model.Executor.run(Executor.java:381)
> Build step 'Archive the artifacts' marked build as failure
> Recording test results
> ERROR: Build step failed with exception
> <
> https://builds.apache.org/job/HBase-Trunk_matrix/jdk=latest1.8,label=Hadoop/ws/>
> does not exist.
>         at
> org.apache.tools.ant.types.AbstractFileSet.getDirectoryScanner(AbstractFileSet.java:483)
>         at
> org.apache.tools.ant.types.AbstractFileSet.getDirectoryScanner(AbstractFileSet.java:460)
>         at
> hudson.tasks.junit.JUnitParser$ParseResultCallable.invoke(JUnitParser.java:110)
>         at
> hudson.tasks.junit.JUnitParser$ParseResultCallable.invoke(JUnitParser.java:93)
>         at hudson.FilePath$FileCallableWrapper.call(FilePath.java:2688)
>         at hudson.remoting.UserRequest.perform(UserRequest.java:121)
>         at hudson.remoting.UserRequest.perform(UserRequest.java:49)
>         at hudson.remoting.Request$2.run(Request.java:326)
>         at
> hudson.remoting.InterceptingExecutorService$1.call(InterceptingExecutorService.java:68)
>         at java.util.concurrent.FutureTask.run(FutureTask.java:262)
>         at
> java.util.concurrent.ThreadPoolExecutor.runWorker(ThreadPoolExecutor.java:1145)
>         at
> java.util.concurrent.ThreadPoolExecutor$Worker.run(ThreadPoolExecutor.java:615)
>         at java.lang.Thread.run(Thread.java:745)
>         at ......remote call to H7(Native Method)
>         at
> hudson.remoting.Channel.attachCallSiteStackTrace(Channel.java:1413)
>         at hudson.remoting.UserResponse.retrieve(UserRequest.java:221)
>         at hudson.remoting.Channel.call(Channel.java:778)
>         at hudson.FilePath.act(FilePath.java:978)
>         at hudson.FilePath.act(FilePath.java:967)
>         at hudson.tasks.junit.JUnitParser.parseResult(JUnitParser.java:90)
>         at
> hudson.tasks.junit.JUnitResultArchiver.parse(JUnitResultArchiver.java:120)
>         at
> hudson.tasks.junit.JUnitResultArchiver.perform(JUnitResultArchiver.java:137)
>         at
> hudson.tasks.BuildStepCompatibilityLayer.perform(BuildStepCompatibilityLayer.java:74)
>         at
> hudson.tasks.BuildStepMonitor$1.perform(BuildStepMonitor.java:20)
>         at
> hudson.model.AbstractBuild$AbstractBuildExecution.perform(AbstractBuild.java:776)
>         at
> hudson.model.AbstractBuild$AbstractBuildExecution.performAllBuildSteps(AbstractBuild.java:723)
>         at hudson.model.Build$BuildExecution.post2(Build.java:183)
>         at
> hudson.model.AbstractBuild$AbstractBuildExecution.post(AbstractBuild.java:670)
>         at hudson.model.Run.execute(Run.java:1763)
>         at hudson.matrix.MatrixRun.run(MatrixRun.java:146)
>         at
> hudson.model.ResourceController.execute(ResourceController.java:98)
>         at hudson.model.Executor.run(Executor.java:381)
> Build step 'Publish JUnit test result report' marked build as failure
> [FINDBUGS] Skipping publisher since build result is FAILURE
> [CHECKSTYLE] Skipping publisher since build result is FAILURE
>

Mime
  • Unnamed multipart/alternative (inline, None, 0 bytes)
View raw message