hbase-builds mailing list archives

Site index · List index
Message view « Date » · « Thread »
Top « Date » · « Thread »
From Stack <st...@duboce.net>
Subject Re: Build failed in Jenkins: HBase-Trunk_matrix » latest1.8,Hadoop #457
Date Wed, 11 Nov 2015 18:50:46 GMT
This is HBASE-14798. TestAcidGuarantees shows as a hanging test. It is
stuck waiting on a RegionServer to assign too but there are no
regionservers to assign too because all are gone.

St.Ack

On Wed, Nov 11, 2015 at 1:55 AM, Apache Jenkins Server <
jenkins@builds.apache.org> wrote:

> See <
> https://builds.apache.org/job/HBase-Trunk_matrix/jdk=latest1.8,label=Hadoop/457/changes
> >
>
> Changes:
>
> [jerryjch] HBASE-13982 Add info for visibility labels/cell TTLs to
> ImportTsv (NIDHI
>
> ------------------------------------------
> [...truncated 6102 lines...]
> Running org.apache.hadoop.hbase.ipc.TestDelayedRpc
> Tests run: 2, Failures: 0, Errors: 0, Skipped: 0, Time elapsed: 39.979 sec
> - in org.apache.hadoop.hbase.io.hfile.TestForceCacheImportantBlocks
> Java HotSpot(TM) 64-Bit Server VM warning: ignoring option
> MaxPermSize=256m; support was removed in 8.0
> Running org.apache.hadoop.hbase.ipc.TestProtoBufRpc
> Tests run: 1, Failures: 0, Errors: 0, Skipped: 0, Time elapsed: 27.282 sec
> - in org.apache.hadoop.hbase.TestHBaseOnOtherDfsCluster
> Java HotSpot(TM) 64-Bit Server VM warning: ignoring option
> MaxPermSize=256m; support was removed in 8.0
> Tests run: 4, Failures: 0, Errors: 0, Skipped: 0, Time elapsed: 7.436 sec
> - in org.apache.hadoop.hbase.ipc.TestDelayedRpc
> Java HotSpot(TM) 64-Bit Server VM warning: ignoring option
> MaxPermSize=256m; support was removed in 8.0
> Running org.apache.hadoop.hbase.TestLocalHBaseCluster
> Tests run: 1, Failures: 0, Errors: 0, Skipped: 0, Time elapsed: 5.029 sec
> - in org.apache.hadoop.hbase.ipc.TestProtoBufRpc
> Java HotSpot(TM) 64-Bit Server VM warning: ignoring option
> MaxPermSize=256m; support was removed in 8.0
> Java HotSpot(TM) 64-Bit Server VM warning: ignoring option
> MaxPermSize=256m; support was removed in 8.0
> Running org.apache.hadoop.hbase.TestAcidGuarantees
> Running org.apache.hadoop.hbase.ipc.TestRpcClientLeaks
> Tests run: 1, Failures: 0, Errors: 0, Skipped: 0, Time elapsed: 24.332 sec
> - in org.apache.hadoop.hbase.TestLocalHBaseCluster
> Java HotSpot(TM) 64-Bit Server VM warning: ignoring option
> MaxPermSize=256m; support was removed in 8.0
> Running org.apache.hadoop.hbase.TestServerSideScanMetricsFromClientSide
> Tests run: 1, Failures: 0, Errors: 0, Skipped: 0, Time elapsed: 28.573 sec
> - in org.apache.hadoop.hbase.ipc.TestRpcClientLeaks
> Java HotSpot(TM) 64-Bit Server VM warning: ignoring option
> MaxPermSize=256m; support was removed in 8.0
> Tests run: 2, Failures: 0, Errors: 0, Skipped: 0, Time elapsed: 9.903 sec
> - in org.apache.hadoop.hbase.TestServerSideScanMetricsFromClientSide
> Running org.apache.hadoop.hbase.zookeeper.TestRecoverableZooKeeper
> Java HotSpot(TM) 64-Bit Server VM warning: ignoring option
> MaxPermSize=256m; support was removed in 8.0
> Tests run: 1, Failures: 0, Errors: 0, Skipped: 0, Time elapsed: 1.593 sec
> - in org.apache.hadoop.hbase.zookeeper.TestRecoverableZooKeeper
> Java HotSpot(TM) 64-Bit Server VM warning: ignoring option
> MaxPermSize=256m; support was removed in 8.0
> Java HotSpot(TM) 64-Bit Server VM warning: ignoring option
> MaxPermSize=256m; support was removed in 8.0
> Running org.apache.hadoop.hbase.zookeeper.TestZooKeeperNodeTracker
> Tests run: 3, Failures: 0, Errors: 0, Skipped: 0, Time elapsed: 2.245 sec
> - in org.apache.hadoop.hbase.zookeeper.TestZooKeeperNodeTracker
> Java HotSpot(TM) 64-Bit Server VM warning: ignoring option
> MaxPermSize=256m; support was removed in 8.0
> Running org.apache.hadoop.hbase.zookeeper.TestHQuorumPeer
> Tests run: 3, Failures: 0, Errors: 0, Skipped: 0, Time elapsed: 1.618 sec
> - in org.apache.hadoop.hbase.zookeeper.TestHQuorumPeer
> Java HotSpot(TM) 64-Bit Server VM warning: ignoring option
> MaxPermSize=256m; support was removed in 8.0
> Java HotSpot(TM) 64-Bit Server VM warning: ignoring option
> MaxPermSize=256m; support was removed in 8.0
> Running org.apache.hadoop.hbase.zookeeper.TestZKLeaderManager
> Tests run: 1, Failures: 0, Errors: 0, Skipped: 0, Time elapsed: 0.262 sec
> - in org.apache.hadoop.hbase.zookeeper.TestZKLeaderManager
> Java HotSpot(TM) 64-Bit Server VM warning: ignoring option
> MaxPermSize=256m; support was removed in 8.0
> Running org.apache.hadoop.hbase.zookeeper.TestZooKeeperACL
> Tests run: 7, Failures: 0, Errors: 0, Skipped: 0, Time elapsed: 0.875 sec
> - in org.apache.hadoop.hbase.zookeeper.TestZooKeeperACL
> Running org.apache.hadoop.hbase.zookeeper.TestZKMulti
> Running
> org.apache.hadoop.hbase.zookeeper.lock.TestZKInterProcessReadWriteLock
> Java HotSpot(TM) 64-Bit Server VM warning: ignoring option
> MaxPermSize=256m; support was removed in 8.0
> Tests run: 12, Failures: 0, Errors: 0, Skipped: 0, Time elapsed: 2.44 sec
> - in org.apache.hadoop.hbase.zookeeper.TestZKMulti
> Java HotSpot(TM) 64-Bit Server VM warning: ignoring option
> MaxPermSize=256m; support was removed in 8.0
> Running org.apache.hadoop.hbase.TestMetaTableAccessorNoCluster
> Tests run: 2, Failures: 0, Errors: 0, Skipped: 0, Time elapsed: 4.368 sec
> - in org.apache.hadoop.hbase.TestMetaTableAccessorNoCluster
> Java HotSpot(TM) 64-Bit Server VM warning: ignoring option
> MaxPermSize=256m; support was removed in 8.0
> Running org.apache.hadoop.hbase.TestZooKeeper
> Running org.apache.hadoop.hbase.TestJMXListener
> Tests run: 6, Failures: 0, Errors: 0, Skipped: 0, Time elapsed: 25.277 sec
> - in org.apache.hadoop.hbase.zookeeper.lock.TestZKInterProcessReadWriteLock
> Java HotSpot(TM) 64-Bit Server VM warning: ignoring option
> MaxPermSize=256m; support was removed in 8.0
> Tests run: 2, Failures: 0, Errors: 0, Skipped: 0, Time elapsed: 17.086 sec
> - in org.apache.hadoop.hbase.TestJMXListener
> Running
> org.apache.hadoop.hbase.replication.regionserver.TestReplicationWALReaderManager
> Java HotSpot(TM) 64-Bit Server VM warning: ignoring option
> MaxPermSize=256m; support was removed in 8.0
> Java HotSpot(TM) 64-Bit Server VM warning: ignoring option
> MaxPermSize=256m; support was removed in 8.0
> Running
> org.apache.hadoop.hbase.replication.regionserver.TestRegionReplicaReplicationEndpoint
> Tests run: 72, Failures: 0, Errors: 0, Skipped: 0, Time elapsed: 301.027
> sec - in org.apache.hadoop.hbase.io.hfile.TestCacheOnWrite
> Java HotSpot(TM) 64-Bit Server VM warning: ignoring option
> MaxPermSize=256m; support was removed in 8.0
> Running
> org.apache.hadoop.hbase.replication.regionserver.TestRegionReplicaReplicationEndpointNoMaster
> Tests run: 4, Failures: 0, Errors: 0, Skipped: 0, Time elapsed: 51.265 sec
> - in
> org.apache.hadoop.hbase.replication.regionserver.TestRegionReplicaReplicationEndpointNoMaster
> Java HotSpot(TM) 64-Bit Server VM warning: ignoring option
> MaxPermSize=256m; support was removed in 8.0
> Tests run: 9, Failures: 0, Errors: 0, Skipped: 0, Time elapsed: 145.023
> sec - in
> org.apache.hadoop.hbase.replication.regionserver.TestRegionReplicaReplicationEndpoint
> Java HotSpot(TM) 64-Bit Server VM warning: ignoring option
> MaxPermSize=256m; support was removed in 8.0
> Running
> org.apache.hadoop.hbase.replication.regionserver.TestReplicationSourceManager
> Tests run: 5, Failures: 0, Errors: 0, Skipped: 0, Time elapsed: 4.126 sec
> - in
> org.apache.hadoop.hbase.replication.regionserver.TestReplicationSourceManager
> Java HotSpot(TM) 64-Bit Server VM warning: ignoring option
> MaxPermSize=256m; support was removed in 8.0
> Java HotSpot(TM) 64-Bit Server VM warning: ignoring option
> MaxPermSize=256m; support was removed in 8.0
> Running org.apache.hadoop.hbase.replication.TestReplicationTrackerZKImpl
> Tests run: 5, Failures: 0, Errors: 0, Skipped: 0, Time elapsed: 2.159 sec
> - in org.apache.hadoop.hbase.replication.TestReplicationTrackerZKImpl
> Java HotSpot(TM) 64-Bit Server VM warning: ignoring option
> MaxPermSize=256m; support was removed in 8.0
> Running
> org.apache.hadoop.hbase.replication.regionserver.TestReplicationSink
> Tests run: 5, Failures: 0, Errors: 0, Skipped: 0, Time elapsed: 3.295 sec
> - in org.apache.hadoop.hbase.replication.regionserver.TestReplicationSink
> Java HotSpot(TM) 64-Bit Server VM warning: ignoring option
> MaxPermSize=256m; support was removed in 8.0
> Running
> org.apache.hadoop.hbase.replication.TestReplicationKillMasterRSCompressed
> Tests run: 12, Failures: 0, Errors: 0, Skipped: 0, Time elapsed: 260.084
> sec - in org.apache.hadoop.hbase.TestZooKeeper
> Java HotSpot(TM) 64-Bit Server VM warning: ignoring option
> MaxPermSize=256m; support was removed in 8.0
> Running org.apache.hadoop.hbase.replication.TestMultiSlaveReplication
> Running org.apache.hadoop.hbase.replication.TestReplicationKillMasterRS
> Tests run: 1, Failures: 0, Errors: 0, Skipped: 0, Time elapsed: 60.613 sec
> - in org.apache.hadoop.hbase.replication.TestMultiSlaveReplication
> Java HotSpot(TM) 64-Bit Server VM warning: ignoring option
> MaxPermSize=256m; support was removed in 8.0
> Tests run: 1, Failures: 0, Errors: 0, Skipped: 0, Time elapsed: 91.341 sec
> - in
> org.apache.hadoop.hbase.replication.TestReplicationKillMasterRSCompressed
> Java HotSpot(TM) 64-Bit Server VM warning: ignoring option
> MaxPermSize=256m; support was removed in 8.0
> Tests run: 8, Failures: 0, Errors: 0, Skipped: 0, Time elapsed: 325.995
> sec - in
> org.apache.hadoop.hbase.replication.regionserver.TestReplicationWALReaderManager
> Java HotSpot(TM) 64-Bit Server VM warning: ignoring option
> MaxPermSize=256m; support was removed in 8.0
> Tests run: 1, Failures: 0, Errors: 0, Skipped: 0, Time elapsed: 89.748 sec
> - in org.apache.hadoop.hbase.replication.TestReplicationKillMasterRS
> Java HotSpot(TM) 64-Bit Server VM warning: ignoring option
> MaxPermSize=256m; support was removed in 8.0
> Running
> org.apache.hadoop.hbase.replication.TestReplicationChangingPeerRegionservers
> Running org.apache.hadoop.hbase.replication.TestReplicationKillSlaveRS
> Tests run: 1, Failures: 0, Errors: 0, Skipped: 0, Time elapsed: 14.106 sec
> - in
> org.apache.hadoop.hbase.replication.TestReplicationChangingPeerRegionservers
> Java HotSpot(TM) 64-Bit Server VM warning: ignoring option
> MaxPermSize=256m; support was removed in 8.0
> Running
> org.apache.hadoop.hbase.replication.multiwal.TestReplicationKillMasterRSCompressedWithMultipleWAL
> Running
> org.apache.hadoop.hbase.replication.multiwal.TestReplicationSyncUpToolWithMultipleWAL
> Running
> org.apache.hadoop.hbase.replication.multiwal.TestReplicationEndpointWithMultipleWAL
> Tests run: 3, Failures: 0, Errors: 0, Skipped: 0, Time elapsed: 6.251 sec
> - in
> org.apache.hadoop.hbase.replication.multiwal.TestReplicationEndpointWithMultipleWAL
> Java HotSpot(TM) 64-Bit Server VM warning: ignoring option
> MaxPermSize=256m; support was removed in 8.0
> Tests run: 1, Failures: 0, Errors: 0, Skipped: 0, Time elapsed: 99.071 sec
> - in org.apache.hadoop.hbase.replication.TestReplicationKillSlaveRS
> Java HotSpot(TM) 64-Bit Server VM warning: ignoring option
> MaxPermSize=256m; support was removed in 8.0
> Tests run: 1, Failures: 0, Errors: 0, Skipped: 0, Time elapsed: 98.759 sec
> - in
> org.apache.hadoop.hbase.replication.multiwal.TestReplicationKillMasterRSCompressedWithMultipleWAL
> Java HotSpot(TM) 64-Bit Server VM warning: ignoring option
> MaxPermSize=256m; support was removed in 8.0
> Running org.apache.hadoop.hbase.replication.TestMasterReplication
> Tests run: 1, Failures: 0, Errors: 0, Skipped: 0, Time elapsed: 98.274 sec
> - in
> org.apache.hadoop.hbase.replication.multiwal.TestReplicationSyncUpToolWithMultipleWAL
> Java HotSpot(TM) 64-Bit Server VM warning: ignoring option
> MaxPermSize=256m; support was removed in 8.0
> Running org.apache.hadoop.hbase.replication.TestPerTableCFReplication
> Running
> org.apache.hadoop.hbase.replication.TestReplicationDisableInactivePeer
> Running org.apache.hadoop.hbase.replication.TestReplicationWithTags
> Tests run: 2, Failures: 0, Errors: 0, Skipped: 0, Time elapsed: 43.497 sec
> - in org.apache.hadoop.hbase.replication.TestPerTableCFReplication
> Java HotSpot(TM) 64-Bit Server VM warning: ignoring option
> MaxPermSize=256m; support was removed in 8.0
> Tests run: 1, Failures: 0, Errors: 0, Skipped: 0, Time elapsed: 5.37 sec -
> in org.apache.hadoop.hbase.replication.TestReplicationWithTags
> Java HotSpot(TM) 64-Bit Server VM warning: ignoring option
> MaxPermSize=256m; support was removed in 8.0
> Tests run: 1, Failures: 0, Errors: 0, Skipped: 0, Time elapsed: 25.852 sec
> - in org.apache.hadoop.hbase.replication.TestReplicationDisableInactivePeer
> Java HotSpot(TM) 64-Bit Server VM warning: ignoring option
> MaxPermSize=256m; support was removed in 8.0
> Running org.apache.hadoop.hbase.replication.TestReplicationSource
> Tests run: 1, Failures: 0, Errors: 0, Skipped: 0, Time elapsed: 0.615 sec
> - in org.apache.hadoop.hbase.replication.TestReplicationSource
> Java HotSpot(TM) 64-Bit Server VM warning: ignoring option
> MaxPermSize=256m; support was removed in 8.0
> Java HotSpot(TM) 64-Bit Server VM warning: ignoring option
> MaxPermSize=256m; support was removed in 8.0
> Tests run: 3, Failures: 0, Errors: 0, Skipped: 0, Time elapsed: 110.799
> sec - in org.apache.hadoop.hbase.replication.TestMasterReplication
> Java HotSpot(TM) 64-Bit Server VM warning: ignoring option
> MaxPermSize=256m; support was removed in 8.0
> Running org.apache.hadoop.hbase.replication.TestReplicationEndpoint
> Running org.apache.hadoop.hbase.replication.TestReplicationSmallTests
> Tests run: 3, Failures: 0, Errors: 0, Skipped: 0, Time elapsed: 4.486 sec
> - in org.apache.hadoop.hbase.replication.TestReplicationEndpoint
> Running org.apache.hadoop.hbase.replication.TestReplicationStateZKImpl
> Java HotSpot(TM) 64-Bit Server VM warning: ignoring option
> MaxPermSize=256m; support was removed in 8.0
> Java HotSpot(TM) 64-Bit Server VM warning: ignoring option
> MaxPermSize=256m; support was removed in 8.0
> Tests run: 6, Failures: 0, Errors: 0, Skipped: 0, Time elapsed: 1.958 sec
> - in org.apache.hadoop.hbase.replication.TestReplicationStateZKImpl
> Java HotSpot(TM) 64-Bit Server VM warning: ignoring option
> MaxPermSize=256m; support was removed in 8.0
> Java HotSpot(TM) 64-Bit Server VM warning: ignoring option
> MaxPermSize=256m; support was removed in 8.0
> Running org.apache.hadoop.hbase.fs.TestBlockReorder
> Java HotSpot(TM) 64-Bit Server VM warning: ignoring option
> MaxPermSize=256m; support was removed in 8.0
> Java HotSpot(TM) 64-Bit Server VM warning: ignoring option
> MaxPermSize=256m; support was removed in 8.0
> Java HotSpot(TM) 64-Bit Server VM warning: ignoring option
> MaxPermSize=256m; support was removed in 8.0
> Java HotSpot(TM) 64-Bit Server VM warning: ignoring option
> MaxPermSize=256m; support was removed in 8.0
> Running org.apache.hadoop.hbase.replication.TestReplicationSyncUpTool
> Running org.apache.hadoop.hbase.trace.TestHTraceHooks
> Tests run: 1, Failures: 0, Errors: 0, Skipped: 0, Time elapsed: 5.35 sec -
> in org.apache.hadoop.hbase.trace.TestHTraceHooks
> Java HotSpot(TM) 64-Bit Server VM warning: ignoring option
> MaxPermSize=256m; support was removed in 8.0
> Running org.apache.hadoop.hbase.TestMovedRegionsCleaner
> Tests run: 3, Failures: 0, Errors: 0, Skipped: 0, Time elapsed: 53.536 sec
> - in org.apache.hadoop.hbase.fs.TestBlockReorder
> Java HotSpot(TM) 64-Bit Server VM warning: ignoring option
> MaxPermSize=256m; support was removed in 8.0
> Java HotSpot(TM) 64-Bit Server VM warning: ignoring option
> MaxPermSize=256m; support was removed in 8.0
> Java HotSpot(TM) 64-Bit Server VM warning: ignoring option
> MaxPermSize=256m; support was removed in 8.0
> Java HotSpot(TM) 64-Bit Server VM warning: ignoring option
> MaxPermSize=256m; support was removed in 8.0
> Java HotSpot(TM) 64-Bit Server VM warning: ignoring option
> MaxPermSize=256m; support was removed in 8.0
> Java HotSpot(TM) 64-Bit Server VM warning: ignoring option
> MaxPermSize=256m; support was removed in 8.0
> Java HotSpot(TM) 64-Bit Server VM warning: ignoring option
> MaxPermSize=256m; support was removed in 8.0
> Java HotSpot(TM) 64-Bit Server VM warning: ignoring option
> MaxPermSize=256m; support was removed in 8.0
> Java HotSpot(TM) 64-Bit Server VM warning: ignoring option
> MaxPermSize=256m; support was removed in 8.0
> Java HotSpot(TM) 64-Bit Server VM warning: ignoring option
> MaxPermSize=256m; support was removed in 8.0
> Java HotSpot(TM) 64-Bit Server VM warning: ignoring option
> MaxPermSize=256m; support was removed in 8.0
> Tests run: 1, Failures: 0, Errors: 0, Skipped: 0, Time elapsed: 25.245 sec
> - in org.apache.hadoop.hbase.TestMovedRegionsCleaner
> Java HotSpot(TM) 64-Bit Server VM warning: ignoring option
> MaxPermSize=256m; support was removed in 8.0
> Java HotSpot(TM) 64-Bit Server VM warning: ignoring option
> MaxPermSize=256m; support was removed in 8.0
> Java HotSpot(TM) 64-Bit Server VM warning: ignoring option
> MaxPermSize=256m; support was removed in 8.0
> Java HotSpot(TM) 64-Bit Server VM warning: ignoring option
> MaxPermSize=256m; support was removed in 8.0
> Java HotSpot(TM) 64-Bit Server VM warning: ignoring option
> MaxPermSize=256m; support was removed in 8.0
> Running org.apache.hadoop.hbase.TestMetaTableLocator
> Tests run: 7, Failures: 0, Errors: 0, Skipped: 0, Time elapsed: 5.54 sec -
> in org.apache.hadoop.hbase.TestMetaTableLocator
> Java HotSpot(TM) 64-Bit Server VM warning: ignoring option
> MaxPermSize=256m; support was removed in 8.0
> Java HotSpot(TM) 64-Bit Server VM warning: ignoring option
> MaxPermSize=256m; support was removed in 8.0
> Tests run: 10, Failures: 0, Errors: 0, Skipped: 0, Time elapsed: 87.101
> sec - in org.apache.hadoop.hbase.replication.TestReplicationSmallTests
> Java HotSpot(TM) 64-Bit Server VM warning: ignoring option
> MaxPermSize=256m; support was removed in 8.0
> Tests run: 1, Failures: 0, Errors: 0, Skipped: 0, Time elapsed: 74.239 sec
> - in org.apache.hadoop.hbase.replication.TestReplicationSyncUpTool
> Java HotSpot(TM) 64-Bit Server VM warning: ignoring option
> MaxPermSize=256m; support was removed in 8.0
> Java HotSpot(TM) 64-Bit Server VM warning: ignoring option
> MaxPermSize=256m; support was removed in 8.0
> Java HotSpot(TM) 64-Bit Server VM warning: ignoring option
> MaxPermSize=256m; support was removed in 8.0
> Java HotSpot(TM) 64-Bit Server VM warning: ignoring option
> MaxPermSize=256m; support was removed in 8.0
> Running org.apache.hadoop.hbase.mapred.TestTableSnapshotInputFormat
> Running org.apache.hadoop.hbase.namespace.TestNamespaceAuditor
> Running org.apache.hadoop.hbase.mapred.TestTableMapReduceUtil
> Running org.apache.hadoop.hbase.mapred.TestMultiTableSnapshotInputFormat
> Tests run: 4, Failures: 0, Errors: 0, Skipped: 0, Time elapsed: 29.926 sec
> - in org.apache.hadoop.hbase.mapred.TestTableMapReduceUtil
> Java HotSpot(TM) 64-Bit Server VM warning: ignoring option
> MaxPermSize=256m; support was removed in 8.0
> Running org.apache.hadoop.hbase.mapred.TestTableInputFormat
> Tests run: 8, Failures: 0, Errors: 0, Skipped: 0, Time elapsed: 23.133 sec
> - in org.apache.hadoop.hbase.mapred.TestTableInputFormat
> Java HotSpot(TM) 64-Bit Server VM warning: ignoring option
> MaxPermSize=256m; support was removed in 8.0
> Java HotSpot(TM) 64-Bit Server VM warning: ignoring option
> MaxPermSize=256m; support was removed in 8.0
> Java HotSpot(TM) 64-Bit Server VM warning: ignoring option
> MaxPermSize=256m; support was removed in 8.0
> Java HotSpot(TM) 64-Bit Server VM warning: ignoring option
> MaxPermSize=256m; support was removed in 8.0
> Tests run: 4, Failures: 0, Errors: 0, Skipped: 0, Time elapsed: 71.697 sec
> - in org.apache.hadoop.hbase.mapred.TestMultiTableSnapshotInputFormat
> Running org.apache.hadoop.hbase.TestMultiVersions
> Running org.apache.hadoop.hbase.mapred.TestTableMapReduce
> Tests run: 12, Failures: 0, Errors: 0, Skipped: 0, Time elapsed: 138.021
> sec - in org.apache.hadoop.hbase.namespace.TestNamespaceAuditor
> Tests run: 3, Failures: 0, Errors: 0, Skipped: 0, Time elapsed: 16.108 sec
> - in org.apache.hadoop.hbase.TestMultiVersions
> Tests run: 2, Failures: 0, Errors: 0, Skipped: 0, Time elapsed: 30.491 sec
> - in org.apache.hadoop.hbase.mapred.TestTableMapReduce
> Tests run: 7, Failures: 0, Errors: 0, Skipped: 0, Time elapsed: 173.576
> sec - in org.apache.hadoop.hbase.mapred.TestTableSnapshotInputFormat
>
> Results :
>
> Tests run: 2437, Failures: 0, Errors: 0, Skipped: 40
>
> [INFO]
> ------------------------------------------------------------------------
> [INFO] Reactor Summary:
> [INFO]
> [INFO] Apache HBase ...................................... SUCCESS [
> 5.853 s]
> [INFO] Apache HBase - Checkstyle ......................... SUCCESS [
> 0.891 s]
> [INFO] Apache HBase - Resource Bundle .................... SUCCESS [
> 0.283 s]
> [INFO] Apache HBase - Annotations ........................ SUCCESS [
> 0.310 s]
> [INFO] Apache HBase - Protocol ........................... SUCCESS [
> 3.075 s]
> [INFO] Apache HBase - Common ............................. SUCCESS [01:53
> min]
> [INFO] Apache HBase - Procedure .......................... SUCCESS [01:44
> min]
> [INFO] Apache HBase - Client ............................. SUCCESS [
> 52.360 s]
> [INFO] Apache HBase - Hadoop Compatibility ............... SUCCESS [
> 10.146 s]
> [INFO] Apache HBase - Hadoop Two Compatibility ........... SUCCESS [
> 13.203 s]
> [INFO] Apache HBase - Prefix Tree ........................ SUCCESS [
> 14.688 s]
> [INFO] Apache HBase - Server ............................. FAILURE [
> 02:05 h]
> [INFO] Apache HBase - Testing Util ....................... SKIPPED
> [INFO] Apache HBase - Thrift ............................. SKIPPED
> [INFO] Apache HBase - Shell .............................. SKIPPED
> [INFO] Apache HBase - Integration Tests .................. SKIPPED
> [INFO] Apache HBase - Examples ........................... SKIPPED
> [INFO] Apache HBase - Rest ............................... SKIPPED
> [INFO] Apache HBase - External Block Cache ............... SKIPPED
> [INFO] Apache HBase - Assembly ........................... SKIPPED
> [INFO] Apache HBase - Shaded ............................. SKIPPED
> [INFO] Apache HBase - Shaded - Client .................... SKIPPED
> [INFO] Apache HBase - Shaded - Server .................... SKIPPED
> [INFO] Apache HBase - Spark .............................. SKIPPED
> [INFO]
> ------------------------------------------------------------------------
> [INFO] BUILD FAILURE
> [INFO]
> ------------------------------------------------------------------------
> [INFO] Total time: 02:10 h
> [INFO] Finished at: 2015-11-11T11:51:50+00:00
> [INFO] Final Memory: 422M/4118M
> [INFO]
> ------------------------------------------------------------------------
> [ERROR] Failed to execute goal
> org.apache.maven.plugins:maven-surefire-plugin:2.18.1:test
> (secondPartTestsExecution) on project hbase-server: There was a timeout or
> other error in the fork -> [Help 1]
> [ERROR]
> [ERROR] To see the full stack trace of the errors, re-run Maven with the
> -e switch.
> [ERROR] Re-run Maven using the -X switch to enable full debug logging.
> [ERROR]
> [ERROR] For more information about the errors and possible solutions,
> please read the following articles:
> [ERROR] [Help 1]
> http://cwiki.apache.org/confluence/display/MAVEN/MojoFailureException
> [ERROR]
> [ERROR] After correcting the problems, you can resume the build with the
> command
> [ERROR]   mvn <goals> -rf :hbase-server
> Build step 'Invoke top-level Maven targets' marked build as failure
> Performing Post build task...
> Match found for :.* : True
> Logical operation result is TRUE
> Running script  : # Run zombie detector script
> ./dev-support/zombie-detector.sh --jenkins ${BUILD_ID}
> [Hadoop] $ /bin/bash -xe /tmp/hudson3291018881601152331.sh
> + ./dev-support/zombie-detector.sh --jenkins 457
> Wed Nov 11 11:51:52 UTC 2015 Found 1 suspicious java process(es) listed
> below; waiting 30s to see if just slow to stop
> 5167 surefirebooter7596384258849831486.jar -enableassertions -
> Dhbase.build.id=457 -Xmx2800m -XX:MaxPermSize=256m
> -Djava.security.egd=file:/dev/./urandom -Djava.net.preferIPv4Stack=true
> -Djava.awt.headless=true
> tail: cannot open '+2' for reading: No such file or directory
> Wed Nov 11 11:52:22 UTC 2015 We're ok: there is no zombie test
> POST BUILD TASK : SUCCESS
> END OF POST BUILD TASK : 0
> Archiving artifacts
> Recording test results
> [FINDBUGS] Skipping publisher since build result is FAILURE
> [CHECKSTYLE] Skipping publisher since build result is FAILURE
>

Mime
  • Unnamed multipart/alternative (inline, None, 0 bytes)
View raw message