hbase-builds mailing list archives

Site index · List index
Message view « Date » · « Thread »
Top « Date » · « Thread »
From Stack <st...@duboce.net>
Subject Re: Build failed in Jenkins: HBase-1.3 » latest1.8,Hadoop #400
Date Thu, 26 Nov 2015 21:17:14 GMT
These two tests don't usually fail going by history. Both timed out.  The
export test had an interesting exception on the end:

Error: java.lang.IllegalArgumentException: Invalid embedded descriptor for
"Snapshot.proto".
at
com.google.protobuf.Descriptors$FileDescriptor.internalBuildGeneratedFileFrom(Descriptors.java:301)
at
org.apache.hadoop.hbase.protobuf.generated.SnapshotProtos.<clinit>(SnapshotProtos.java:4779)
at
org.apache.hadoop.hbase.protobuf.generated.SnapshotProtos$SnapshotFileInfo.internalGetFieldAccessorTable(SnapshotProtos.java:165)
at
com.google.protobuf.GeneratedMessage.getAllFieldsMutable(GeneratedMessage.java:105)
at
com.google.protobuf.GeneratedMessage.getAllFields(GeneratedMessage.java:153)
at com.google.protobuf.TextFormat$Printer.print(TextFormat.java:272)
at com.google.protobuf.TextFormat$Printer.access$400(TextFormat.java:248)
at com.google.protobuf.TextFormat.print(TextFormat.java:71)
at com.google.protobuf.TextFormat.printToString(TextFormat.java:118)
at com.google.protobuf.AbstractMessage.toString(AbstractMessage.java:106)
at java.lang.String.valueOf(String.java:2994)
at java.lang.StringBuilder.append(StringBuilder.java:131)
at
org.apache.hadoop.hbase.snapshot.ExportSnapshot$ExportMapper.injectTestFailure(ExportSnapshot.java:240)
at
org.apache.hadoop.hbase.snapshot.ExportSnapshot$ExportMapper.copyFile(ExportSnapshot.java:247)
at
org.apache.hadoop.hbase.snapshot.ExportSnapshot$ExportMapper.map(ExportSnapshot.java:193)
at
org.apache.hadoop.hbase.snapshot.ExportSnapshot$ExportMapper.map(ExportSnapshot.java:119)
at org.apache.hadoop.mapreduce.Mapper.run(Mapper.java:145)
at org.apache.hadoop.mapred.MapTask.runNewMapper(MapTask.java:764)
at org.apache.hadoop.mapred.MapTask.run(MapTask.java:340)
at org.apache.hadoop.mapred.YarnChild$2.run(YarnChild.java:168)
at java.security.AccessController.doPrivileged(Native Method)
at javax.security.auth.Subject.doAs(Subject.java:422)
at
org.apache.hadoop.security.UserGroupInformation.doAs(UserGroupInformation.java:1614)
at org.apache.hadoop.mapred.YarnChild.main(YarnChild.java:163)
Caused by: com.google.protobuf.Descriptors$DescriptorValidationException:
SnapshotRegionManifest.StoreFile.reference: ".Reference" is not defined.
at
com.google.protobuf.Descriptors$DescriptorPool.lookupSymbol(Descriptors.java:1784)
at
com.google.protobuf.Descriptors$FieldDescriptor.crossLink(Descriptors.java:982)
at
com.google.protobuf.Descriptors$FieldDescriptor.access$700(Descriptors.java:658)
at
com.google.protobuf.Descriptors$Descriptor.crossLink(Descriptors.java:625)
at
com.google.protobuf.Descriptors$Descriptor.crossLink(Descriptors.java:621)
at
com.google.protobuf.Descriptors$Descriptor.access$500(Descriptors.java:440)
at
com.google.protobuf.Descriptors$FileDescriptor.crossLink(Descriptors.java:394)
at
com.google.protobuf.Descriptors$FileDescriptor.buildFrom(Descriptors.java:252)
at
com.google.protobuf.Descriptors$FileDescriptor.internalBuildGeneratedFileFrom(Descriptors.java:299)
... 23 more

Lets keep an eye on them.
St.Ack


On Thu, Nov 26, 2015 at 3:55 AM, Apache Jenkins Server <
jenkins@builds.apache.org> wrote:

> See <
> https://builds.apache.org/job/HBase-1.3/jdk=latest1.8,label=Hadoop/400/changes
> >
>
> Changes:
>
> [larsh] HBASE-14777 second addendum, better fix using CompletionService.
>
> [stack] HBASE-14355 Scan different TimeRange for each column family -
> fixing
>
> ------------------------------------------
> [...truncated 45552 lines...]
> Tests run: 1, Failures: 0, Errors: 0, Skipped: 0, Time elapsed: 70.54 sec
> - in org.apache.hadoop.hbase.replication.TestMultiSlaveReplication
> Java HotSpot(TM) 64-Bit Server VM warning: ignoring option
> MaxPermSize=256m; support was removed in 8.0
> Tests run: 8, Failures: 0, Errors: 0, Skipped: 0, Time elapsed: 286.002
> sec - in
> org.apache.hadoop.hbase.replication.regionserver.TestReplicationWALReaderManager
> Java HotSpot(TM) 64-Bit Server VM warning: ignoring option
> MaxPermSize=256m; support was removed in 8.0
> Tests run: 1, Failures: 0, Errors: 0, Skipped: 0, Time elapsed: 97.851 sec
> - in
> org.apache.hadoop.hbase.replication.TestReplicationKillMasterRSCompressed
> Java HotSpot(TM) 64-Bit Server VM warning: ignoring option
> MaxPermSize=256m; support was removed in 8.0
> Tests run: 1, Failures: 0, Errors: 0, Skipped: 0, Time elapsed: 101.161
> sec - in org.apache.hadoop.hbase.replication.TestReplicationKillMasterRS
> Java HotSpot(TM) 64-Bit Server VM warning: ignoring option
> MaxPermSize=256m; support was removed in 8.0
> Running
> org.apache.hadoop.hbase.replication.TestReplicationChangingPeerRegionservers
> Tests run: 1, Failures: 0, Errors: 0, Skipped: 0, Time elapsed: 11.788 sec
> - in
> org.apache.hadoop.hbase.replication.TestReplicationChangingPeerRegionservers
> Java HotSpot(TM) 64-Bit Server VM warning: ignoring option
> MaxPermSize=256m; support was removed in 8.0
> Running org.apache.hadoop.hbase.replication.TestReplicationKillSlaveRS
> Running
> org.apache.hadoop.hbase.replication.multiwal.TestReplicationEndpointWithMultipleWAL
> Running
> org.apache.hadoop.hbase.replication.multiwal.TestReplicationKillMasterRSCompressedWithMultipleWAL
> Running
> org.apache.hadoop.hbase.replication.multiwal.TestReplicationSyncUpToolWithMultipleWAL
> Running org.apache.hadoop.hbase.replication.TestPerTableCFReplication
> Tests run: 4, Failures: 0, Errors: 0, Skipped: 0, Time elapsed: 22.574 sec
> - in
> org.apache.hadoop.hbase.replication.multiwal.TestReplicationEndpointWithMultipleWAL
> Java HotSpot(TM) 64-Bit Server VM warning: ignoring option
> MaxPermSize=256m; support was removed in 8.0
> Tests run: 2, Failures: 0, Errors: 0, Skipped: 0, Time elapsed: 47.166 sec
> - in org.apache.hadoop.hbase.replication.TestPerTableCFReplication
> Java HotSpot(TM) 64-Bit Server VM warning: ignoring option
> MaxPermSize=256m; support was removed in 8.0
> Running org.apache.hadoop.hbase.replication.TestMasterReplication
> Tests run: 1, Failures: 0, Errors: 0, Skipped: 0, Time elapsed: 101.076
> sec - in org.apache.hadoop.hbase.replication.TestReplicationKillSlaveRS
> Java HotSpot(TM) 64-Bit Server VM warning: ignoring option
> MaxPermSize=256m; support was removed in 8.0
> Tests run: 1, Failures: 0, Errors: 0, Skipped: 0, Time elapsed: 79.253 sec
> - in
> org.apache.hadoop.hbase.replication.multiwal.TestReplicationSyncUpToolWithMultipleWAL
> Java HotSpot(TM) 64-Bit Server VM warning: ignoring option
> MaxPermSize=256m; support was removed in 8.0
> Running
> org.apache.hadoop.hbase.replication.TestReplicationDisableInactivePeer
> Tests run: 1, Failures: 0, Errors: 0, Skipped: 0, Time elapsed: 102.865
> sec - in
> org.apache.hadoop.hbase.replication.multiwal.TestReplicationKillMasterRSCompressedWithMultipleWAL
> Java HotSpot(TM) 64-Bit Server VM warning: ignoring option
> MaxPermSize=256m; support was removed in 8.0
> Tests run: 1, Failures: 0, Errors: 0, Skipped: 0, Time elapsed: 28.723 sec
> - in org.apache.hadoop.hbase.replication.TestReplicationDisableInactivePeer
> Java HotSpot(TM) 64-Bit Server VM warning: ignoring option
> MaxPermSize=256m; support was removed in 8.0
> Running org.apache.hadoop.hbase.replication.TestReplicationSource
> Tests run: 1, Failures: 0, Errors: 0, Skipped: 0, Time elapsed: 0.695 sec
> - in org.apache.hadoop.hbase.replication.TestReplicationSource
> Running org.apache.hadoop.hbase.replication.TestReplicationWithTags
> Java HotSpot(TM) 64-Bit Server VM warning: ignoring option
> MaxPermSize=256m; support was removed in 8.0
> Java HotSpot(TM) 64-Bit Server VM warning: ignoring option
> MaxPermSize=256m; support was removed in 8.0
> Tests run: 1, Failures: 0, Errors: 0, Skipped: 0, Time elapsed: 5.276 sec
> - in org.apache.hadoop.hbase.replication.TestReplicationWithTags
> Java HotSpot(TM) 64-Bit Server VM warning: ignoring option
> MaxPermSize=256m; support was removed in 8.0
> Running org.apache.hadoop.hbase.replication.TestReplicationEndpoint
> Running org.apache.hadoop.hbase.replication.TestReplicationStateZKImpl
> Tests run: 6, Failures: 0, Errors: 0, Skipped: 0, Time elapsed: 3.399 sec
> - in org.apache.hadoop.hbase.replication.TestReplicationStateZKImpl
> Java HotSpot(TM) 64-Bit Server VM warning: ignoring option
> MaxPermSize=256m; support was removed in 8.0
> Java HotSpot(TM) 64-Bit Server VM warning: ignoring option
> MaxPermSize=256m; support was removed in 8.0
> Java HotSpot(TM) 64-Bit Server VM warning: ignoring option
> MaxPermSize=256m; support was removed in 8.0
> Running org.apache.hadoop.hbase.fs.TestBlockReorder
> Tests run: 4, Failures: 0, Errors: 0, Skipped: 0, Time elapsed: 19.766 sec
> - in org.apache.hadoop.hbase.replication.TestReplicationEndpoint
> Java HotSpot(TM) 64-Bit Server VM warning: ignoring option
> MaxPermSize=256m; support was removed in 8.0
> Running org.apache.hadoop.hbase.replication.TestReplicationSmallTests
> Java HotSpot(TM) 64-Bit Server VM warning: ignoring option
> MaxPermSize=256m; support was removed in 8.0
> Java HotSpot(TM) 64-Bit Server VM warning: ignoring option
> MaxPermSize=256m; support was removed in 8.0
> Java HotSpot(TM) 64-Bit Server VM warning: ignoring option
> MaxPermSize=256m; support was removed in 8.0
> Java HotSpot(TM) 64-Bit Server VM warning: ignoring option
> MaxPermSize=256m; support was removed in 8.0
> Tests run: 4, Failures: 0, Errors: 0, Skipped: 0, Time elapsed: 149.35 sec
> - in org.apache.hadoop.hbase.replication.TestMasterReplication
> Java HotSpot(TM) 64-Bit Server VM warning: ignoring option
> MaxPermSize=256m; support was removed in 8.0
> Running org.apache.hadoop.hbase.trace.TestHTraceHooks
> Running org.apache.hadoop.hbase.TestMovedRegionsCleaner
> Tests run: 1, Failures: 0, Errors: 0, Skipped: 0, Time elapsed: 6.902 sec
> - in org.apache.hadoop.hbase.trace.TestHTraceHooks
> Java HotSpot(TM) 64-Bit Server VM warning: ignoring option
> MaxPermSize=256m; support was removed in 8.0
> Java HotSpot(TM) 64-Bit Server VM warning: ignoring option
> MaxPermSize=256m; support was removed in 8.0
> Running org.apache.hadoop.hbase.replication.TestReplicationSyncUpTool
> Java HotSpot(TM) 64-Bit Server VM warning: ignoring option
> MaxPermSize=256m; support was removed in 8.0
> Java HotSpot(TM) 64-Bit Server VM warning: ignoring option
> MaxPermSize=256m; support was removed in 8.0
> Java HotSpot(TM) 64-Bit Server VM warning: ignoring option
> MaxPermSize=256m; support was removed in 8.0
> Tests run: 3, Failures: 0, Errors: 0, Skipped: 0, Time elapsed: 61.031 sec
> - in org.apache.hadoop.hbase.fs.TestBlockReorder
> Java HotSpot(TM) 64-Bit Server VM warning: ignoring option
> MaxPermSize=256m; support was removed in 8.0
> Java HotSpot(TM) 64-Bit Server VM warning: ignoring option
> MaxPermSize=256m; support was removed in 8.0
> Java HotSpot(TM) 64-Bit Server VM warning: ignoring option
> MaxPermSize=256m; support was removed in 8.0
> Java HotSpot(TM) 64-Bit Server VM warning: ignoring option
> MaxPermSize=256m; support was removed in 8.0
> Java HotSpot(TM) 64-Bit Server VM warning: ignoring option
> MaxPermSize=256m; support was removed in 8.0
> Java HotSpot(TM) 64-Bit Server VM warning: ignoring option
> MaxPermSize=256m; support was removed in 8.0
> Java HotSpot(TM) 64-Bit Server VM warning: ignoring option
> MaxPermSize=256m; support was removed in 8.0
> Java HotSpot(TM) 64-Bit Server VM warning: ignoring option
> MaxPermSize=256m; support was removed in 8.0
> Java HotSpot(TM) 64-Bit Server VM warning: ignoring option
> MaxPermSize=256m; support was removed in 8.0
> Java HotSpot(TM) 64-Bit Server VM warning: ignoring option
> MaxPermSize=256m; support was removed in 8.0
> Java HotSpot(TM) 64-Bit Server VM warning: ignoring option
> MaxPermSize=256m; support was removed in 8.0
> Tests run: 1, Failures: 0, Errors: 0, Skipped: 0, Time elapsed: 27.674 sec
> - in org.apache.hadoop.hbase.TestMovedRegionsCleaner
> Java HotSpot(TM) 64-Bit Server VM warning: ignoring option
> MaxPermSize=256m; support was removed in 8.0
> Running org.apache.hadoop.hbase.TestMetaTableLocator
> Java HotSpot(TM) 64-Bit Server VM warning: ignoring option
> MaxPermSize=256m; support was removed in 8.0
> Tests run: 7, Failures: 0, Errors: 0, Skipped: 0, Time elapsed: 8.016 sec
> - in org.apache.hadoop.hbase.TestMetaTableLocator
> Java HotSpot(TM) 64-Bit Server VM warning: ignoring option
> MaxPermSize=256m; support was removed in 8.0
> Java HotSpot(TM) 64-Bit Server VM warning: ignoring option
> MaxPermSize=256m; support was removed in 8.0
> Tests run: 10, Failures: 0, Errors: 0, Skipped: 0, Time elapsed: 88.103
> sec - in org.apache.hadoop.hbase.replication.TestReplicationSmallTests
> Java HotSpot(TM) 64-Bit Server VM warning: ignoring option
> MaxPermSize=256m; support was removed in 8.0
> Java HotSpot(TM) 64-Bit Server VM warning: ignoring option
> MaxPermSize=256m; support was removed in 8.0
> Java HotSpot(TM) 64-Bit Server VM warning: ignoring option
> MaxPermSize=256m; support was removed in 8.0
> Running org.apache.hadoop.hbase.namespace.TestNamespaceAuditor
> Running org.apache.hadoop.hbase.mapred.TestTableSnapshotInputFormat
> Tests run: 1, Failures: 0, Errors: 0, Skipped: 0, Time elapsed: 71.305 sec
> - in org.apache.hadoop.hbase.replication.TestReplicationSyncUpTool
> Java HotSpot(TM) 64-Bit Server VM warning: ignoring option
> MaxPermSize=256m; support was removed in 8.0
> Running org.apache.hadoop.hbase.mapred.TestTableMapReduceUtil
> Running org.apache.hadoop.hbase.mapred.TestMultiTableSnapshotInputFormat
> Running org.apache.hadoop.hbase.mapred.TestTableInputFormat
> Tests run: 12, Failures: 0, Errors: 0, Skipped: 1, Time elapsed: 147.488
> sec - in org.apache.hadoop.hbase.namespace.TestNamespaceAuditor
> Java HotSpot(TM) 64-Bit Server VM warning: ignoring option
> MaxPermSize=256m; support was removed in 8.0
> Java HotSpot(TM) 64-Bit Server VM warning: ignoring option
> MaxPermSize=256m; support was removed in 8.0
> Java HotSpot(TM) 64-Bit Server VM warning: ignoring option
> MaxPermSize=256m; support was removed in 8.0
> Running org.apache.hadoop.hbase.mapred.TestTableMapReduce
> Tests run: 4, Failures: 0, Errors: 0, Skipped: 0, Time elapsed: 238.108
> sec - in org.apache.hadoop.hbase.mapred.TestTableMapReduceUtil
> Java HotSpot(TM) 64-Bit Server VM warning: ignoring option
> MaxPermSize=256m; support was removed in 8.0
> Tests run: 8, Failures: 0, Errors: 0, Skipped: 0, Time elapsed: 220.405
> sec - in org.apache.hadoop.hbase.mapred.TestTableInputFormat
> Java HotSpot(TM) 64-Bit Server VM warning: ignoring option
> MaxPermSize=256m; support was removed in 8.0
> Running org.apache.hadoop.hbase.TestMetaMigrationConvertingToPB
> Tests run: 3, Failures: 0, Errors: 0, Skipped: 0, Time elapsed: 4.901 sec
> - in org.apache.hadoop.hbase.TestMetaMigrationConvertingToPB
> Running org.apache.hadoop.hbase.TestMultiVersions
> Tests run: 3, Failures: 0, Errors: 0, Skipped: 0, Time elapsed: 25.496 sec
> - in org.apache.hadoop.hbase.TestMultiVersions
> Tests run: 4, Failures: 0, Errors: 0, Skipped: 0, Time elapsed: 403.503
> sec - in org.apache.hadoop.hbase.mapred.TestMultiTableSnapshotInputFormat
> Tests run: 7, Failures: 0, Errors: 0, Skipped: 0, Time elapsed: 582.334
> sec - in org.apache.hadoop.hbase.mapred.TestTableSnapshotInputFormat
>
> Results :
>
> Tests in error:
>
> org.apache.hadoop.hbase.mapreduce.TestRowCounter.testRowCounterTimeRange(org.apache.hadoop.hbase.mapreduce.TestRowCounter)
>   Run 1: TestRowCounter.testRowCounterTimeRange:191->runRowCount:211 »
> TestTimedOut tes...
>   Run 2: TestRowCounter.testRowCounterTimeRange:191->runRowCount:211 »
> TestTimedOut tes...
>
>   TestExportSnapshot.testExportFailure:321->runExportAndInjectFailures:348
> » TestTimedOut
> Flaked tests:
>
> org.apache.hadoop.hbase.regionserver.TestFailedAppendAndSync.testLockupAroundBadAssignSync(org.apache.hadoop.hbase.regionserver.TestFailedAppendAndSync)
>   Run 1: TestFailedAppendAndSync.testLockupAroundBadAssignSync:242 »
> TestTimedOut test ...
>   Run 2: PASS
>
>
> Tests run: 2362, Failures: 0, Errors: 2, Skipped: 39, Flakes: 1
>
> [INFO]
> ------------------------------------------------------------------------
> [INFO] Reactor Summary:
> [INFO]
> [INFO] Apache HBase ...................................... SUCCESS
> [1:38.128s]
> [INFO] Apache HBase - Checkstyle ......................... SUCCESS [9.175s]
> [INFO] Apache HBase - Resource Bundle .................... SUCCESS [0.604s]
> [INFO] Apache HBase - Annotations ........................ SUCCESS [3.071s]
> [INFO] Apache HBase - Protocol ........................... SUCCESS
> [41.155s]
> [INFO] Apache HBase - Common ............................. SUCCESS
> [3:56.814s]
> [INFO] Apache HBase - Procedure .......................... SUCCESS
> [4:20.189s]
> [INFO] Apache HBase - Client ............................. SUCCESS
> [2:04.406s]
> [INFO] Apache HBase - Hadoop Compatibility ............... SUCCESS
> [13.300s]
> [INFO] Apache HBase - Hadoop Two Compatibility ........... SUCCESS
> [17.035s]
> [INFO] Apache HBase - Prefix Tree ........................ SUCCESS
> [19.060s]
> [INFO] Apache HBase - Server ............................. FAILURE
> [3:13:23.896s]
> [INFO] Apache HBase - Testing Util ....................... SKIPPED
> [INFO] Apache HBase - Thrift ............................. SKIPPED
> [INFO] Apache HBase - Rest ............................... SKIPPED
> [INFO] Apache HBase - Shell .............................. SKIPPED
> [INFO] Apache HBase - Integration Tests .................. SKIPPED
> [INFO] Apache HBase - Examples ........................... SKIPPED
> [INFO] Apache HBase - External Block Cache ............... SKIPPED
> [INFO] Apache HBase - Assembly ........................... SKIPPED
> [INFO] Apache HBase - Shaded ............................. SKIPPED
> [INFO] Apache HBase - Shaded - Client .................... SKIPPED
> [INFO] Apache HBase - Shaded - Server .................... SKIPPED
> [INFO]
> ------------------------------------------------------------------------
> [INFO] BUILD FAILURE
> [INFO]
> ------------------------------------------------------------------------
> [INFO] Total time: 3:27:38.889s
> [INFO] Finished at: Thu Nov 26 11:50:02 UTC 2015
> [INFO] Final Memory: 466M/1743M
> [INFO]
> ------------------------------------------------------------------------
> [ERROR] Failed to execute goal
> org.apache.maven.plugins:maven-surefire-plugin:2.18.1:test
> (secondPartTestsExecution) on project hbase-server: There was a timeout or
> other error in the fork -> [Help 1]
> [ERROR]
> [ERROR] To see the full stack trace of the errors, re-run Maven with the
> -e switch.
> [ERROR] Re-run Maven using the -X switch to enable full debug logging.
> [ERROR]
> [ERROR] For more information about the errors and possible solutions,
> please read the following articles:
> [ERROR] [Help 1]
> http://cwiki.apache.org/confluence/display/MAVEN/MojoFailureException
> [ERROR]
> [ERROR] After correcting the problems, you can resume the build with the
> command
> [ERROR]   mvn <goals> -rf :hbase-server
> Build step 'Invoke top-level Maven targets' marked build as failure
> Performing Post build task...
> Match found for :.* : True
> Logical operation result is TRUE
> Running script  : # Post-build task script. TODO: Check this in and have
> all builds reference check-in.
> pwd && ls
> # NOTE!!!! The below code has been copied and pasted from
> ./dev-tools/run-test.sh
> # Do not change here without syncing there and vice-versa.
> ZOMBIE_TESTS_COUNT=`jps -v | grep surefirebooter | grep -e '-Dhbase.test'
> | wc -l`
> if [[ $ZOMBIE_TESTS_COUNT != 0 ]] ; then
>  echo "Suspicious java process found - waiting 30s to see if there are
> just slow to stop"
>  sleep 30
>  ZOMBIE_TESTS_COUNT=`jps -v | grep surefirebooter | grep -e '-Dhbase.test'
> | wc -l`
>  if [[ $ZOMBIE_TESTS_COUNT != 0 ]] ; then
>    echo " {color:red}There appear to be $ZOMBIE_TESTS_COUNT zombie
> tests{color}, they should have been killed by surefire but survived"
>    jps -v | grep surefirebooter | grep -e '-Dhbase.test'
>    jps -v | grep surefirebooter | grep -e '-Dhbase.test' | cut -d ' ' -f 1
> | xargs -n 1 jstack
>    # Exit with error
>    exit 1
>  else
>    echo "We're ok: there is no zombie test, but some tests took some time
> to stop"
>  fi
> else
>   echo "We're ok: there is no zombie test"
> fi
> [Hadoop] $ /bin/bash -xe /tmp/hudson3459209009216443872.sh
> + pwd
> <https://builds.apache.org/job/HBase-1.3/jdk=latest1.8,label=Hadoop/ws/>
> + ls
> bin
> CHANGES.txt
> conf
> dev-support
> hbase-annotations
> hbase-assembly
> hbase-checkstyle
> hbase-client
> hbase-common
> hbase-examples
> hbase-external-blockcache
> hbase-hadoop2-compat
> hbase-hadoop-compat
> hbase-it
> hbase-native-client
> hbase-prefix-tree
> hbase-procedure
> hbase-protocol
> hbase-resource-bundle
> hbase-rest
> hbase-server
> hbase-shaded
> hbase-shell
> hbase-spark
> hbase-testing-util
> hbase-thrift
> LICENSE.txt
> NOTICE.txt
> pom.xml
> README.txt
> src
> target
> ++ jps -v
> ++ grep surefirebooter
> ++ grep -e -Dhbase.test
> ++ wc -l
> + ZOMBIE_TESTS_COUNT=3
> + [[ 3 != 0 ]]
> + echo 'Suspicious java process found - waiting 30s to see if there are
> just slow to stop'
> Suspicious java process found - waiting 30s to see if there are just slow
> to stop
> + sleep 30
> ++ wc -l
> ++ grep -e -Dhbase.test
> ++ jps -v
> ++ grep surefirebooter
> + ZOMBIE_TESTS_COUNT=0
> + [[ 0 != 0 ]]
> + echo 'We'\''re ok: there is no zombie test, but some tests took some
> time to stop'
> We're ok: there is no zombie test, but some tests took some time to stop
> POST BUILD TASK : SUCCESS
> END OF POST BUILD TASK : 0
> Archiving artifacts
> Recording test results
>

Mime
  • Unnamed multipart/alternative (inline, None, 0 bytes)
View raw message