hbase-builds mailing list archives

Site index · List index
Message view « Date » · « Thread »
Top « Date » · « Thread »
From Stack <st...@duboce.net>
Subject Re: Build failed in Jenkins: HBase-1.2 » latest1.8,Hadoop #350
Date Thu, 05 Nov 2015 23:30:05 GMT
Failed on this after exhausting flakey runs.


Tests in error:
org.apache.hadoop.hbase.wal.TestBoundedRegionGroupingProvider.
testMoreRegionsThanBoundWithBoundsGreaterThanDefault(org.
apache.hadoop.hbase.wal.TestBoundedRegionGroupingProvider)
  Run 1: TestBoundedRegionGroupingProvider.testMoreRegionsThanBoundWithBoundsGreaterThanDefault:144
» IllegalState
  Run 2: TestBoundedRegionGroupingProvider.testMoreRegionsThanBoundWithBoundsGreaterThanDefault:144
» IO
  Run 3: TestBoundedRegionGroupingProvider.testMoreRegionsThanBoundWithBoundsGreaterThanDefault:144
» Connect


Looks like it hasn't really failed before... going by this:

https://builds.apache.org/job/HBase-1.2/lastCompletedBuild/jdk=latest1.8,label=Hadoop/testReport/org.apache.hadoop.hbase.wal/TestBoundedRegionGroupingProvider/testMoreRegionsThanBoundWithBoundsGreaterThanDefault/history/

The illegalstate is sort of interesting above.

Let me try take a look..


St.Ack



On Thu, Nov 5, 2015 at 2:53 PM, Apache Jenkins Server <
jenkins@builds.apache.org> wrote:

> See <
> https://builds.apache.org/job/HBase-1.2/jdk=latest1.8,label=Hadoop/350/changes
> >
>
> Changes:
>
> [eclark] HBASE-14765 Remove snappy profile
>
> ------------------------------------------
> [...truncated 46441 lines...]
> Tests run: 1, Failures: 0, Errors: 0, Skipped: 0, Time elapsed: 16.935 sec
> - in
> org.apache.hadoop.hbase.coprocessor.TestMasterCoprocessorExceptionWithAbort
> Tests run: 2, Failures: 0, Errors: 0, Skipped: 0, Time elapsed: 18.025 sec
> - in org.apache.hadoop.hbase.coprocessor.TestOpenTableInCoprocessor
> Java HotSpot(TM) 64-Bit Server VM warning: ignoring option
> MaxPermSize=256m; support was removed in 8.0
> Java HotSpot(TM) 64-Bit Server VM warning: ignoring option
> MaxPermSize=256m; support was removed in 8.0
> Java HotSpot(TM) 64-Bit Server VM warning: ignoring option
> MaxPermSize=256m; support was removed in 8.0
> Java HotSpot(TM) 64-Bit Server VM warning: ignoring option
> MaxPermSize=256m; support was removed in 8.0
> Running org.apache.hadoop.hbase.coprocessor.TestCoprocessorTableEndpoint
> Running
> org.apache.hadoop.hbase.coprocessor.TestRegionServerCoprocessorEndpoint
> Tests run: 2, Failures: 0, Errors: 0, Skipped: 0, Time elapsed: 1.411 sec
> - in org.apache.hadoop.hbase.coprocessor.TestRegionServerCoprocessorEndpoint
> Java HotSpot(TM) 64-Bit Server VM warning: ignoring option
> MaxPermSize=256m; support was removed in 8.0
> Tests run: 2, Failures: 0, Errors: 0, Skipped: 0, Time elapsed: 9.099 sec
> - in org.apache.hadoop.hbase.coprocessor.TestCoprocessorTableEndpoint
> Java HotSpot(TM) 64-Bit Server VM warning: ignoring option
> MaxPermSize=256m; support was removed in 8.0
> Running org.apache.hadoop.hbase.coprocessor.TestRegionObserverInterface
> Running
> org.apache.hadoop.hbase.coprocessor.TestMasterCoprocessorExceptionWithRemove
> Tests run: 2, Failures: 0, Errors: 0, Skipped: 0, Time elapsed: 114.757
> sec - in org.apache.hadoop.hbase.TestIOFencing
> Java HotSpot(TM) 64-Bit Server VM warning: ignoring option
> MaxPermSize=256m; support was removed in 8.0
> Tests run: 1, Failures: 0, Errors: 0, Skipped: 0, Time elapsed: 6.554 sec
> - in
> org.apache.hadoop.hbase.coprocessor.TestMasterCoprocessorExceptionWithRemove
> Java HotSpot(TM) 64-Bit Server VM warning: ignoring option
> MaxPermSize=256m; support was removed in 8.0
> Running org.apache.hadoop.hbase.coprocessor.TestAggregateProtocol
> Running org.apache.hadoop.hbase.coprocessor.TestBatchCoprocessorEndpoint
> Tests run: 4, Failures: 0, Errors: 0, Skipped: 0, Time elapsed: 2.197 sec
> - in org.apache.hadoop.hbase.coprocessor.TestBatchCoprocessorEndpoint
> Java HotSpot(TM) 64-Bit Server VM warning: ignoring option
> MaxPermSize=256m; support was removed in 8.0
> Tests run: 44, Failures: 0, Errors: 0, Skipped: 0, Time elapsed: 7.152 sec
> - in org.apache.hadoop.hbase.coprocessor.TestAggregateProtocol
> Java HotSpot(TM) 64-Bit Server VM warning: ignoring option
> MaxPermSize=256m; support was removed in 8.0
> Running org.apache.hadoop.hbase.coprocessor.TestRegionServerObserver
> Running org.apache.hadoop.hbase.coprocessor.TestHTableWrapper
> Tests run: 1, Failures: 0, Errors: 0, Skipped: 0, Time elapsed: 6.397 sec
> - in org.apache.hadoop.hbase.coprocessor.TestHTableWrapper
> Java HotSpot(TM) 64-Bit Server VM warning: ignoring option
> MaxPermSize=256m; support was removed in 8.0
> Java HotSpot(TM) 64-Bit Server VM warning: ignoring option
> MaxPermSize=256m; support was removed in 8.0
> Java HotSpot(TM) 64-Bit Server VM warning: ignoring option
> MaxPermSize=256m; support was removed in 8.0
> Tests run: 1, Failures: 0, Errors: 0, Skipped: 0, Time elapsed: 19.026 sec
> - in org.apache.hadoop.hbase.coprocessor.TestRegionServerObserver
> Java HotSpot(TM) 64-Bit Server VM warning: ignoring option
> MaxPermSize=256m; support was removed in 8.0
> Running
> org.apache.hadoop.hbase.coprocessor.TestRegionServerCoprocessorExceptionWithAbort
> Running org.apache.hadoop.hbase.coprocessor.TestClassLoading
> Tests run: 2, Failures: 0, Errors: 0, Skipped: 0, Time elapsed: 21.454 sec
> - in
> org.apache.hadoop.hbase.coprocessor.TestRegionServerCoprocessorExceptionWithAbort
> Java HotSpot(TM) 64-Bit Server VM warning: ignoring option
> MaxPermSize=256m; support was removed in 8.0
> Tests run: 14, Failures: 0, Errors: 0, Skipped: 2, Time elapsed: 82.264
> sec - in org.apache.hadoop.hbase.coprocessor.TestRegionObserverInterface
> Java HotSpot(TM) 64-Bit Server VM warning: ignoring option
> MaxPermSize=256m; support was removed in 8.0
> Running org.apache.hadoop.hbase.coprocessor.TestDoubleColumnInterpreter
> Tests run: 9, Failures: 0, Errors: 0, Skipped: 0, Time elapsed: 31.559 sec
> - in org.apache.hadoop.hbase.coprocessor.TestClassLoading
> Java HotSpot(TM) 64-Bit Server VM warning: ignoring option
> MaxPermSize=256m; support was removed in 8.0
> Tests run: 38, Failures: 0, Errors: 0, Skipped: 0, Time elapsed: 7.073 sec
> - in org.apache.hadoop.hbase.coprocessor.TestDoubleColumnInterpreter
> Java HotSpot(TM) 64-Bit Server VM warning: ignoring option
> MaxPermSize=256m; support was removed in 8.0
> Running org.apache.hadoop.hbase.coprocessor.TestRegionObserverBypass
> Tests run: 2, Failures: 0, Errors: 0, Skipped: 0, Time elapsed: 8.367 sec
> - in org.apache.hadoop.hbase.coprocessor.TestRegionObserverBypass
> Java HotSpot(TM) 64-Bit Server VM warning: ignoring option
> MaxPermSize=256m; support was removed in 8.0
> Running org.apache.hadoop.hbase.coprocessor.TestRowProcessorEndpoint
> Running org.apache.hadoop.hbase.coprocessor.TestCoprocessorStop
> Running
> org.apache.hadoop.hbase.coprocessor.TestRegionServerCoprocessorExceptionWithRemove
> Tests run: 1, Failures: 0, Errors: 0, Skipped: 0, Time elapsed: 16.402 sec
> - in org.apache.hadoop.hbase.coprocessor.TestCoprocessorStop
> Java HotSpot(TM) 64-Bit Server VM warning: ignoring option
> MaxPermSize=256m; support was removed in 8.0
> Tests run: 4, Failures: 0, Errors: 0, Skipped: 0, Time elapsed: 20.683 sec
> - in org.apache.hadoop.hbase.coprocessor.TestRowProcessorEndpoint
> Java HotSpot(TM) 64-Bit Server VM warning: ignoring option
> MaxPermSize=256m; support was removed in 8.0
> Tests run: 1, Failures: 0, Errors: 0, Skipped: 0, Time elapsed: 16.247 sec
> - in
> org.apache.hadoop.hbase.coprocessor.TestRegionServerCoprocessorExceptionWithRemove
> Java HotSpot(TM) 64-Bit Server VM warning: ignoring option
> MaxPermSize=256m; support was removed in 8.0
> Running org.apache.hadoop.hbase.coprocessor.TestBigDecimalColumnInterpreter
> Running org.apache.hadoop.hbase.coprocessor.TestMasterObserver
> Tests run: 9, Failures: 0, Errors: 0, Skipped: 0, Time elapsed: 349.872
> sec - in org.apache.hadoop.hbase.snapshot.TestExportSnapshot
> Java HotSpot(TM) 64-Bit Server VM warning: ignoring option
> MaxPermSize=256m; support was removed in 8.0
> Tests run: 38, Failures: 0, Errors: 0, Skipped: 0, Time elapsed: 6.813 sec
> - in org.apache.hadoop.hbase.coprocessor.TestBigDecimalColumnInterpreter
> Java HotSpot(TM) 64-Bit Server VM warning: ignoring option
> MaxPermSize=256m; support was removed in 8.0
> Running org.apache.hadoop.hbase.coprocessor.TestCoprocessorEndpoint
> Running org.apache.hadoop.hbase.TestGlobalMemStoreSize
> Tests run: 6, Failures: 0, Errors: 0, Skipped: 0, Time elapsed: 2.51 sec -
> in org.apache.hadoop.hbase.coprocessor.TestCoprocessorEndpoint
> Java HotSpot(TM) 64-Bit Server VM warning: ignoring option
> MaxPermSize=256m; support was removed in 8.0
> Running org.apache.hadoop.hbase.coprocessor.TestWALObserver
> Running org.apache.hadoop.hbase.TestJMXListener
> Tests run: 1, Failures: 0, Errors: 0, Skipped: 0, Time elapsed: 17.129 sec
> - in org.apache.hadoop.hbase.TestGlobalMemStoreSize
> Java HotSpot(TM) 64-Bit Server VM warning: ignoring option
> MaxPermSize=256m; support was removed in 8.0
> Java HotSpot(TM) 64-Bit Server VM warning: ignoring option
> MaxPermSize=256m; support was removed in 8.0
> Java HotSpot(TM) 64-Bit Server VM warning: ignoring option
> MaxPermSize=256m; support was removed in 8.0
> Java HotSpot(TM) 64-Bit Server VM warning: ignoring option
> MaxPermSize=256m; support was removed in 8.0
> Tests run: 6, Failures: 0, Errors: 0, Skipped: 0, Time elapsed: 8.564 sec
> - in org.apache.hadoop.hbase.coprocessor.TestWALObserver
> Java HotSpot(TM) 64-Bit Server VM warning: ignoring option
> MaxPermSize=256m; support was removed in 8.0
> Running org.apache.hadoop.hbase.TestMetaTableLocator
> Tests run: 7, Failures: 0, Errors: 0, Skipped: 0, Time elapsed: 3.523 sec
> - in org.apache.hadoop.hbase.TestMetaTableLocator
> Java HotSpot(TM) 64-Bit Server VM warning: ignoring option
> MaxPermSize=256m; support was removed in 8.0
> Running org.apache.hadoop.hbase.zookeeper.TestZKTableStateManager
> Tests run: 1, Failures: 0, Errors: 0, Skipped: 0, Time elapsed: 0.721 sec
> - in org.apache.hadoop.hbase.zookeeper.TestZKTableStateManager
> Java HotSpot(TM) 64-Bit Server VM warning: ignoring option
> MaxPermSize=256m; support was removed in 8.0
> Running org.apache.hadoop.hbase.zookeeper.TestZKMulti
> Tests run: 12, Failures: 0, Errors: 0, Skipped: 0, Time elapsed: 1.236 sec
> - in org.apache.hadoop.hbase.zookeeper.TestZKMulti
> Java HotSpot(TM) 64-Bit Server VM warning: ignoring option
> MaxPermSize=256m; support was removed in 8.0
> Running org.apache.hadoop.hbase.zookeeper.TestZooKeeperACL
> Tests run: 7, Failures: 0, Errors: 0, Skipped: 0, Time elapsed: 0.483 sec
> - in org.apache.hadoop.hbase.zookeeper.TestZooKeeperACL
> Running
> org.apache.hadoop.hbase.zookeeper.lock.TestZKInterProcessReadWriteLock
> Tests run: 2, Failures: 0, Errors: 0, Skipped: 0, Time elapsed: 16.082 sec
> - in org.apache.hadoop.hbase.TestJMXListener
> Java HotSpot(TM) 64-Bit Server VM warning: ignoring option
> MaxPermSize=256m; support was removed in 8.0
> Java HotSpot(TM) 64-Bit Server VM warning: ignoring option
> MaxPermSize=256m; support was removed in 8.0
> Java HotSpot(TM) 64-Bit Server VM warning: ignoring option
> MaxPermSize=256m; support was removed in 8.0
> Tests run: 9, Failures: 0, Errors: 0, Skipped: 0, Time elapsed: 348.616
> sec - in org.apache.hadoop.hbase.snapshot.TestSecureExportSnapshot
> Java HotSpot(TM) 64-Bit Server VM warning: ignoring option
> MaxPermSize=256m; support was removed in 8.0
> Running org.apache.hadoop.hbase.zookeeper.TestZKLeaderManager
> Java HotSpot(TM) 64-Bit Server VM warning: ignoring option
> MaxPermSize=256m; support was removed in 8.0
> Tests run: 1, Failures: 0, Errors: 0, Skipped: 0, Time elapsed: 0.16 sec -
> in org.apache.hadoop.hbase.zookeeper.TestZKLeaderManager
> Java HotSpot(TM) 64-Bit Server VM warning: ignoring option
> MaxPermSize=256m; support was removed in 8.0
> Running org.apache.hadoop.hbase.zookeeper.TestRecoverableZooKeeper
> Running org.apache.hadoop.hbase.zookeeper.TestHQuorumPeer
> Running org.apache.hadoop.hbase.zookeeper.TestZooKeeperNodeTracker
> Tests run: 1, Failures: 0, Errors: 0, Skipped: 0, Time elapsed: 1.289 sec
> - in org.apache.hadoop.hbase.zookeeper.TestRecoverableZooKeeper
> Java HotSpot(TM) 64-Bit Server VM warning: ignoring option
> MaxPermSize=256m; support was removed in 8.0
> Tests run: 7, Failures: 0, Errors: 0, Skipped: 0, Time elapsed: 41.966 sec
> - in org.apache.hadoop.hbase.coprocessor.TestMasterObserver
> Java HotSpot(TM) 64-Bit Server VM warning: ignoring option
> MaxPermSize=256m; support was removed in 8.0
> Tests run: 3, Failures: 0, Errors: 0, Skipped: 0, Time elapsed: 0.898 sec
> - in org.apache.hadoop.hbase.zookeeper.TestZooKeeperNodeTracker
> Java HotSpot(TM) 64-Bit Server VM warning: ignoring option
> MaxPermSize=256m; support was removed in 8.0
> Tests run: 4, Failures: 0, Errors: 0, Skipped: 0, Time elapsed: 1.252 sec
> - in org.apache.hadoop.hbase.zookeeper.TestHQuorumPeer
> Java HotSpot(TM) 64-Bit Server VM warning: ignoring option
> MaxPermSize=256m; support was removed in 8.0
> Running org.apache.hadoop.hbase.TestClusterBootOrder
> Running org.apache.hadoop.hbase.TestServerSideScanMetricsFromClientSide
> Tests run: 2, Failures: 0, Errors: 0, Skipped: 0, Time elapsed: 2.754 sec
> - in org.apache.hadoop.hbase.TestServerSideScanMetricsFromClientSide
> Tests run: 6, Failures: 0, Errors: 0, Skipped: 0, Time elapsed: 24.688 sec
> - in org.apache.hadoop.hbase.zookeeper.lock.TestZKInterProcessReadWriteLock
> Tests run: 2, Failures: 0, Errors: 0, Skipped: 0, Time elapsed: 27.556 sec
> - in org.apache.hadoop.hbase.TestClusterBootOrder
>
> Results :
>
> Tests in error:
>
> org.apache.hadoop.hbase.wal.TestBoundedRegionGroupingProvider.testMoreRegionsThanBoundWithBoundsGreaterThanDefault(org.apache.hadoop.hbase.wal.TestBoundedRegionGroupingProvider)
>   Run 1:
> TestBoundedRegionGroupingProvider.testMoreRegionsThanBoundWithBoundsGreaterThanDefault:144
> » IllegalState
>   Run 2:
> TestBoundedRegionGroupingProvider.testMoreRegionsThanBoundWithBoundsGreaterThanDefault:144
> » IO
>   Run 3:
> TestBoundedRegionGroupingProvider.testMoreRegionsThanBoundWithBoundsGreaterThanDefault:144
> » Connect
>
> Flaked tests:
>
> org.apache.hadoop.hbase.master.TestTableLockManager.testReapAllTableLocks(org.apache.hadoop.hbase.master.TestTableLockManager)
>   Run 1: TestTableLockManager.testReapAllTableLocks:283 » LockTimeout
> Timed out acquiri...
>   Run 2: TestTableLockManager.testReapAllTableLocks:283 » LockTimeout
> Timed out acquiri...
>   Run 3: PASS
>
>
> Tests run: 2326, Failures: 0, Errors: 1, Skipped: 40, Flakes: 1
>
> [INFO]
> ------------------------------------------------------------------------
> [INFO] Reactor Summary:
> [INFO]
> [INFO] Apache HBase ...................................... SUCCESS
> [1:27.891s]
> [INFO] Apache HBase - Checkstyle ......................... SUCCESS [7.248s]
> [INFO] Apache HBase - Resource Bundle .................... SUCCESS [0.221s]
> [INFO] Apache HBase - Annotations ........................ SUCCESS [1.018s]
> [INFO] Apache HBase - Protocol ........................... SUCCESS
> [19.358s]
> [INFO] Apache HBase - Common ............................. SUCCESS
> [2:47.482s]
> [INFO] Apache HBase - Procedure .......................... SUCCESS
> [1:56.344s]
> [INFO] Apache HBase - Client ............................. SUCCESS
> [1:30.131s]
> [INFO] Apache HBase - Hadoop Compatibility ............... SUCCESS [8.438s]
> [INFO] Apache HBase - Hadoop Two Compatibility ........... SUCCESS [9.183s]
> [INFO] Apache HBase - Prefix Tree ........................ SUCCESS [8.738s]
> [INFO] Apache HBase - Server ............................. FAILURE
> [1:29:54.544s]
> [INFO] Apache HBase - Testing Util ....................... SKIPPED
> [INFO] Apache HBase - Thrift ............................. SKIPPED
> [INFO] Apache HBase - Rest ............................... SKIPPED
> [INFO] Apache HBase - Shell .............................. SKIPPED
> [INFO] Apache HBase - Integration Tests .................. SKIPPED
> [INFO] Apache HBase - Examples ........................... SKIPPED
> [INFO] Apache HBase - External Block Cache ............... SKIPPED
> [INFO] Apache HBase - Assembly ........................... SKIPPED
> [INFO] Apache HBase - Shaded ............................. SKIPPED
> [INFO] Apache HBase - Shaded - Client .................... SKIPPED
> [INFO] Apache HBase - Shaded - Server .................... SKIPPED
> [INFO]
> ------------------------------------------------------------------------
> [INFO] BUILD FAILURE
> [INFO]
> ------------------------------------------------------------------------
> [INFO] Total time: 1:38:55.394s
> [INFO] Finished at: Thu Nov 05 22:50:48 UTC 2015
> [INFO] Final Memory: 94M/632M
> [INFO]
> ------------------------------------------------------------------------
> [ERROR] Failed to execute goal
> org.apache.maven.plugins:maven-surefire-plugin:2.18.1:test
> (secondPartTestsExecution) on project hbase-server: There are test failures.
> [ERROR]
> [ERROR] Please refer to <
> https://builds.apache.org/job/HBase-1.2/jdk=latest1.8,label=Hadoop/ws/hbase-server/target/surefire-reports>
> for the individual test results.
> [ERROR] -> [Help 1]
> [ERROR]
> [ERROR] To see the full stack trace of the errors, re-run Maven with the
> -e switch.
> [ERROR] Re-run Maven using the -X switch to enable full debug logging.
> [ERROR]
> [ERROR] For more information about the errors and possible solutions,
> please read the following articles:
> [ERROR] [Help 1]
> http://cwiki.apache.org/confluence/display/MAVEN/MojoFailureException
> [ERROR]
> [ERROR] After correcting the problems, you can resume the build with the
> command
> [ERROR]   mvn <goals> -rf :hbase-server
> Build step 'Invoke top-level Maven targets' marked build as failure
> Performing Post build task...
> Match found for :.* : True
> Logical operation result is TRUE
> Running script  : # Post-build task script. TODO: Check this in and have
> all builds reference check-in.
> pwd && ls
> # NOTE!!!! The below code has been copied and pasted from
> ./dev-tools/run-test.sh
> # Do not change here without syncing there and vice-versa.
> ZOMBIE_TESTS_COUNT=`jps -v | grep surefirebooter | grep -e '-Dhbase.test'
> | wc -l`
> if [[ $ZOMBIE_TESTS_COUNT != 0 ]] ; then
>  echo "Suspicious java process found - waiting 30s to see if there are
> just slow to stop"
>  sleep 30
>  ZOMBIE_TESTS_COUNT=`jps -v | grep surefirebooter | grep -e '-Dhbase.test'
> | wc -l`
>  if [[ $ZOMBIE_TESTS_COUNT != 0 ]] ; then
>    echo " {color:red}There appear to be $ZOMBIE_TESTS_COUNT zombie
> tests{color}, they should have been killed by surefire but survived"
>    jps -v | grep surefirebooter | grep -e '-Dhbase.test'
>    jps -v | grep surefirebooter | grep -e '-Dhbase.test' | cut -d ' ' -f 1
> | xargs -n 1 jstack
>    # Exit with error
>    exit 1
>  else
>    echo "We're ok: there is no zombie test, but some tests took some time
> to stop"
>  fi
> else
>   echo "We're ok: there is no zombie test"
> fi
> [Hadoop] $ /bin/bash -xe /tmp/hudson7614527210856095774.sh
> + pwd
> <https://builds.apache.org/job/HBase-1.2/jdk=latest1.8,label=Hadoop/ws/>
> + ls
> bin
> CHANGES.txt
> conf
> dev-support
> hbase-annotations
> hbase-assembly
> hbase-checkstyle
> hbase-client
> hbase-common
> hbase-examples
> hbase-external-blockcache
> hbase-hadoop2-compat
> hbase-hadoop-compat
> hbase-it
> hbase-native-client
> hbase-prefix-tree
> hbase-procedure
> hbase-protocol
> hbase-resource-bundle
> hbase-rest
> hbase-server
> hbase-shaded
> hbase-shell
> hbase-spark
> hbase-testing-util
> hbase-thrift
> LICENSE.txt
> NOTICE.txt
> pom.xml
> README.txt
> src
> target
> ++ jps -v
> ++ grep surefirebooter
> ++ grep -e -Dhbase.test
> ++ wc -l
> + ZOMBIE_TESTS_COUNT=0
> + [[ 0 != 0 ]]
> + echo 'We'\''re ok: there is no zombie test'
> We're ok: there is no zombie test
> POST BUILD TASK : SUCCESS
> END OF POST BUILD TASK : 0
> Archiving artifacts
> Recording test results
>

Mime
  • Unnamed multipart/alternative (inline, None, 0 bytes)
View raw message