hbase-builds mailing list archives

Site index · List index
Message view « Date » · « Thread »
Top « Date » · « Thread »
From Apache Jenkins Server <jenk...@builds.apache.org>
Subject Build failed in Jenkins: HBase-Trunk_matrix » latest1.8,Hadoop #447
Date Sun, 08 Nov 2015 20:48:54 GMT
See <https://builds.apache.org/job/HBase-Trunk_matrix/jdk=latest1.8,label=Hadoop/447/changes>

Changes:

[tedyu] HBASE-14784 Port conflict is not resolved in

------------------------------------------
[...truncated 6217 lines...]
Java HotSpot(TM) 64-Bit Server VM warning: ignoring option MaxPermSize=256m; support was removed
in 8.0
Tests run: 9, Failures: 0, Errors: 0, Skipped: 0, Time elapsed: 432.032 sec - in org.apache.hadoop.hbase.replication.regionserver.TestRegionReplicaReplicationEndpoint
Java HotSpot(TM) 64-Bit Server VM warning: ignoring option MaxPermSize=256m; support was removed
in 8.0
Tests run: 1, Failures: 0, Errors: 0, Skipped: 0, Time elapsed: 170.522 sec - in org.apache.hadoop.hbase.replication.TestReplicationKillMasterRS
Java HotSpot(TM) 64-Bit Server VM warning: ignoring option MaxPermSize=256m; support was removed
in 8.0
Running org.apache.hadoop.hbase.replication.multiwal.TestReplicationKillMasterRSCompressedWithMultipleWAL
Running org.apache.hadoop.hbase.replication.multiwal.TestReplicationSyncUpToolWithMultipleWAL
Running org.apache.hadoop.hbase.replication.TestPerTableCFReplication
Running org.apache.hadoop.hbase.replication.multiwal.TestReplicationEndpointWithMultipleWAL
Tests run: 3, Failures: 0, Errors: 0, Skipped: 0, Time elapsed: 8.379 sec - in org.apache.hadoop.hbase.replication.multiwal.TestReplicationEndpointWithMultipleWAL
Java HotSpot(TM) 64-Bit Server VM warning: ignoring option MaxPermSize=256m; support was removed
in 8.0
Tests run: 2, Failures: 0, Errors: 0, Skipped: 0, Time elapsed: 55.257 sec - in org.apache.hadoop.hbase.replication.TestPerTableCFReplication
Java HotSpot(TM) 64-Bit Server VM warning: ignoring option MaxPermSize=256m; support was removed
in 8.0
Running org.apache.hadoop.hbase.replication.TestMasterReplication
Tests run: 1, Failures: 0, Errors: 0, Skipped: 0, Time elapsed: 180.182 sec - in org.apache.hadoop.hbase.replication.TestReplicationKillSlaveRS
Java HotSpot(TM) 64-Bit Server VM warning: ignoring option MaxPermSize=256m; support was removed
in 8.0
Tests run: 1, Failures: 0, Errors: 0, Skipped: 0, Time elapsed: 114.78 sec - in org.apache.hadoop.hbase.replication.multiwal.TestReplicationSyncUpToolWithMultipleWAL
Java HotSpot(TM) 64-Bit Server VM warning: ignoring option MaxPermSize=256m; support was removed
in 8.0
Running org.apache.hadoop.hbase.replication.TestReplicationDisableInactivePeer
Tests run: 1, Failures: 0, Errors: 0, Skipped: 0, Time elapsed: 31.9 sec - in org.apache.hadoop.hbase.replication.TestReplicationDisableInactivePeer
Java HotSpot(TM) 64-Bit Server VM warning: ignoring option MaxPermSize=256m; support was removed
in 8.0
Running org.apache.hadoop.hbase.replication.TestReplicationWithTags
Tests run: 1, Failures: 0, Errors: 0, Skipped: 0, Time elapsed: 9.974 sec - in org.apache.hadoop.hbase.replication.TestReplicationWithTags
Java HotSpot(TM) 64-Bit Server VM warning: ignoring option MaxPermSize=256m; support was removed
in 8.0
Tests run: 1, Failures: 0, Errors: 0, Skipped: 0, Time elapsed: 195.746 sec - in org.apache.hadoop.hbase.replication.multiwal.TestReplicationKillMasterRSCompressedWithMultipleWAL
Java HotSpot(TM) 64-Bit Server VM warning: ignoring option MaxPermSize=256m; support was removed
in 8.0
Java HotSpot(TM) 64-Bit Server VM warning: ignoring option MaxPermSize=256m; support was removed
in 8.0
Running org.apache.hadoop.hbase.replication.TestReplicationSource
Running org.apache.hadoop.hbase.replication.TestReplicationEndpoint
Tests run: 1, Failures: 0, Errors: 0, Skipped: 0, Time elapsed: 1.282 sec - in org.apache.hadoop.hbase.replication.TestReplicationSource
Java HotSpot(TM) 64-Bit Server VM warning: ignoring option MaxPermSize=256m; support was removed
in 8.0
Tests run: 3, Failures: 0, Errors: 0, Skipped: 0, Time elapsed: 6.474 sec - in org.apache.hadoop.hbase.replication.TestReplicationEndpoint
Java HotSpot(TM) 64-Bit Server VM warning: ignoring option MaxPermSize=256m; support was removed
in 8.0
Running org.apache.hadoop.hbase.replication.TestReplicationStateZKImpl
Java HotSpot(TM) 64-Bit Server VM warning: ignoring option MaxPermSize=256m; support was removed
in 8.0
Tests run: 6, Failures: 0, Errors: 0, Skipped: 0, Time elapsed: 2.938 sec - in org.apache.hadoop.hbase.replication.TestReplicationStateZKImpl
Java HotSpot(TM) 64-Bit Server VM warning: ignoring option MaxPermSize=256m; support was removed
in 8.0
Java HotSpot(TM) 64-Bit Server VM warning: ignoring option MaxPermSize=256m; support was removed
in 8.0
Java HotSpot(TM) 64-Bit Server VM warning: ignoring option MaxPermSize=256m; support was removed
in 8.0
Running org.apache.hadoop.hbase.fs.TestBlockReorder
Java HotSpot(TM) 64-Bit Server VM warning: ignoring option MaxPermSize=256m; support was removed
in 8.0
Java HotSpot(TM) 64-Bit Server VM warning: ignoring option MaxPermSize=256m; support was removed
in 8.0
Java HotSpot(TM) 64-Bit Server VM warning: ignoring option MaxPermSize=256m; support was removed
in 8.0
Running org.apache.hadoop.hbase.replication.TestReplicationSmallTests
Tests run: 3, Failures: 0, Errors: 0, Skipped: 0, Time elapsed: 152.265 sec - in org.apache.hadoop.hbase.replication.TestMasterReplication
Java HotSpot(TM) 64-Bit Server VM warning: ignoring option MaxPermSize=256m; support was removed
in 8.0
Running org.apache.hadoop.hbase.TestMovedRegionsCleaner
Running org.apache.hadoop.hbase.trace.TestHTraceHooks
Tests run: 1, Failures: 0, Errors: 0, Skipped: 0, Time elapsed: 10.305 sec - in org.apache.hadoop.hbase.trace.TestHTraceHooks
Java HotSpot(TM) 64-Bit Server VM warning: ignoring option MaxPermSize=256m; support was removed
in 8.0
Running org.apache.hadoop.hbase.replication.TestReplicationSyncUpTool
Java HotSpot(TM) 64-Bit Server VM warning: ignoring option MaxPermSize=256m; support was removed
in 8.0
Java HotSpot(TM) 64-Bit Server VM warning: ignoring option MaxPermSize=256m; support was removed
in 8.0
Java HotSpot(TM) 64-Bit Server VM warning: ignoring option MaxPermSize=256m; support was removed
in 8.0
Tests run: 1, Failures: 0, Errors: 0, Skipped: 0, Time elapsed: 37.37 sec - in org.apache.hadoop.hbase.TestMovedRegionsCleaner
Java HotSpot(TM) 64-Bit Server VM warning: ignoring option MaxPermSize=256m; support was removed
in 8.0
Java HotSpot(TM) 64-Bit Server VM warning: ignoring option MaxPermSize=256m; support was removed
in 8.0
Java HotSpot(TM) 64-Bit Server VM warning: ignoring option MaxPermSize=256m; support was removed
in 8.0
Java HotSpot(TM) 64-Bit Server VM warning: ignoring option MaxPermSize=256m; support was removed
in 8.0
Java HotSpot(TM) 64-Bit Server VM warning: ignoring option MaxPermSize=256m; support was removed
in 8.0
Java HotSpot(TM) 64-Bit Server VM warning: ignoring option MaxPermSize=256m; support was removed
in 8.0
Java HotSpot(TM) 64-Bit Server VM warning: ignoring option MaxPermSize=256m; support was removed
in 8.0
Java HotSpot(TM) 64-Bit Server VM warning: ignoring option MaxPermSize=256m; support was removed
in 8.0
Java HotSpot(TM) 64-Bit Server VM warning: ignoring option MaxPermSize=256m; support was removed
in 8.0
Java HotSpot(TM) 64-Bit Server VM warning: ignoring option MaxPermSize=256m; support was removed
in 8.0
Java HotSpot(TM) 64-Bit Server VM warning: ignoring option MaxPermSize=256m; support was removed
in 8.0
Java HotSpot(TM) 64-Bit Server VM warning: ignoring option MaxPermSize=256m; support was removed
in 8.0
Tests run: 3, Failures: 0, Errors: 0, Skipped: 0, Time elapsed: 80.916 sec - in org.apache.hadoop.hbase.fs.TestBlockReorder
Java HotSpot(TM) 64-Bit Server VM warning: ignoring option MaxPermSize=256m; support was removed
in 8.0
Running org.apache.hadoop.hbase.TestMetaTableLocator
Java HotSpot(TM) 64-Bit Server VM warning: ignoring option MaxPermSize=256m; support was removed
in 8.0
Tests run: 7, Failures: 0, Errors: 0, Skipped: 0, Time elapsed: 7.321 sec - in org.apache.hadoop.hbase.TestMetaTableLocator
Java HotSpot(TM) 64-Bit Server VM warning: ignoring option MaxPermSize=256m; support was removed
in 8.0
Java HotSpot(TM) 64-Bit Server VM warning: ignoring option MaxPermSize=256m; support was removed
in 8.0
Running org.apache.hadoop.hbase.namespace.TestNamespaceAuditor
Running org.apache.hadoop.hbase.mapred.TestTableMapReduceUtil
Tests run: 10, Failures: 0, Errors: 0, Skipped: 0, Time elapsed: 140.137 sec - in org.apache.hadoop.hbase.replication.TestReplicationSmallTests
Java HotSpot(TM) 64-Bit Server VM warning: ignoring option MaxPermSize=256m; support was removed
in 8.0
Running org.apache.hadoop.hbase.mapred.TestMultiTableSnapshotInputFormat
Java HotSpot(TM) 64-Bit Server VM warning: ignoring option MaxPermSize=256m; support was removed
in 8.0
Java HotSpot(TM) 64-Bit Server VM warning: ignoring option MaxPermSize=256m; support was removed
in 8.0
Running org.apache.hadoop.hbase.mapred.TestTableSnapshotInputFormat
Tests run: 4, Failures: 0, Errors: 0, Skipped: 0, Time elapsed: 44.149 sec - in org.apache.hadoop.hbase.mapred.TestTableMapReduceUtil
Java HotSpot(TM) 64-Bit Server VM warning: ignoring option MaxPermSize=256m; support was removed
in 8.0
Tests run: 1, Failures: 0, Errors: 0, Skipped: 0, Time elapsed: 109.111 sec - in org.apache.hadoop.hbase.replication.TestReplicationSyncUpTool
Java HotSpot(TM) 64-Bit Server VM warning: ignoring option MaxPermSize=256m; support was removed
in 8.0
Java HotSpot(TM) 64-Bit Server VM warning: ignoring option MaxPermSize=256m; support was removed
in 8.0
Java HotSpot(TM) 64-Bit Server VM warning: ignoring option MaxPermSize=256m; support was removed
in 8.0
Running org.apache.hadoop.hbase.mapred.TestTableInputFormat
Running org.apache.hadoop.hbase.mapred.TestTableMapReduce
Tests run: 8, Failures: 0, Errors: 0, Skipped: 0, Time elapsed: 32.073 sec - in org.apache.hadoop.hbase.mapred.TestTableInputFormat
Java HotSpot(TM) 64-Bit Server VM warning: ignoring option MaxPermSize=256m; support was removed
in 8.0
Tests run: 12, Failures: 0, Errors: 0, Skipped: 0, Time elapsed: 154.446 sec - in org.apache.hadoop.hbase.namespace.TestNamespaceAuditor
Running org.apache.hadoop.hbase.TestMultiVersions
Tests run: 2, Failures: 0, Errors: 0, Skipped: 0, Time elapsed: 56.9 sec - in org.apache.hadoop.hbase.mapred.TestTableMapReduce
Tests run: 4, Failures: 0, Errors: 0, Skipped: 0, Time elapsed: 125.126 sec - in org.apache.hadoop.hbase.mapred.TestMultiTableSnapshotInputFormat
Tests run: 3, Failures: 0, Errors: 0, Skipped: 0, Time elapsed: 20.524 sec - in org.apache.hadoop.hbase.TestMultiVersions
Tests run: 7, Failures: 0, Errors: 0, Skipped: 0, Time elapsed: 247.385 sec - in org.apache.hadoop.hbase.mapred.TestTableSnapshotInputFormat

Results :

Failed tests: 
  TestBlockEvictionFromClient.testParallelGetsAndScans:285->checkForBlockEviction:1132
expected:<4> but was:<6>
  TestSplitTransactionOnCluster.testSSHCleanupDaugtherRegionsOfAbortedSplit:995 {7beed463e94aa2d740f09804a2abc0ab={7beed463e94aa2d740f09804a2abc0ab
state=SPLITTING_NEW, ts=1447008331925, server=asf907.gq1.ygridcore.net,47053,1447008311641},
1ac665848fbc476f0f9a7ee6f8de478f={1ac665848fbc476f0f9a7ee6f8de478f state=SPLITTING_NEW, ts=1447008331925,
server=asf907.gq1.ygridcore.net,47053,1447008311641}, a5f51256e6c7f43aeabe97691e464ebc={a5f51256e6c7f43aeabe97691e464ebc
state=SPLITTING, ts=1447008331920, server=asf907.gq1.ygridcore.net,47053,1447008311641}} expected:<0>
but was:<3>
Tests in error: 
  TestFailedAppendAndSync.testLockupAroundBadAssignSync:239 » TestTimedOut test ...

Tests run: 2406, Failures: 2, Errors: 1, Skipped: 40

[INFO] ------------------------------------------------------------------------
[INFO] Reactor Summary:
[INFO] 
[INFO] Apache HBase ...................................... SUCCESS [  8.488 s]
[INFO] Apache HBase - Checkstyle ......................... SUCCESS [  1.781 s]
[INFO] Apache HBase - Resource Bundle .................... SUCCESS [  0.348 s]
[INFO] Apache HBase - Annotations ........................ SUCCESS [  0.415 s]
[INFO] Apache HBase - Protocol ........................... SUCCESS [  4.591 s]
[INFO] Apache HBase - Common ............................. SUCCESS [02:47 min]
[INFO] Apache HBase - Procedure .......................... SUCCESS [01:25 min]
[INFO] Apache HBase - Client ............................. SUCCESS [01:19 min]
[INFO] Apache HBase - Hadoop Compatibility ............... SUCCESS [ 13.416 s]
[INFO] Apache HBase - Hadoop Two Compatibility ........... SUCCESS [ 19.670 s]
[INFO] Apache HBase - Prefix Tree ........................ SUCCESS [ 22.702 s]
[INFO] Apache HBase - Server ............................. FAILURE [  02:47 h]
[INFO] Apache HBase - Testing Util ....................... SKIPPED
[INFO] Apache HBase - Thrift ............................. SKIPPED
[INFO] Apache HBase - Shell .............................. SKIPPED
[INFO] Apache HBase - Integration Tests .................. SKIPPED
[INFO] Apache HBase - Examples ........................... SKIPPED
[INFO] Apache HBase - Rest ............................... SKIPPED
[INFO] Apache HBase - External Block Cache ............... SKIPPED
[INFO] Apache HBase - Assembly ........................... SKIPPED
[INFO] Apache HBase - Shaded ............................. SKIPPED
[INFO] Apache HBase - Shaded - Client .................... SKIPPED
[INFO] Apache HBase - Shaded - Server .................... SKIPPED
[INFO] Apache HBase - Spark .............................. SKIPPED
[INFO] ------------------------------------------------------------------------
[INFO] BUILD FAILURE
[INFO] ------------------------------------------------------------------------
[INFO] Total time: 02:54 h
[INFO] Finished at: 2015-11-08T20:43:07+00:00
[INFO] Final Memory: 63M/1643M
[INFO] ------------------------------------------------------------------------
[ERROR] Failed to execute goal org.apache.maven.plugins:maven-surefire-plugin:2.18.1:test
(secondPartTestsExecution) on project hbase-server: There was a timeout or other error in
the fork -> [Help 1]
[ERROR] 
[ERROR] To see the full stack trace of the errors, re-run Maven with the -e switch.
[ERROR] Re-run Maven using the -X switch to enable full debug logging.
[ERROR] 
[ERROR] For more information about the errors and possible solutions, please read the following
articles:
[ERROR] [Help 1] http://cwiki.apache.org/confluence/display/MAVEN/MojoFailureException
[ERROR] 
[ERROR] After correcting the problems, you can resume the build with the command
[ERROR]   mvn <goals> -rf :hbase-server
Build step 'Invoke top-level Maven targets' marked build as failure
Performing Post build task...
Match found for :.* : True
Logical operation result is TRUE
Running script  : # Post-build task script. TODO: Check this in and have all builds reference
check-in.
./dev-support/zombie-detector.sh --jenkins ${BUILD_ID}
# NOTE!!!! The below code has been copied and pasted from ./dev-tools/run-test.sh
# Do not change here without syncing there and vice-versa.
ZOMBIE_TESTS_COUNT=`jps -v | grep surefirebooter | grep -e '-Dhbase.test' | wc -l`
if [[ $ZOMBIE_TESTS_COUNT != 0 ]] ; then
 echo "Suspicious java process found - waiting 30s to see if there are just slow to stop"
 sleep 30
 ZOMBIE_TESTS_COUNT=`jps -v | grep surefirebooter | grep -e '-Dhbase.test' | wc -l`
 if [[ $ZOMBIE_TESTS_COUNT != 0 ]] ; then
   echo " {color:red}There appear to be $ZOMBIE_TESTS_COUNT zombie tests{color}, they should
have been killed by surefire but survived"
   jps -v | grep surefirebooter | grep -e '-Dhbase.test'
   jps -v | grep surefirebooter | grep -e '-Dhbase.test' | cut -d ' ' -f 1 | xargs -n 1 jstack
   # Exit with error
   exit 1
 else
   echo "We're ok: there is no zombie test, but some tests took some time to stop"
 fi
else
  echo "We're ok: there is no zombie test"
fi
[Hadoop] $ /bin/bash -xe /tmp/hudson2547164423410774678.sh
+ ./dev-support/zombie-detector.sh --jenkins 447
XDG_SESSION_ID=15
BUILD_URL=https://builds.apache.org/job/HBase-Trunk_matrix/jdk=latest1.8,label=Hadoop/447/
export=MAVEN_OPTS="-Xmx6100M -XX:-UsePerfData"
SHELL=/bin/bash
HUDSON_SERVER_COOKIE=f4ebd1e6b0d976e8
SSH_CLIENT=140.211.11.14 51367 22
TMPDIR=/tmp/user/10021
BUILD_TAG=jenkins-HBase-Trunk_matrix-jdk=latest1.8,label=Hadoop-447
label=Hadoop
GIT_PREVIOUS_COMMIT=305ecaf224340b0f6e248d4fdabf0b53e1cd3b03
ROOT_BUILD_CAUSE=SCMTRIGGER
JOB_URL=https://builds.apache.org/job/HBase-Trunk_matrix/jdk=latest1.8,label=Hadoop/
WORKSPACE=<https://builds.apache.org/job/HBase-Trunk_matrix/jdk=latest1.8,label=Hadoop/ws/>
USER=jenkins
TEMP=/tmp/user/10021
BUILD_CAUSE_UPSTREAMTRIGGER=true
GIT_AUTHOR_NAME=jenkins
GIT_COMMITTER_NAME=jenkins
JENKINS_HOME=/x1/jenkins/jenkins-home
GIT_COMMIT=6b9d30d9133ae011f6e76369efc1ee4c0a66465d
MAIL=/var/mail/jenkins
PATH=/home/jenkins/jenkins-slave/tools/hudson.model.JDK/latest1.8/bin:/usr/local/sbin:/usr/local/bin:/usr/sbin:/usr/bin:/sbin:/bin:/usr/games:/usr/local/games
ROOT_BUILD_CAUSE_SCMTRIGGER=true
TEMPDIR=/tmp/user/10021
_=/usr/bin/printenv
GIT_COMMITTER_EMAIL=builds@apache.org
PWD=<https://builds.apache.org/job/HBase-Trunk_matrix/jdk=latest1.8,label=Hadoop/ws/>
JAVA_HOME=/home/jenkins/jenkins-slave/tools/hudson.model.JDK/latest1.8
HUDSON_URL=https://builds.apache.org/
LANG=en_US
JOB_NAME=HBase-Trunk_matrix/jdk=latest1.8,label=Hadoop
jdk=latest1.8
BUILD_DISPLAY_NAME=#447
JENKINS_URL=https://builds.apache.org/
BUILD_ID=447
BUILD_CAUSE=UPSTREAMTRIGGER
GIT_PREVIOUS_SUCCESSFUL_COMMIT=305ecaf224340b0f6e248d4fdabf0b53e1cd3b03
SHLVL=3
HOME=/home/jenkins
GIT_BRANCH=origin/master
EXECUTOR_NUMBER=0
JENKINS_SERVER_COOKIE=f4ebd1e6b0d976e8
NODE_LABELS=Falcon H7 Hadoop Hdfs Mapreduce Pig Tez Zookeeper
GIT_URL=https://git-wip-us.apache.org/repos/asf/hbase.git
TMP=/tmp/user/10021
LOGNAME=jenkins
HUDSON_HOME=/x1/jenkins/jenkins-home
SSH_CONNECTION=140.211.11.14 51367 67.195.81.151 22
NODE_NAME=H7
BUILD_NUMBER=447
HUDSON_COOKIE=a828fcc6-b5ea-49f7-bf75-d85b22a3e331
XDG_RUNTIME_DIR=/run/user/10021
GIT_AUTHOR_EMAIL=builds@apache.org
Running in Jenkins mode
Found 1 suspicious java process(es); waiting 15s to see if just slow to stop
++ jps -v
++ grep surefirebooter
++ grep -e -Dhbase.test
++ wc -l
+ ZOMBIE_TESTS_COUNT=0
+ [[ 0 != 0 ]]
+ echo 'We'\''re ok: there is no zombie test'
We're ok: there is no zombie test
POST BUILD TASK : SUCCESS
END OF POST BUILD TASK : 0
Archiving artifacts
Recording test results
[FINDBUGS] Skipping publisher since build result is FAILURE
[CHECKSTYLE] Skipping publisher since build result is FAILURE

Mime
View raw message