hbase-builds mailing list archives

Site index · List index
Message view « Date » · « Thread »
Top « Date » · « Thread »
From Apache Jenkins Server <jenk...@builds.apache.org>
Subject Build failed in Jenkins: HBase-1.0 #1110
Date Wed, 11 Nov 2015 17:38:46 GMT
See <https://builds.apache.org/job/HBase-1.0/1110/changes>

Changes:

[jmhsieh] HBASE-14780 Integration Test that run with chaos monkey must specify cfs

[jmhsieh] HBASe-14731 ADDENDEUM - remove extra imports from branch-1.0

[jmhsieh] Revert "HBASe-14731 ADDENDEUM - remove extra imports from branch-1.0"

[jmhsieh] HBASE-14780 ADDENDEUM - remove extra imports from branch-1.0

------------------------------------------
[...truncated 1843 lines...]
Running org.apache.hadoop.hbase.filter.TestColumnRangeFilter
Running org.apache.hadoop.hbase.filter.TestScanRowPrefix
Tests run: 1, Failures: 0, Errors: 0, Skipped: 0, Time elapsed: 16.682 sec - in org.apache.hadoop.hbase.filter.TestColumnRangeFilter
Tests run: 1, Failures: 0, Errors: 0, Skipped: 0, Time elapsed: 3.618 sec - in org.apache.hadoop.hbase.filter.TestScanRowPrefix
Running org.apache.hadoop.hbase.filter.TestFuzzyRowFilterEndToEnd
Running org.apache.hadoop.hbase.TestHBaseTestingUtility
Running org.apache.hadoop.hbase.filter.TestFilterWithScanLimits
Tests run: 1, Failures: 0, Errors: 0, Skipped: 0, Time elapsed: 2.9 sec - in org.apache.hadoop.hbase.filter.TestFilterWithScanLimits
Running org.apache.hadoop.hbase.io.encoding.TestDataBlockEncoders
Tests run: 9, Failures: 0, Errors: 0, Skipped: 0, Time elapsed: 79.006 sec - in org.apache.hadoop.hbase.TestHBaseTestingUtility
Tests run: 9, Failures: 0, Errors: 0, Skipped: 0, Time elapsed: 604.819 sec - in org.apache.hadoop.hbase.snapshot.TestSecureExportSnapshot
Running org.apache.hadoop.hbase.io.encoding.TestEncodedSeekers
Running org.apache.hadoop.hbase.io.encoding.TestChangingEncoding
Tests run: 9, Failures: 0, Errors: 0, Skipped: 0, Time elapsed: 563.875 sec - in org.apache.hadoop.hbase.snapshot.TestExportSnapshot
Running org.apache.hadoop.hbase.io.encoding.TestBufferedDataBlockEncoder
Tests run: 1, Failures: 0, Errors: 0, Skipped: 0, Time elapsed: 31.126 sec - in org.apache.hadoop.hbase.io.encoding.TestBufferedDataBlockEncoder
Running org.apache.hadoop.hbase.io.encoding.TestLoadAndSwitchEncodeOnDisk
Tests run: 3, Failures: 0, Errors: 0, Skipped: 0, Time elapsed: 94.22 sec - in org.apache.hadoop.hbase.io.encoding.TestChangingEncoding
Running org.apache.hadoop.hbase.io.hfile.TestScannerSelectionUsingTTL
Tests run: 2, Failures: 0, Errors: 0, Skipped: 0, Time elapsed: 224.399 sec - in org.apache.hadoop.hbase.filter.TestFuzzyRowFilterEndToEnd
Running org.apache.hadoop.hbase.io.hfile.TestHFileBlock
Tests run: 1, Failures: 0, Errors: 0, Skipped: 0, Time elapsed: 42.95 sec - in org.apache.hadoop.hbase.io.encoding.TestLoadAndSwitchEncodeOnDisk
Running org.apache.hadoop.hbase.io.hfile.TestCacheOnWrite
Tests run: 6, Failures: 0, Errors: 0, Skipped: 0, Time elapsed: 67.938 sec - in org.apache.hadoop.hbase.io.hfile.TestScannerSelectionUsingTTL
Running org.apache.hadoop.hbase.io.hfile.TestHFileBlockIndex
Tests run: 10, Failures: 0, Errors: 0, Skipped: 0, Time elapsed: 26.374 sec - in org.apache.hadoop.hbase.io.hfile.TestHFileBlockIndex
Running org.apache.hadoop.hbase.io.hfile.TestHFileSeek
Tests run: 28, Failures: 0, Errors: 0, Skipped: 0, Time elapsed: 104.912 sec - in org.apache.hadoop.hbase.io.hfile.TestHFileBlock
Tests run: 1, Failures: 0, Errors: 0, Skipped: 0, Time elapsed: 5.332 sec - in org.apache.hadoop.hbase.io.hfile.TestHFileSeek
Running org.apache.hadoop.hbase.io.hfile.TestSeekBeforeWithInlineBlocks
Running org.apache.hadoop.hbase.io.hfile.TestCacheConfig
Tests run: 6, Failures: 0, Errors: 0, Skipped: 0, Time elapsed: 3.659 sec - in org.apache.hadoop.hbase.io.hfile.TestCacheConfig
Running org.apache.hadoop.hbase.io.hfile.TestForceCacheImportantBlocks
Tests run: 1, Failures: 0, Errors: 0, Skipped: 0, Time elapsed: 22.429 sec - in org.apache.hadoop.hbase.io.hfile.TestSeekBeforeWithInlineBlocks
Tests run: 20, Failures: 0, Errors: 0, Skipped: 0, Time elapsed: 262.731 sec - in org.apache.hadoop.hbase.io.encoding.TestEncodedSeekers
Running org.apache.hadoop.hbase.io.TestFileLink
Running org.apache.hadoop.hbase.procedure.TestZKProcedure
Tests run: 4, Failures: 0, Errors: 0, Skipped: 0, Time elapsed: 4.166 sec - in org.apache.hadoop.hbase.procedure.TestZKProcedure
Running org.apache.hadoop.hbase.procedure.TestZKProcedureControllers
Tests run: 4, Failures: 0, Errors: 0, Skipped: 0, Time elapsed: 3.303 sec - in org.apache.hadoop.hbase.procedure.TestZKProcedureControllers
Running org.apache.hadoop.hbase.TestHBaseOnOtherDfsCluster
Tests run: 3, Failures: 0, Errors: 0, Skipped: 0, Time elapsed: 29.144 sec - in org.apache.hadoop.hbase.io.TestFileLink
Running org.apache.hadoop.hbase.ipc.TestHBaseClient
Tests run: 1, Failures: 0, Errors: 0, Skipped: 0, Time elapsed: 0.662 sec - in org.apache.hadoop.hbase.ipc.TestHBaseClient
Running org.apache.hadoop.hbase.ipc.TestDelayedRpc
Tests run: 1, Failures: 0, Errors: 0, Skipped: 0, Time elapsed: 19.587 sec - in org.apache.hadoop.hbase.TestHBaseOnOtherDfsCluster
Running org.apache.hadoop.hbase.ipc.TestProtoBufRpc
Tests run: 1, Failures: 0, Errors: 0, Skipped: 0, Time elapsed: 3.213 sec - in org.apache.hadoop.hbase.ipc.TestProtoBufRpc
Tests run: 4, Failures: 0, Errors: 0, Skipped: 0, Time elapsed: 5.777 sec - in org.apache.hadoop.hbase.ipc.TestDelayedRpc
Running org.apache.hadoop.hbase.TestLocalHBaseCluster
Running org.apache.hadoop.hbase.TestAcidGuarantees
Tests run: 4, Failures: 0, Errors: 0, Skipped: 0, Time elapsed: 71.638 sec - in org.apache.hadoop.hbase.io.hfile.TestForceCacheImportantBlocks
Tests run: 1, Failures: 0, Errors: 0, Skipped: 0, Time elapsed: 16.223 sec - in org.apache.hadoop.hbase.TestLocalHBaseCluster
Running org.apache.hadoop.hbase.zookeeper.TestRecoverableZooKeeper
Tests run: 1, Failures: 0, Errors: 0, Skipped: 0, Time elapsed: 1.5 sec - in org.apache.hadoop.hbase.zookeeper.TestRecoverableZooKeeper
Running org.apache.hadoop.hbase.zookeeper.TestZooKeeperNodeTracker
Tests run: 3, Failures: 0, Errors: 0, Skipped: 0, Time elapsed: 2.529 sec - in org.apache.hadoop.hbase.zookeeper.TestZooKeeperNodeTracker
Running org.apache.hadoop.hbase.zookeeper.TestZKTableStateManager
Tests run: 1, Failures: 0, Errors: 0, Skipped: 0, Time elapsed: 2.131 sec - in org.apache.hadoop.hbase.zookeeper.TestZKTableStateManager
Running org.apache.hadoop.hbase.zookeeper.TestZooKeeperACL
Tests run: 7, Failures: 0, Errors: 0, Skipped: 0, Time elapsed: 1.136 sec - in org.apache.hadoop.hbase.zookeeper.TestZooKeeperACL
Running org.apache.hadoop.hbase.zookeeper.TestHQuorumPeer
Tests run: 3, Failures: 0, Errors: 0, Skipped: 0, Time elapsed: 2.576 sec - in org.apache.hadoop.hbase.zookeeper.TestHQuorumPeer
Running org.apache.hadoop.hbase.zookeeper.TestZKLeaderManager
Tests run: 1, Failures: 0, Errors: 0, Skipped: 0, Time elapsed: 0.201 sec - in org.apache.hadoop.hbase.zookeeper.TestZKLeaderManager
Running org.apache.hadoop.hbase.zookeeper.TestZKMulti
Running org.apache.hadoop.hbase.zookeeper.lock.TestZKInterProcessReadWriteLock
Tests run: 12, Failures: 0, Errors: 0, Skipped: 0, Time elapsed: 3.302 sec - in org.apache.hadoop.hbase.zookeeper.TestZKMulti
Running org.apache.hadoop.hbase.TestJMXListener
Tests run: 6, Failures: 0, Errors: 0, Skipped: 0, Time elapsed: 25.467 sec - in org.apache.hadoop.hbase.zookeeper.lock.TestZKInterProcessReadWriteLock
Running org.apache.hadoop.hbase.TestMetaTableAccessorNoCluster
Tests run: 2, Failures: 0, Errors: 0, Skipped: 0, Time elapsed: 5.127 sec - in org.apache.hadoop.hbase.TestMetaTableAccessorNoCluster
Tests run: 2, Failures: 0, Errors: 0, Skipped: 0, Time elapsed: 16.633 sec - in org.apache.hadoop.hbase.TestJMXListener
Running org.apache.hadoop.hbase.TestZooKeeper
Tests run: 3, Failures: 0, Errors: 0, Skipped: 0, Time elapsed: 94.737 sec - in org.apache.hadoop.hbase.TestAcidGuarantees
Running org.apache.hadoop.hbase.replication.regionserver.TestReplicationWALReaderManager
Running org.apache.hadoop.hbase.replication.regionserver.TestReplicationSink
Tests run: 5, Failures: 0, Errors: 0, Skipped: 0, Time elapsed: 2.93 sec - in org.apache.hadoop.hbase.replication.regionserver.TestReplicationSink
Tests run: 28, Failures: 0, Errors: 0, Skipped: 0, Time elapsed: 491.67 sec - in org.apache.hadoop.hbase.io.encoding.TestDataBlockEncoders
Running org.apache.hadoop.hbase.replication.regionserver.TestReplicationSourceManager
Running org.apache.hadoop.hbase.replication.TestReplicationTrackerZKImpl
Tests run: 5, Failures: 0, Errors: 0, Skipped: 0, Time elapsed: 2.78 sec - in org.apache.hadoop.hbase.replication.TestReplicationTrackerZKImpl
Tests run: 5, Failures: 0, Errors: 0, Skipped: 0, Time elapsed: 4.38 sec - in org.apache.hadoop.hbase.replication.regionserver.TestReplicationSourceManager
Tests run: 72, Failures: 0, Errors: 0, Skipped: 0, Time elapsed: 308.508 sec - in org.apache.hadoop.hbase.io.hfile.TestCacheOnWrite
Running org.apache.hadoop.hbase.replication.TestMultiSlaveReplication
Running org.apache.hadoop.hbase.replication.TestReplicationKillMasterRSCompressed
Running org.apache.hadoop.hbase.replication.TestReplicationKillMasterRS
Tests run: 1, Failures: 0, Errors: 0, Skipped: 0, Time elapsed: 42.229 sec - in org.apache.hadoop.hbase.replication.TestMultiSlaveReplication
Tests run: 1, Failures: 0, Errors: 0, Skipped: 0, Time elapsed: 35.708 sec - in org.apache.hadoop.hbase.replication.TestReplicationKillMasterRS
Tests run: 1, Failures: 0, Errors: 0, Skipped: 0, Time elapsed: 42.394 sec - in org.apache.hadoop.hbase.replication.TestReplicationKillMasterRSCompressed
Running org.apache.hadoop.hbase.replication.TestReplicationChangingPeerRegionservers
Tests run: 1, Failures: 0, Errors: 0, Skipped: 0, Time elapsed: 7.446 sec - in org.apache.hadoop.hbase.replication.TestReplicationChangingPeerRegionservers
Running org.apache.hadoop.hbase.replication.TestPerTableCFReplication
Running org.apache.hadoop.hbase.replication.TestReplicationKillSlaveRS
Running org.apache.hadoop.hbase.replication.TestReplicationDisableInactivePeer
Tests run: 2, Failures: 0, Errors: 0, Skipped: 0, Time elapsed: 30.958 sec - in org.apache.hadoop.hbase.replication.TestPerTableCFReplication
Running org.apache.hadoop.hbase.replication.TestMasterReplication
Tests run: 11, Failures: 0, Errors: 0, Skipped: 0, Time elapsed: 185.578 sec - in org.apache.hadoop.hbase.TestZooKeeper
Tests run: 1, Failures: 0, Errors: 0, Skipped: 0, Time elapsed: 35.04 sec - in org.apache.hadoop.hbase.replication.TestReplicationKillSlaveRS
Tests run: 1, Failures: 0, Errors: 0, Skipped: 0, Time elapsed: 22.985 sec - in org.apache.hadoop.hbase.replication.TestReplicationDisableInactivePeer
Running org.apache.hadoop.hbase.replication.TestReplicationWithTags
Running org.apache.hadoop.hbase.replication.TestReplicationEndpoint
Tests run: 1, Failures: 0, Errors: 0, Skipped: 0, Time elapsed: 3.788 sec - in org.apache.hadoop.hbase.replication.TestReplicationWithTags
Tests run: 3, Failures: 0, Errors: 0, Skipped: 0, Time elapsed: 3.414 sec - in org.apache.hadoop.hbase.replication.TestReplicationEndpoint
Running org.apache.hadoop.hbase.replication.TestReplicationSmallTests
Running org.apache.hadoop.hbase.replication.TestReplicationSource
Tests run: 1, Failures: 0, Errors: 0, Skipped: 0, Time elapsed: 0.752 sec - in org.apache.hadoop.hbase.replication.TestReplicationSource
Running org.apache.hadoop.hbase.replication.TestReplicationStateZKImpl
Tests run: 6, Failures: 0, Errors: 0, Skipped: 0, Time elapsed: 1.951 sec - in org.apache.hadoop.hbase.replication.TestReplicationStateZKImpl
Running org.apache.hadoop.hbase.fs.TestBlockReorder
Running org.apache.hadoop.hbase.replication.TestReplicationSyncUpTool
Tests run: 3, Failures: 0, Errors: 0, Skipped: 0, Time elapsed: 95.065 sec - in org.apache.hadoop.hbase.replication.TestMasterReplication
Tests run: 8, Failures: 0, Errors: 0, Skipped: 0, Time elapsed: 281 sec - in org.apache.hadoop.hbase.replication.regionserver.TestReplicationWALReaderManager
Tests run: 3, Failures: 0, Errors: 0, Skipped: 0, Time elapsed: 45.834 sec - in org.apache.hadoop.hbase.fs.TestBlockReorder
Running org.apache.hadoop.hbase.trace.TestHTraceHooks
Running org.apache.hadoop.hbase.TestMetaTableLocator
Tests run: 1, Failures: 0, Errors: 0, Skipped: 0, Time elapsed: 3.12 sec - in org.apache.hadoop.hbase.trace.TestHTraceHooks
Tests run: 10, Failures: 0, Errors: 0, Skipped: 0, Time elapsed: 64.799 sec - in org.apache.hadoop.hbase.replication.TestReplicationSmallTests
Tests run: 7, Failures: 0, Errors: 0, Skipped: 0, Time elapsed: 6.519 sec - in org.apache.hadoop.hbase.TestMetaTableLocator
Running org.apache.hadoop.hbase.mapred.TestTableSnapshotInputFormat
Tests run: 1, Failures: 0, Errors: 0, Skipped: 0, Time elapsed: 57.163 sec - in org.apache.hadoop.hbase.replication.TestReplicationSyncUpTool
Running org.apache.hadoop.hbase.mapred.TestTableMapReduceUtil
Running org.apache.hadoop.hbase.mapred.TestTableInputFormat
Running org.apache.hadoop.hbase.TestMetaMigrationConvertingToPB
Tests run: 3, Failures: 0, Errors: 0, Skipped: 0, Time elapsed: 3.345 sec - in org.apache.hadoop.hbase.TestMetaMigrationConvertingToPB
Running org.apache.hadoop.hbase.mapred.TestTableMapReduce
Running org.apache.hadoop.hbase.TestMultiVersions
Tests run: 3, Failures: 0, Errors: 0, Skipped: 0, Time elapsed: 12.151 sec - in org.apache.hadoop.hbase.TestMultiVersions
Tests run: 8, Failures: 0, Errors: 0, Skipped: 0, Time elapsed: 141.105 sec - in org.apache.hadoop.hbase.mapred.TestTableInputFormat
Tests run: 4, Failures: 0, Errors: 0, Skipped: 0, Time elapsed: 156.949 sec - in org.apache.hadoop.hbase.mapred.TestTableMapReduceUtil
Tests run: 2, Failures: 0, Errors: 0, Skipped: 0, Time elapsed: 168.553 sec - in org.apache.hadoop.hbase.mapred.TestTableMapReduce
Tests run: 7, Failures: 0, Errors: 0, Skipped: 0, Time elapsed: 413.54 sec - in org.apache.hadoop.hbase.mapred.TestTableSnapshotInputFormat

Results :




Tests run: 2184, Failures: 0, Errors: 0, Skipped: 18

[INFO] ------------------------------------------------------------------------
[INFO] Reactor Summary:
[INFO] 
[INFO] Apache HBase ...................................... SUCCESS [5.639s]
[INFO] Apache HBase - Checkstyle ......................... SUCCESS [1.279s]
[INFO] Apache HBase - Resource Bundle .................... SUCCESS [0.342s]
[INFO] Apache HBase - Annotations ........................ SUCCESS [1.595s]
[INFO] Apache HBase - Common ............................. SUCCESS [1:26.682s]
[INFO] Apache HBase - Protocol ........................... SUCCESS [13.315s]
[INFO] Apache HBase - Client ............................. SUCCESS [1:38.985s]
[INFO] Apache HBase - Hadoop Compatibility ............... SUCCESS [9.371s]
[INFO] Apache HBase - Hadoop Two Compatibility ........... SUCCESS [10.706s]
[INFO] Apache HBase - Prefix Tree ........................ SUCCESS [14.547s]
[INFO] Apache HBase - Server ............................. FAILURE [1:51:40.205s]
[INFO] Apache HBase - Testing Util ....................... SKIPPED
[INFO] Apache HBase - Thrift ............................. SKIPPED
[INFO] Apache HBase - Rest ............................... SKIPPED
[INFO] Apache HBase - Shell .............................. SKIPPED
[INFO] Apache HBase - Integration Tests .................. SKIPPED
[INFO] Apache HBase - Examples ........................... SKIPPED
[INFO] Apache HBase - Assembly ........................... SKIPPED
[INFO] ------------------------------------------------------------------------
[INFO] BUILD FAILURE
[INFO] ------------------------------------------------------------------------
[INFO] Total time: 1:55:45.764s
[INFO] Finished at: Wed Nov 11 17:36:14 UTC 2015
[INFO] Final Memory: 44M/1278M
[INFO] ------------------------------------------------------------------------
[ERROR] Failed to execute goal org.apache.maven.plugins:maven-surefire-plugin:2.18:test (secondPartTestsExecution)
on project hbase-server: There was a timeout or other error in the fork -> [Help 1]
[ERROR] 
[ERROR] To see the full stack trace of the errors, re-run Maven with the -e switch.
[ERROR] Re-run Maven using the -X switch to enable full debug logging.
[ERROR] 
[ERROR] For more information about the errors and possible solutions, please read the following
articles:
[ERROR] [Help 1] http://cwiki.apache.org/confluence/display/MAVEN/MojoFailureException
[ERROR] 
[ERROR] After correcting the problems, you can resume the build with the command
[ERROR]   mvn <goals> -rf :hbase-server
Build step 'Invoke top-level Maven targets' marked build as failure
Performing Post build task...
Match found for :.* : True
Logical operation result is TRUE
Running script  : # Post-build task script. TODO: Check this in and have all builds reference
check-in.
pwd && ls
# NOTE!!!! The below code has been copied and pasted from ./dev-tools/run-test.sh
# Do not change here without syncing there and vice-versa.
ZOMBIE_TESTS_COUNT=`jps -v | grep surefirebooter | grep -e '-Dhbase.test' | wc -l`
if [[ $ZOMBIE_TESTS_COUNT != 0 ]] ; then
 echo "Suspicious java process found - waiting 30s to see if there are just slow to stop"
 sleep 30
 ZOMBIE_TESTS_COUNT=`jps -v | grep surefirebooter | grep -e '-Dhbase.test' | wc -l`
 if [[ $ZOMBIE_TESTS_COUNT != 0 ]] ; then
   echo " {color:red}There appear to be $ZOMBIE_TESTS_COUNT zombie tests{color}, they should
have been killed by surefire but survived"
   jps -v | grep surefirebooter | grep -e '-Dhbase.test'
   jps -v | grep surefirebooter | grep -e '-Dhbase.test' | cut -d ' ' -f 1 | xargs -n 1 jstack
   # Exit with error
   exit 1
 else
   echo "We're ok: there is no zombie test, but some tests took some time to stop"
 fi
else
  echo "We're ok: there is no zombie test"
fi
[HBase-1.0] $ /bin/bash -xe /tmp/hudson1552591169253081546.sh
+ pwd
<https://builds.apache.org/job/HBase-1.0/ws/>
+ ls
bin
CHANGES.txt
conf
dev-support
hbase-annotations
hbase-assembly
hbase-checkstyle
hbase-client
hbase-common
hbase-examples
hbase-hadoop2-compat
hbase-hadoop-compat
hbase-it
hbase-native-client
hbase-prefix-tree
hbase-protocol
hbase-resource-bundle
hbase-rest
hbase-server
hbase-shell
hbase-testing-util
hbase-thrift
LICENSE.txt
NOTICE.txt
pom.xml
README.txt
src
target
++ wc -l
++ grep -e -Dhbase.test
++ grep surefirebooter
++ jps -v
+ ZOMBIE_TESTS_COUNT=0
+ [[ 0 != 0 ]]
+ echo 'We'\''re ok: there is no zombie test'
We're ok: there is no zombie test
POST BUILD TASK : SUCCESS
END OF POST BUILD TASK : 0
Archiving artifacts
Recording test results
Updating HBASE-14780
Updating HBASE-14731

Mime
View raw message