hbase-builds mailing list archives

Site index · List index
Message view « Date » · « Thread »
Top « Date » · « Thread »
From Apache Jenkins Server <jenk...@builds.apache.org>
Subject Build failed in Jenkins: HBase-1.3-IT » IntegrationTestAcidGuarantees,latest1.8,Hadoop #342
Date Thu, 26 Nov 2015 21:50:34 GMT
See <https://builds.apache.org/job/HBase-1.3-IT/it.test=IntegrationTestAcidGuarantees,jdk=latest1.8,label=Hadoop/342/>

------------------------------------------
[...truncated 1813 lines...]
[INFO] Copying 3 resources
[INFO] 
[INFO] --- maven-compiler-plugin:2.5.1:compile (default-compile) @ hbase-shell ---
[INFO] No sources to compile
[INFO] 
[INFO] --- maven-dependency-plugin:2.1:build-classpath (create-mrapp-generated-classpath)
@ hbase-shell ---
[INFO] Skipped writing classpath file '<https://builds.apache.org/job/HBase-1.3-IT/it.test=IntegrationTestAcidGuarantees,jdk=latest1.8,label=Hadoop/ws/hbase-shell/target/test-classes/mrapp-generated-classpath'.>
 No changes found.
[INFO] 
[INFO] --- maven-resources-plugin:2.6:testResources (default-testResources) @ hbase-shell
---
[INFO] Using 'UTF-8' encoding to copy filtered resources.
[INFO] Copying 1 resource
[INFO] Copying 3 resources
[INFO] Copying 3 resources
[INFO] 
[INFO] --- maven-compiler-plugin:2.5.1:testCompile (default-testCompile) @ hbase-shell ---
[INFO] Nothing to compile - all classes are up to date
[INFO] 
[INFO] --- maven-surefire-plugin:2.18.1:test (default-test) @ hbase-shell ---
[INFO] Skipping execution of surefire because it has already been run for this configuration
[INFO] 
[INFO] --- maven-surefire-plugin:2.18.1:test (secondPartTestsExecution) @ hbase-shell ---
[INFO] Tests are skipped.
[INFO] 
[INFO] --- maven-jar-plugin:2.4:test-jar (default) @ hbase-shell ---
[INFO] Building jar: <https://builds.apache.org/job/HBase-1.3-IT/it.test=IntegrationTestAcidGuarantees,jdk=latest1.8,label=Hadoop/ws/hbase-shell/target/hbase-shell-1.3.0-SNAPSHOT-tests.jar>
[WARNING] Artifact org.apache.hbase:hbase-shell:test-jar:tests:1.3.0-SNAPSHOT already attached
to project, ignoring duplicate
[INFO] 
[INFO] --- maven-source-plugin:2.2.1:jar-no-fork (attach-sources) @ hbase-shell ---
[INFO] Building jar: <https://builds.apache.org/job/HBase-1.3-IT/it.test=IntegrationTestAcidGuarantees,jdk=latest1.8,label=Hadoop/ws/hbase-shell/target/hbase-shell-1.3.0-SNAPSHOT-sources.jar>
[WARNING] Artifact org.apache.hbase:hbase-shell:java-source:sources:1.3.0-SNAPSHOT already
attached to project, ignoring duplicate
[INFO] 
[INFO] --- maven-jar-plugin:2.4:jar (default-jar) @ hbase-shell ---
[INFO] Building jar: <https://builds.apache.org/job/HBase-1.3-IT/it.test=IntegrationTestAcidGuarantees,jdk=latest1.8,label=Hadoop/ws/hbase-shell/target/hbase-shell-1.3.0-SNAPSHOT.jar>
[INFO]                                                                         
[INFO] ------------------------------------------------------------------------
[INFO] Building Apache HBase - Integration Tests 1.3.0-SNAPSHOT
[INFO] ------------------------------------------------------------------------
[INFO] 
[INFO] --- maven-clean-plugin:2.5:clean (default-clean) @ hbase-it ---
[INFO] Deleting <https://builds.apache.org/job/HBase-1.3-IT/it.test=IntegrationTestAcidGuarantees,jdk=latest1.8,label=Hadoop/ws/hbase-it/target>
[INFO] 
[INFO] --- maven-enforcer-plugin:1.0.1:enforce (enforce) @ hbase-it ---
[INFO] 
[INFO] --- buildnumber-maven-plugin:1.3:create-timestamp (default) @ hbase-it ---
[INFO] 
[INFO] --- maven-remote-resources-plugin:1.5:process (default) @ hbase-it ---
[INFO] 
[INFO] --- maven-resources-plugin:2.6:resources (default-resources) @ hbase-it ---
[INFO] Using 'UTF-8' encoding to copy filtered resources.
[INFO] skip non existing resourceDirectory <https://builds.apache.org/job/HBase-1.3-IT/it.test=IntegrationTestAcidGuarantees,jdk=latest1.8,label=Hadoop/ws/hbase-it/src/main/resources>
[INFO] Copying 3 resources
[INFO] 
[INFO] --- maven-compiler-plugin:2.5.1:compile (default-compile) @ hbase-it ---
[INFO] No sources to compile
[INFO] 
[INFO] --- maven-dependency-plugin:2.1:build-classpath (create-mrapp-generated-classpath)
@ hbase-it ---
[INFO] Wrote classpath file '<https://builds.apache.org/job/HBase-1.3-IT/it.test=IntegrationTestAcidGuarantees,jdk=latest1.8,label=Hadoop/ws/hbase-it/target/test-classes/mrapp-generated-classpath'.>
[INFO] 
[INFO] --- maven-resources-plugin:2.6:testResources (default-testResources) @ hbase-it ---
[INFO] Using 'UTF-8' encoding to copy filtered resources.
[INFO] Copying 14 resources
[INFO] Copying 3 resources
[INFO] 
[INFO] --- maven-compiler-plugin:2.5.1:testCompile (default-testCompile) @ hbase-it ---
[INFO] Compiling 91 source files to <https://builds.apache.org/job/HBase-1.3-IT/it.test=IntegrationTestAcidGuarantees,jdk=latest1.8,label=Hadoop/ws/hbase-it/target/test-classes>
[INFO] 
[INFO] --- maven-surefire-plugin:2.18.1:test (default-test) @ hbase-it ---
[INFO] 
[INFO] --- maven-surefire-plugin:2.18.1:test (secondPartTestsExecution) @ hbase-it ---
[INFO] Tests are skipped.
[INFO] 
[INFO] --- maven-jar-plugin:2.4:test-jar (default) @ hbase-it ---
[INFO] Building jar: <https://builds.apache.org/job/HBase-1.3-IT/it.test=IntegrationTestAcidGuarantees,jdk=latest1.8,label=Hadoop/ws/hbase-it/target/hbase-it-1.3.0-SNAPSHOT-tests.jar>
[INFO] 
[INFO] --- maven-jar-plugin:2.4:jar (default-jar) @ hbase-it ---
[INFO] Building jar: <https://builds.apache.org/job/HBase-1.3-IT/it.test=IntegrationTestAcidGuarantees,jdk=latest1.8,label=Hadoop/ws/hbase-it/target/hbase-it-1.3.0-SNAPSHOT.jar>
[INFO] 
[INFO] --- maven-enforcer-plugin:1.0.1:enforce (enforce) @ hbase-it ---
[INFO] 
[INFO] --- buildnumber-maven-plugin:1.3:create-timestamp (default) @ hbase-it ---
[INFO] 
[INFO] --- maven-remote-resources-plugin:1.5:process (default) @ hbase-it ---
[INFO] 
[INFO] --- maven-resources-plugin:2.6:resources (default-resources) @ hbase-it ---
[INFO] Using 'UTF-8' encoding to copy filtered resources.
[INFO] skip non existing resourceDirectory <https://builds.apache.org/job/HBase-1.3-IT/it.test=IntegrationTestAcidGuarantees,jdk=latest1.8,label=Hadoop/ws/hbase-it/src/main/resources>
[INFO] Copying 3 resources
[INFO] Copying 3 resources
[INFO] 
[INFO] --- maven-compiler-plugin:2.5.1:compile (default-compile) @ hbase-it ---
[INFO] No sources to compile
[INFO] 
[INFO] --- maven-dependency-plugin:2.1:build-classpath (create-mrapp-generated-classpath)
@ hbase-it ---
[INFO] Skipped writing classpath file '<https://builds.apache.org/job/HBase-1.3-IT/it.test=IntegrationTestAcidGuarantees,jdk=latest1.8,label=Hadoop/ws/hbase-it/target/test-classes/mrapp-generated-classpath'.>
 No changes found.
[INFO] 
[INFO] --- maven-resources-plugin:2.6:testResources (default-testResources) @ hbase-it ---
[INFO] Using 'UTF-8' encoding to copy filtered resources.
[INFO] Copying 14 resources
[INFO] Copying 3 resources
[INFO] Copying 3 resources
[INFO] 
[INFO] --- maven-compiler-plugin:2.5.1:testCompile (default-testCompile) @ hbase-it ---
[INFO] Nothing to compile - all classes are up to date
[INFO] 
[INFO] --- maven-surefire-plugin:2.18.1:test (default-test) @ hbase-it ---
[INFO] Skipping execution of surefire because it has already been run for this configuration
[INFO] 
[INFO] --- maven-surefire-plugin:2.18.1:test (secondPartTestsExecution) @ hbase-it ---
[INFO] Tests are skipped.
[INFO] 
[INFO] --- maven-jar-plugin:2.4:test-jar (default) @ hbase-it ---
[WARNING] Artifact org.apache.hbase:hbase-it:test-jar:tests:1.3.0-SNAPSHOT already attached
to project, ignoring duplicate
[INFO] 
[INFO] --- maven-jar-plugin:2.4:jar (default-jar) @ hbase-it ---
[INFO] 
[INFO] --- maven-failsafe-plugin:2.18.1:integration-test (integration-test) @ hbase-it ---
[WARNING] The parameter forkMode is deprecated since version 2.14. Use forkCount and reuseForks
instead.
[INFO] Failsafe report directory: <https://builds.apache.org/job/HBase-1.3-IT/it.test=IntegrationTestAcidGuarantees,jdk=latest1.8,label=Hadoop/ws/hbase-it/target/failsafe-reports>
[INFO] Using configured provider org.apache.maven.surefire.junit4.JUnit4Provider

-------------------------------------------------------
 T E S T S
-------------------------------------------------------
Running org.apache.hadoop.hbase.IntegrationTestAcidGuarantees

Results :

Tests run: 0, Failures: 0, Errors: 0, Skipped: 0

[WARNING] File encoding has not been set, using platform encoding ISO-8859-1, i.e. build is
platform dependent! The file encoding for reports output files should be provided by the POM
property ${project.reporting.outputEncoding}.
[INFO] 
[INFO] --- maven-failsafe-plugin:2.18.1:verify (verify) @ hbase-it ---
[INFO] Failsafe report directory: <https://builds.apache.org/job/HBase-1.3-IT/it.test=IntegrationTestAcidGuarantees,jdk=latest1.8,label=Hadoop/ws/hbase-it/target/failsafe-reports>
[WARNING] File encoding has not been set, using platform encoding ISO-8859-1, i.e. build is
platform dependent! The file encoding for reports output files should be provided by the POM
property ${project.reporting.outputEncoding}.
[INFO] ------------------------------------------------------------------------
[INFO] Reactor Summary:
[INFO] 
[INFO] Apache HBase ...................................... SUCCESS [4.799s]
[INFO] Apache HBase - Checkstyle ......................... SUCCESS [1.189s]
[INFO] Apache HBase - Resource Bundle .................... SUCCESS [0.577s]
[INFO] Apache HBase - Annotations ........................ SUCCESS [1.861s]
[INFO] Apache HBase - Protocol ........................... SUCCESS [20.666s]
[INFO] Apache HBase - Common ............................. SUCCESS [14.164s]
[INFO] Apache HBase - Procedure .......................... SUCCESS [2.058s]
[INFO] Apache HBase - Client ............................. SUCCESS [6.866s]
[INFO] Apache HBase - Hadoop Compatibility ............... SUCCESS [0.490s]
[INFO] Apache HBase - Hadoop Two Compatibility ........... SUCCESS [1.567s]
[INFO] Apache HBase - Prefix Tree ........................ SUCCESS [1.784s]
[INFO] Apache HBase - Server ............................. SUCCESS [43.430s]
[INFO] Apache HBase - Testing Util ....................... SUCCESS [2.067s]
[INFO] Apache HBase - Thrift ............................. SUCCESS [7.766s]
[INFO] Apache HBase - Rest ............................... SUCCESS [3.485s]
[INFO] Apache HBase - Shell .............................. SUCCESS [1.305s]
[INFO] Apache HBase - Integration Tests .................. FAILURE [30:02.839s]
[INFO] Apache HBase - Examples ........................... SKIPPED
[INFO] Apache HBase - External Block Cache ............... SKIPPED
[INFO] Apache HBase - Assembly ........................... SKIPPED
[INFO] Apache HBase - Shaded ............................. SKIPPED
[INFO] Apache HBase - Shaded - Client .................... SKIPPED
[INFO] Apache HBase - Shaded - Server .................... SKIPPED
[INFO] ------------------------------------------------------------------------
[INFO] BUILD FAILURE
[INFO] ------------------------------------------------------------------------
[INFO] Total time: 31:59.207s
[INFO] Finished at: Thu Nov 26 21:50:35 UTC 2015
[INFO] Final Memory: 201M/4277M
[INFO] ------------------------------------------------------------------------
[ERROR] Failed to execute goal org.apache.maven.plugins:maven-failsafe-plugin:2.18.1:verify
(verify) on project hbase-it: There was a timeout or other error in the fork -> [Help 1]
[ERROR] 
[ERROR] To see the full stack trace of the errors, re-run Maven with the -e switch.
[ERROR] Re-run Maven using the -X switch to enable full debug logging.
[ERROR] 
[ERROR] For more information about the errors and possible solutions, please read the following
articles:
[ERROR] [Help 1] http://cwiki.apache.org/confluence/display/MAVEN/MojoFailureException
[ERROR] 
[ERROR] After correcting the problems, you can resume the build with the command
[ERROR]   mvn <goals> -rf :hbase-it
Build step 'Invoke top-level Maven targets' marked build as failure
Performing Post build task...
Match found for :.* : True
Logical operation result is TRUE
Running script  : # Post-build task script. TODO: Check this in and have all builds reference
check-in.
pwd && ls
# NOTE!!!! The below code has been copied and pasted from ./dev-tools/run-test.sh
# Do not change here without syncing there and vice-versa.
ZOMBIE_TESTS_COUNT=`jps -v | grep surefirebooter | grep -e '-Dhbase.test' | wc -l`
if [[ $ZOMBIE_TESTS_COUNT != 0 ]] ; then
 echo "Suspicious java process found - waiting 30s to see if there are just slow to stop"
 sleep 30
 ZOMBIE_TESTS_COUNT=`jps -v | grep surefirebooter | grep -e '-Dhbase.test' | wc -l`
 if [[ $ZOMBIE_TESTS_COUNT != 0 ]] ; then
   echo " {color:red}There appear to be $ZOMBIE_TESTS_COUNT zombie tests{color}, they should
have been killed by surefire but survived"
   jps -v | grep surefirebooter | grep -e '-Dhbase.test'
   jps -v | grep surefirebooter | grep -e '-Dhbase.test' | cut -d ' ' -f 1 | xargs -n 1 jstack
   # Exit with error
   exit 1
 else
   echo "We're ok: there is no zombie test, but some tests took some time to stop"
 fi
else
  echo "We're ok: there is no zombie test"
fi
[Hadoop] $ /bin/bash -xe /tmp/hudson8665428345848074519.sh
+ pwd
<https://builds.apache.org/job/HBase-1.3-IT/it.test=IntegrationTestAcidGuarantees,jdk=latest1.8,label=Hadoop/ws/>
+ ls
bin
CHANGES.txt
conf
dev-support
hbase-annotations
hbase-assembly
hbase-checkstyle
hbase-client
hbase-common
hbase-examples
hbase-external-blockcache
hbase-hadoop2-compat
hbase-hadoop-compat
hbase-it
hbase-native-client
hbase-prefix-tree
hbase-procedure
hbase-protocol
hbase-resource-bundle
hbase-rest
hbase-server
hbase-shaded
hbase-shell
hbase-spark
hbase-testing-util
hbase-thrift
LICENSE.txt
NOTICE.txt
pom.xml
README.txt
src
target
++ jps -v
++ grep surefirebooter
++ grep -e -Dhbase.test
++ wc -l
+ ZOMBIE_TESTS_COUNT=0
+ [[ 0 != 0 ]]
+ echo 'We'\''re ok: there is no zombie test'
We're ok: there is no zombie test
POST BUILD TASK : SUCCESS
END OF POST BUILD TASK : 0
Archiving artifacts

Mime
View raw message