hbase-builds mailing list archives

Site index · List index
Message view « Date » · « Thread »
Top « Date » · « Thread »
From Apache Jenkins Server <jenk...@builds.apache.org>
Subject Build failed in Jenkins: HBase-0.98-matrix » latest1.6,Hadoop #254
Date Sun, 01 Nov 2015 12:52:59 GMT
See <https://builds.apache.org/job/HBase-0.98-matrix/jdk=latest1.6,label=Hadoop/254/changes>

Changes:

[tedyu] HBASE-14605 Addendum restores two methods in SplitTransaction

[enis] HBASE-14733 Minor typo in alter_namespace.rb

------------------------------------------
[...truncated 216 lines...]
[INFO] 
[INFO] --- maven-antrun-plugin:1.6:run (generate) @ hbase-common ---
[INFO] Executing tasks

main:
     [exec] ~/jenkins-slave/workspace/HBase-0.98-matrix/jdk/latest1.6/label/Hadoop/hbase-common
~/jenkins-slave/workspace/HBase-0.98-matrix/jdk/latest1.6/label/Hadoop/hbase-common
     [exec] ~/jenkins-slave/workspace/HBase-0.98-matrix/jdk/latest1.6/label/Hadoop/hbase-common
[INFO] Executed tasks
[INFO] 
[INFO] --- build-helper-maven-plugin:1.5:add-source (versionInfo-source) @ hbase-common ---
[INFO] Source directory: <https://builds.apache.org/job/HBase-0.98-matrix/jdk=latest1.6,label=Hadoop/ws/hbase-common/target/generated-sources/java>
added.
[INFO] 
[INFO] --- maven-remote-resources-plugin:1.5:process (default) @ hbase-common ---
[INFO] 
[INFO] --- maven-resources-plugin:2.6:resources (default-resources) @ hbase-common ---
[INFO] Using 'UTF-8' encoding to copy filtered resources.
[INFO] Copying 1 resource
[INFO] Copying 3 resources
[INFO] 
[INFO] --- maven-antrun-plugin:1.6:run (default) @ hbase-common ---
[INFO] Executing tasks

main:
     [exec] tar: hadoop-snappy-nativelibs.tar: Cannot open: No such file or directory
     [exec] tar: Error is not recoverable: exiting now
     [exec] Result: 2
[INFO] Executed tasks
[INFO] 
[INFO] --- maven-compiler-plugin:2.5.1:compile (default-compile) @ hbase-common ---
[INFO] Compiling 3 source files to <https://builds.apache.org/job/HBase-0.98-matrix/jdk=latest1.6,label=Hadoop/ws/hbase-common/target/classes>
[INFO] 
[INFO] --- maven-dependency-plugin:2.1:build-classpath (create-mrapp-generated-classpath)
@ hbase-common ---
[INFO] Skipped writing classpath file '<https://builds.apache.org/job/HBase-0.98-matrix/jdk=latest1.6,label=Hadoop/ws/hbase-common/target/test-classes/mrapp-generated-classpath'.>
 No changes found.
[INFO] 
[INFO] --- maven-resources-plugin:2.6:testResources (default-testResources) @ hbase-common
---
[INFO] Using 'UTF-8' encoding to copy filtered resources.
[INFO] Copying 1 resource to META-INF/
[INFO] Copying 3 resources
[INFO] 
[INFO] --- maven-compiler-plugin:2.5.1:testCompile (default-testCompile) @ hbase-common ---
[INFO] Nothing to compile - all classes are up to date
[INFO] 
[INFO] --- maven-surefire-plugin:2.18.1:test (default-test) @ hbase-common ---
[INFO] Surefire report directory: <https://builds.apache.org/job/HBase-0.98-matrix/jdk=latest1.6,label=Hadoop/ws/hbase-common/target/surefire-reports>
[INFO] Using configured provider org.apache.maven.surefire.junitcore.JUnitCoreProvider
[INFO] parallel='none', perCoreThreadCount=true, threadCount=0, useUnlimitedThreads=false,
threadCountSuites=0, threadCountClasses=0, threadCountMethods=0, parallelOptimized=true

-------------------------------------------------------
 T E S T S
-------------------------------------------------------
Running org.apache.hadoop.hbase.TestCellUtil
Tests run: 2, Failures: 0, Errors: 0, Skipped: 0, Time elapsed: 0.389 sec - in org.apache.hadoop.hbase.TestCellUtil
Running org.apache.hadoop.hbase.io.crypto.TestEncryption
Tests run: 4, Failures: 0, Errors: 0, Skipped: 0, Time elapsed: 2.738 sec - in org.apache.hadoop.hbase.io.crypto.TestEncryption
Running org.apache.hadoop.hbase.io.crypto.aes.TestAES
Tests run: 2, Failures: 0, Errors: 0, Skipped: 0, Time elapsed: 1.306 sec - in org.apache.hadoop.hbase.io.crypto.aes.TestAES
Running org.apache.hadoop.hbase.io.crypto.TestKeyProvider
Tests run: 1, Failures: 0, Errors: 0, Skipped: 0, Time elapsed: 0.454 sec - in org.apache.hadoop.hbase.io.crypto.TestKeyProvider
Running org.apache.hadoop.hbase.io.crypto.TestKeyStoreKeyProvider
Tests run: 2, Failures: 0, Errors: 0, Skipped: 0, Time elapsed: 0.118 sec - in org.apache.hadoop.hbase.io.crypto.TestKeyStoreKeyProvider
Running org.apache.hadoop.hbase.io.crypto.TestCipherProvider
Tests run: 2, Failures: 0, Errors: 0, Skipped: 0, Time elapsed: 0.85 sec - in org.apache.hadoop.hbase.io.crypto.TestCipherProvider
Running org.apache.hadoop.hbase.io.TestBoundedByteBufferPool
Tests run: 3, Failures: 0, Errors: 0, Skipped: 0, Time elapsed: 2.243 sec - in org.apache.hadoop.hbase.io.TestBoundedByteBufferPool
Running org.apache.hadoop.hbase.io.util.TestLRUDictionary
Tests run: 5, Failures: 0, Errors: 0, Skipped: 0, Time elapsed: 0.567 sec - in org.apache.hadoop.hbase.io.util.TestLRUDictionary
Running org.apache.hadoop.hbase.io.TestTagCompressionContext
Tests run: 2, Failures: 0, Errors: 0, Skipped: 0, Time elapsed: 0.149 sec - in org.apache.hadoop.hbase.io.TestTagCompressionContext
Running org.apache.hadoop.hbase.codec.TestCellCodecWithTags
Tests run: 1, Failures: 0, Errors: 1, Skipped: 0, Time elapsed: 0.29 sec <<< FAILURE!
- in org.apache.hadoop.hbase.codec.TestCellCodecWithTags
testCellWithTag(org.apache.hadoop.hbase.codec.TestCellCodecWithTags)  Time elapsed: 0.274
sec  <<< ERROR!
java.lang.NoSuchFieldError: in
	at org.apache.hadoop.hbase.codec.CellCodecWithTags$CellDecoder.parseCell(CellCodecWithTags.java:86)
	at org.apache.hadoop.hbase.codec.BaseDecoder.advance(BaseDecoder.java:67)
	at org.apache.hadoop.hbase.codec.TestCellCodecWithTags.testCellWithTag(TestCellCodecWithTags.java:76)

Running org.apache.hadoop.hbase.codec.TestKeyValueCodecWithTags
Tests run: 1, Failures: 0, Errors: 1, Skipped: 0, Time elapsed: 0.241 sec <<< FAILURE!
- in org.apache.hadoop.hbase.codec.TestKeyValueCodecWithTags
testKeyValueWithTag(org.apache.hadoop.hbase.codec.TestKeyValueCodecWithTags)  Time elapsed:
0.217 sec  <<< ERROR!
java.lang.NoSuchFieldError: in
	at org.apache.hadoop.hbase.codec.KeyValueCodecWithTags$KeyValueDecoder.parseCell(KeyValueCodecWithTags.java:78)
	at org.apache.hadoop.hbase.codec.BaseDecoder.advance(BaseDecoder.java:67)
	at org.apache.hadoop.hbase.codec.TestKeyValueCodecWithTags.testKeyValueWithTag(TestKeyValueCodecWithTags.java:76)

Running org.apache.hadoop.hbase.codec.TestCellCodec
Tests run: 3, Failures: 0, Errors: 0, Skipped: 0, Time elapsed: 0.315 sec - in org.apache.hadoop.hbase.codec.TestCellCodec
Running org.apache.hadoop.hbase.codec.TestKeyValueCodec
Tests run: 3, Failures: 0, Errors: 2, Skipped: 0, Time elapsed: 0.32 sec <<< FAILURE!
- in org.apache.hadoop.hbase.codec.TestKeyValueCodec
testOne(org.apache.hadoop.hbase.codec.TestKeyValueCodec)  Time elapsed: 0.075 sec  <<<
ERROR!
java.lang.NoSuchFieldError: in
	at org.apache.hadoop.hbase.codec.KeyValueCodec$KeyValueDecoder.parseCell(KeyValueCodec.java:70)
	at org.apache.hadoop.hbase.codec.BaseDecoder.advance(BaseDecoder.java:67)
	at org.apache.hadoop.hbase.codec.TestKeyValueCodec.testOne(TestKeyValueCodec.java:80)

testThree(org.apache.hadoop.hbase.codec.TestKeyValueCodec)  Time elapsed: 0.016 sec  <<<
ERROR!
java.lang.NoSuchFieldError: in
	at org.apache.hadoop.hbase.codec.KeyValueCodec$KeyValueDecoder.parseCell(KeyValueCodec.java:70)
	at org.apache.hadoop.hbase.codec.BaseDecoder.advance(BaseDecoder.java:67)
	at org.apache.hadoop.hbase.codec.TestKeyValueCodec.testThree(TestKeyValueCodec.java:112)

Running org.apache.hadoop.hbase.util.TestLoadTestKVGenerator
Tests run: 3, Failures: 0, Errors: 0, Skipped: 0, Time elapsed: 1.145 sec - in org.apache.hadoop.hbase.util.TestLoadTestKVGenerator
Running org.apache.hadoop.hbase.util.TestConcatenatedLists
Tests run: 6, Failures: 0, Errors: 0, Skipped: 0, Time elapsed: 0.367 sec - in org.apache.hadoop.hbase.util.TestConcatenatedLists
Running org.apache.hadoop.hbase.util.TestBytes
Tests run: 31, Failures: 0, Errors: 0, Skipped: 0, Time elapsed: 2.825 sec - in org.apache.hadoop.hbase.util.TestBytes
Running org.apache.hadoop.hbase.util.TestSimpleByteRange
Tests run: 2, Failures: 0, Errors: 0, Skipped: 0, Time elapsed: 0.221 sec - in org.apache.hadoop.hbase.util.TestSimpleByteRange
Running org.apache.hadoop.hbase.util.TestBase64
Tests run: 1, Failures: 0, Errors: 0, Skipped: 0, Time elapsed: 0.216 sec - in org.apache.hadoop.hbase.util.TestBase64
Running org.apache.hadoop.hbase.util.TestDynamicClassLoader
Tests run: 3, Failures: 0, Errors: 0, Skipped: 0, Time elapsed: 1.953 sec - in org.apache.hadoop.hbase.util.TestDynamicClassLoader
Running org.apache.hadoop.hbase.util.TestPositionedByteRange
Tests run: 1, Failures: 0, Errors: 0, Skipped: 0, Time elapsed: 0.181 sec - in org.apache.hadoop.hbase.util.TestPositionedByteRange
Running org.apache.hadoop.hbase.util.TestOrderedBytes
Tests run: 19, Failures: 0, Errors: 0, Skipped: 0, Time elapsed: 1.035 sec - in org.apache.hadoop.hbase.util.TestOrderedBytes
Running org.apache.hadoop.hbase.util.TestThreads
Tests run: 1, Failures: 0, Errors: 0, Skipped: 0, Time elapsed: 3.058 sec - in org.apache.hadoop.hbase.util.TestThreads
Running org.apache.hadoop.hbase.util.TestBoundedArrayQueue
Tests run: 1, Failures: 0, Errors: 0, Skipped: 0, Time elapsed: 0.147 sec - in org.apache.hadoop.hbase.util.TestBoundedArrayQueue
Running org.apache.hadoop.hbase.util.TestShowProperties
Tests run: 1, Failures: 0, Errors: 0, Skipped: 0, Time elapsed: 0.08 sec - in org.apache.hadoop.hbase.util.TestShowProperties
Running org.apache.hadoop.hbase.util.TestDrainBarrier
Tests run: 6, Failures: 0, Errors: 0, Skipped: 0, Time elapsed: 1.379 sec - in org.apache.hadoop.hbase.util.TestDrainBarrier
Running org.apache.hadoop.hbase.util.TestEnvironmentEdgeManager
Tests run: 2, Failures: 0, Errors: 0, Skipped: 0, Time elapsed: 0.43 sec - in org.apache.hadoop.hbase.util.TestEnvironmentEdgeManager
Running org.apache.hadoop.hbase.util.TestCoprocessorClassLoader
Tests run: 3, Failures: 0, Errors: 0, Skipped: 0, Time elapsed: 1.833 sec - in org.apache.hadoop.hbase.util.TestCoprocessorClassLoader
Running org.apache.hadoop.hbase.util.TestOrder
Tests run: 2, Failures: 0, Errors: 0, Skipped: 0, Time elapsed: 0.091 sec - in org.apache.hadoop.hbase.util.TestOrder
Running org.apache.hadoop.hbase.util.TestKeyLocker
Tests run: 1, Failures: 0, Errors: 0, Skipped: 0, Time elapsed: 0.162 sec - in org.apache.hadoop.hbase.util.TestKeyLocker
Running org.apache.hadoop.hbase.TestHBaseConfiguration
Tests run: 2, Failures: 0, Errors: 0, Skipped: 0, Time elapsed: 0.608 sec - in org.apache.hadoop.hbase.TestHBaseConfiguration
Running org.apache.hadoop.hbase.TestClassFinder
Tests run: 11, Failures: 0, Errors: 0, Skipped: 0, Time elapsed: 2.777 sec - in org.apache.hadoop.hbase.TestClassFinder
Running org.apache.hadoop.hbase.TestCompoundConfiguration
Tests run: 6, Failures: 0, Errors: 0, Skipped: 0, Time elapsed: 0.754 sec - in org.apache.hadoop.hbase.TestCompoundConfiguration
Running org.apache.hadoop.hbase.TestKeyValue
Tests run: 18, Failures: 0, Errors: 0, Skipped: 0, Time elapsed: 0.804 sec - in org.apache.hadoop.hbase.TestKeyValue
Running org.apache.hadoop.hbase.types.TestFixedLengthWrapper
Tests run: 4, Failures: 0, Errors: 0, Skipped: 0, Time elapsed: 0.19 sec - in org.apache.hadoop.hbase.types.TestFixedLengthWrapper
Running org.apache.hadoop.hbase.types.TestUnion2
Tests run: 2, Failures: 0, Errors: 0, Skipped: 0, Time elapsed: 0.212 sec - in org.apache.hadoop.hbase.types.TestUnion2
Running org.apache.hadoop.hbase.types.TestStructNullExtension
Tests run: 2, Failures: 0, Errors: 0, Skipped: 0, Time elapsed: 0.241 sec - in org.apache.hadoop.hbase.types.TestStructNullExtension
Running org.apache.hadoop.hbase.types.TestOrderedBlobVar
Tests run: 1, Failures: 0, Errors: 0, Skipped: 0, Time elapsed: 0.08 sec - in org.apache.hadoop.hbase.types.TestOrderedBlobVar
Running org.apache.hadoop.hbase.types.TestRawString
Tests run: 1, Failures: 0, Errors: 0, Skipped: 0, Time elapsed: 0.179 sec - in org.apache.hadoop.hbase.types.TestRawString
Running org.apache.hadoop.hbase.types.TestStruct
Tests run: 2, Failures: 0, Errors: 0, Skipped: 0, Time elapsed: 0.1 sec - in org.apache.hadoop.hbase.types.TestStruct
Running org.apache.hadoop.hbase.types.TestTerminatedWrapper
Tests run: 8, Failures: 0, Errors: 0, Skipped: 0, Time elapsed: 0.378 sec - in org.apache.hadoop.hbase.types.TestTerminatedWrapper
Running org.apache.hadoop.hbase.types.TestOrderedString
Tests run: 1, Failures: 0, Errors: 0, Skipped: 0, Time elapsed: 0.158 sec - in org.apache.hadoop.hbase.types.TestOrderedString
Running org.apache.hadoop.hbase.types.TestOrderedBlob
Tests run: 1, Failures: 0, Errors: 0, Skipped: 0, Time elapsed: 0.062 sec - in org.apache.hadoop.hbase.types.TestOrderedBlob

Results :

Tests in error: 
  TestCellCodecWithTags.testCellWithTag:76 » NoSuchField in
  TestKeyValueCodec.testOne:80 » NoSuchField in
  TestKeyValueCodec.testThree:112 » NoSuchField in
  TestKeyValueCodecWithTags.testKeyValueWithTag:76 » NoSuchField in

Tests run: 173, Failures: 0, Errors: 4, Skipped: 0

[INFO] ------------------------------------------------------------------------
[INFO] Reactor Summary:
[INFO] 
[INFO] Apache HBase ...................................... SUCCESS [5.292s]
[INFO] Apache HBase - Checkstyle ......................... SUCCESS [1.316s]
[INFO] Apache HBase - Resource Bundle .................... SUCCESS [0.497s]
[INFO] Apache HBase - Annotations ........................ SUCCESS [0.557s]
[INFO] Apache HBase - Common ............................. FAILURE [1:03.292s]
[INFO] Apache HBase - Protocol ........................... SKIPPED
[INFO] Apache HBase - Client ............................. SKIPPED
[INFO] Apache HBase - Hadoop Compatibility ............... SKIPPED
[INFO] Apache HBase - Hadoop Two Compatibility ........... SKIPPED
[INFO] Apache HBase - Prefix Tree ........................ SKIPPED
[INFO] Apache HBase - Server ............................. SKIPPED
[INFO] Apache HBase - Testing Util ....................... SKIPPED
[INFO] Apache HBase - Thrift ............................. SKIPPED
[INFO] Apache HBase - Rest ............................... SKIPPED
[INFO] Apache HBase - Shell .............................. SKIPPED
[INFO] Apache HBase - Integration Tests .................. SKIPPED
[INFO] Apache HBase - Examples ........................... SKIPPED
[INFO] Apache HBase - Assembly ........................... SKIPPED
[INFO] ------------------------------------------------------------------------
[INFO] BUILD FAILURE
[INFO] ------------------------------------------------------------------------
[INFO] Total time: 1:14.020s
[INFO] Finished at: Sun Nov 01 12:48:52 UTC 2015
[INFO] Final Memory: 38M/678M
[INFO] ------------------------------------------------------------------------
[ERROR] Failed to execute goal org.apache.maven.plugins:maven-surefire-plugin:2.18.1:test
(default-test) on project hbase-common: There are test failures.
[ERROR] 
[ERROR] Please refer to <https://builds.apache.org/job/HBase-0.98-matrix/jdk=latest1.6,label=Hadoop/ws/hbase-common/target/surefire-reports>
for the individual test results.
[ERROR] -> [Help 1]
[ERROR] 
[ERROR] To see the full stack trace of the errors, re-run Maven with the -e switch.
[ERROR] Re-run Maven using the -X switch to enable full debug logging.
[ERROR] 
[ERROR] For more information about the errors and possible solutions, please read the following
articles:
[ERROR] [Help 1] http://cwiki.apache.org/confluence/display/MAVEN/MojoFailureException
[ERROR] 
[ERROR] After correcting the problems, you can resume the build with the command
[ERROR]   mvn <goals> -rf :hbase-common
Build step 'Invoke top-level Maven targets' marked build as failure
Performing Post build task...
Match found for :.* : True
Logical operation result is TRUE
Running script  :   ZOMBIE_TESTS_COUNT=`jps | grep surefirebooter | wc -l`
  if [[ $ZOMBIE_TESTS_COUNT != 0 ]] ; then
    #It seems sometimes the tests are not dying immediately. Let's give them 10s
    echo "Suspicious java process found - waiting 10s to see if there are just slow to stop"
    sleep 10   
    ZOMBIE_TESTS_COUNT=`jps | grep surefirebooter | wc -l`
    if [[ $ZOMBIE_TESTS_COUNT != 0 ]] ; then
      echo "There are $ZOMBIE_TESTS_COUNT zombie tests, they should have been killed by surefire
but survived"
      echo "************ BEGIN zombies jstack extract"
      ZB_STACK=`jps | grep surefirebooter | cut -d ' ' -f 1 | xargs -n 1 jstack | grep ".test"
| grep "\.java"`
      jps | grep surefirebooter | cut -d ' ' -f 1 | xargs -n 1 jstack
      echo "************ END  zombies jstack extract"
      JIRA_COMMENT="$JIRA_COMMENT

     {color:red}-1 core zombie tests{color}.  There are ${ZOMBIE_TESTS_COUNT} zombie test(s):
${ZB_STACK}"
      BAD=1
      jps | grep surefirebooter | cut -d ' ' -f 1 | xargs kill -9
    else
      echo "We're ok: there is no zombie test, but some tests took some time to stop"
    fi
  else
    echo "We're ok: there is no zombie test"
  fi
[Hadoop] $ /bin/bash -xe /tmp/hudson404085661505959497.sh
++ jps
++ wc -l
++ grep surefirebooter
+ ZOMBIE_TESTS_COUNT=0
+ [[ 0 != 0 ]]
+ echo 'We'\''re ok: there is no zombie test'
We're ok: there is no zombie test
POST BUILD TASK : SUCCESS
END OF POST BUILD TASK : 0
Archiving artifacts
Recording test results

Mime
View raw message