hbase-builds mailing list archives

Site index · List index
Message view « Date » · « Thread »
Top « Date » · « Thread »
From Apache Jenkins Server <jenk...@builds.apache.org>
Subject Build failed in Jenkins: HBase-1.1-JDK7 #1593
Date Wed, 11 Nov 2015 15:39:10 GMT
See <https://builds.apache.org/job/HBase-1.1-JDK7/1593/changes>

Changes:

[jerryjch] HBASE-13982 Add info for visibility labels/cell TTLs to ImportTsv (NIDHI

------------------------------------------
[...truncated 5284 lines...]
Tests run: 7, Failures: 0, Errors: 0, Skipped: 0, Time elapsed: 17.399 sec - in org.apache.hadoop.hbase.security.access.TestTablePermissions
Tests run: 6, Failures: 0, Errors: 0, Skipped: 0, Time elapsed: 62.776 sec - in org.apache.hadoop.hbase.io.hfile.TestScannerSelectionUsingTTL
Running org.apache.hadoop.hbase.security.access.TestAccessControlFilter
Tests run: 1, Failures: 0, Errors: 0, Skipped: 0, Time elapsed: 3.142 sec - in org.apache.hadoop.hbase.security.access.TestAccessControlFilter
Running org.apache.hadoop.hbase.security.access.TestNamespaceCommands
Running org.apache.hadoop.hbase.security.access.TestCellACLWithMultipleVersions
Tests run: 7, Failures: 0, Errors: 0, Skipped: 0, Time elapsed: 4.989 sec - in org.apache.hadoop.hbase.security.access.TestNamespaceCommands
Running org.apache.hadoop.hbase.security.access.TestAccessController2
Running org.apache.hadoop.hbase.security.access.TestZKPermissionsWatcher
Tests run: 1, Failures: 0, Errors: 0, Skipped: 0, Time elapsed: 3.246 sec - in org.apache.hadoop.hbase.security.access.TestZKPermissionsWatcher
Running org.apache.hadoop.hbase.security.access.TestWithDisabledAuthorization
Tests run: 28, Failures: 0, Errors: 0, Skipped: 0, Time elapsed: 254.224 sec - in org.apache.hadoop.hbase.io.encoding.TestDataBlockEncoders
Tests run: 56, Failures: 0, Errors: 0, Skipped: 0, Time elapsed: 61.384 sec - in org.apache.hadoop.hbase.security.access.TestAccessController
Running org.apache.hadoop.hbase.security.access.TestScanEarlyTermination
Tests run: 6, Failures: 0, Errors: 0, Skipped: 0, Time elapsed: 34.556 sec - in org.apache.hadoop.hbase.security.access.TestAccessController2
Running org.apache.hadoop.hbase.security.visibility.TestVisibilityLablesWithGroups
Tests run: 1, Failures: 0, Errors: 0, Skipped: 0, Time elapsed: 4.766 sec - in org.apache.hadoop.hbase.security.access.TestScanEarlyTermination
Tests run: 1, Failures: 0, Errors: 0, Skipped: 0, Time elapsed: 2.774 sec - in org.apache.hadoop.hbase.security.visibility.TestVisibilityLablesWithGroups
Tests run: 8, Failures: 0, Errors: 0, Skipped: 0, Time elapsed: 47.702 sec - in org.apache.hadoop.hbase.security.access.TestCellACLWithMultipleVersions
Running org.apache.hadoop.hbase.security.visibility.TestVisibilityLabelsWithDeletes
Running org.apache.hadoop.hbase.security.visibility.TestVisibilityLabelsWithDefaultVisLabelService
Running org.apache.hadoop.hbase.security.visibility.TestVisibilityLabelsWithCustomVisLabService
Tests run: 6, Failures: 0, Errors: 0, Skipped: 0, Time elapsed: 33.591 sec - in org.apache.hadoop.hbase.security.access.TestWithDisabledAuthorization
Running org.apache.hadoop.hbase.security.visibility.TestDefaultScanLabelGeneratorStack
Tests run: 1, Failures: 0, Errors: 0, Skipped: 0, Time elapsed: 2.927 sec - in org.apache.hadoop.hbase.security.visibility.TestDefaultScanLabelGeneratorStack
Running org.apache.hadoop.hbase.security.visibility.TestVisibilityWithCheckAuths
Running org.apache.hadoop.hbase.security.visibility.TestVisibilityLabelsOpWithDifferentUsersNoACL
Tests run: 2, Failures: 0, Errors: 0, Skipped: 0, Time elapsed: 4.394 sec - in org.apache.hadoop.hbase.security.visibility.TestVisibilityWithCheckAuths
Tests run: 1, Failures: 0, Errors: 0, Skipped: 0, Time elapsed: 1.672 sec - in org.apache.hadoop.hbase.security.visibility.TestVisibilityLabelsOpWithDifferentUsersNoACL
Running org.apache.hadoop.hbase.security.visibility.TestVisibilityLabelsWithSLGStack
Tests run: 19, Failures: 0, Errors: 0, Skipped: 0, Time elapsed: 28.787 sec - in org.apache.hadoop.hbase.security.visibility.TestVisibilityLabelsWithCustomVisLabService
Running org.apache.hadoop.hbase.security.visibility.TestEnforcingScanLabelGenerator
Running org.apache.hadoop.hbase.security.visibility.TestVisibilityLabelsReplication
Tests run: 1, Failures: 0, Errors: 0, Skipped: 0, Time elapsed: 2.728 sec - in org.apache.hadoop.hbase.security.visibility.TestVisibilityLabelsWithSLGStack
Running org.apache.hadoop.hbase.security.visibility.TestVisibilityLabelReplicationWithExpAsString
Tests run: 23, Failures: 0, Errors: 0, Skipped: 0, Time elapsed: 31.988 sec - in org.apache.hadoop.hbase.security.visibility.TestVisibilityLabelsWithDefaultVisLabelService
Tests run: 1, Failures: 0, Errors: 0, Skipped: 0, Time elapsed: 2.728 sec - in org.apache.hadoop.hbase.security.visibility.TestEnforcingScanLabelGenerator
Running org.apache.hadoop.hbase.security.visibility.TestVisibilityLabelsWithACL
Running org.apache.hadoop.hbase.security.visibility.TestWithDisabledAuthorization
Tests run: 2, Failures: 0, Errors: 0, Skipped: 0, Time elapsed: 2.81 sec - in org.apache.hadoop.hbase.security.visibility.TestWithDisabledAuthorization
Running org.apache.hadoop.hbase.security.token.TestZKSecretWatcher
Tests run: 5, Failures: 0, Errors: 0, Skipped: 0, Time elapsed: 7.598 sec - in org.apache.hadoop.hbase.security.visibility.TestVisibilityLabelsWithACL
Tests run: 1, Failures: 0, Errors: 0, Skipped: 0, Time elapsed: 20.706 sec - in org.apache.hadoop.hbase.security.visibility.TestVisibilityLabelReplicationWithExpAsString
Tests run: 1, Failures: 0, Errors: 0, Skipped: 0, Time elapsed: 22.255 sec - in org.apache.hadoop.hbase.security.visibility.TestVisibilityLabelsReplication
Running org.apache.hadoop.hbase.security.token.TestTokenAuthentication
Tests run: 3, Failures: 0, Errors: 0, Skipped: 0, Time elapsed: 0.414 sec - in org.apache.hadoop.hbase.security.token.TestTokenAuthentication
Running org.apache.hadoop.hbase.TestHBaseOnOtherDfsCluster
Tests run: 1, Failures: 0, Errors: 0, Skipped: 0, Time elapsed: 13.228 sec - in org.apache.hadoop.hbase.security.token.TestZKSecretWatcher
Tests run: 1, Failures: 0, Errors: 0, Skipped: 0, Time elapsed: 12.455 sec - in org.apache.hadoop.hbase.TestHBaseOnOtherDfsCluster
Running org.apache.hadoop.hbase.security.token.TestGenerateDelegationToken
Tests run: 1, Failures: 0, Errors: 0, Skipped: 0, Time elapsed: 2.101 sec - in org.apache.hadoop.hbase.security.token.TestGenerateDelegationToken
Tests run: 39, Failures: 0, Errors: 0, Skipped: 0, Time elapsed: 81.976 sec - in org.apache.hadoop.hbase.security.visibility.TestVisibilityLabelsWithDeletes

Results :

Tests in error: 
org.apache.hadoop.hbase.master.TestMasterFailover.testMasterFailoverWithMockedRIT(org.apache.hadoop.hbase.master.TestMasterFailover)
  Run 1: TestMasterFailover.testMasterFailoverWithMockedRIT:175 » Bind Problem binding ...
  Run 2: TestMasterFailover.testMasterFailoverWithMockedRIT:175 » Bind Port in use: loc...
  Run 3: TestMasterFailover.testMasterFailoverWithMockedRIT:175 » Bind Port in use: loc...

org.apache.hadoop.hbase.master.TestMasterFailover.testMasterFailoverWithMockedRITOnDeadRS(org.apache.hadoop.hbase.master.TestMasterFailover)
  Run 1: TestMasterFailover.testMasterFailoverWithMockedRITOnDeadRS:513 » Bind Problem ...
  Run 2: TestMasterFailover.testMasterFailoverWithMockedRITOnDeadRS:513 » Bind Port in ...
  Run 3: TestMasterFailover.testMasterFailoverWithMockedRITOnDeadRS:513 » Bind Port in ...

org.apache.hadoop.hbase.master.TestMasterFailover.testShouldCheckMasterFailOverWhenMETAIsInOpenedState(org.apache.hadoop.hbase.master.TestMasterFailover)
  Run 1: TestMasterFailover.testShouldCheckMasterFailOverWhenMETAIsInOpenedState:957 » Bind
  Run 2: TestMasterFailover.testShouldCheckMasterFailOverWhenMETAIsInOpenedState:957 » Bind
  Run 3: TestMasterFailover.testShouldCheckMasterFailOverWhenMETAIsInOpenedState:957 » Bind

org.apache.hadoop.hbase.master.TestMasterFailover.testSimpleMasterFailover(org.apache.hadoop.hbase.master.TestMasterFailover)
  Run 1: TestMasterFailover.testSimpleMasterFailover:1086 » Bind Port in use: localhost...
  Run 2: TestMasterFailover.testSimpleMasterFailover:1086 » Bind Port in use: localhost...
  Run 3: TestMasterFailover.testSimpleMasterFailover:1086 » Bind Port in use: localhost...

  TestRegionPlacement2.setupBeforeClass:62 » Bind Problem binding to [localhost:...
org.apache.hadoop.hbase.master.TestTableLockManager.testDelete(org.apache.hadoop.hbase.master.TestTableLockManager)
  Run 1: TestTableLockManager.testDelete:214->prepareMiniCluster:92 » Bind Problem bind...
  Run 2: TestTableLockManager.testDelete:214->prepareMiniCluster:92 » Bind Port in use:...
  Run 3: TestTableLockManager.testDelete:214->prepareMiniCluster:92 » Bind Port in use:...

  TestMasterFailoverWithProcedures.testWALfencingWithoutWALRolling:173->testWALfencing:205
» FileNotFound
org.apache.hadoop.hbase.util.TestMiniClusterLoadEncoded.loadTest[0](org.apache.hadoop.hbase.util.TestMiniClusterLoadEncoded)
  Run 1: TestMiniClusterLoadEncoded>TestMiniClusterLoadSequential.setUp:104 » Bind Prob...
  Run 2: TestMiniClusterLoadEncoded>TestMiniClusterLoadSequential.setUp:104 » Bind Prob...
  Run 3: TestMiniClusterLoadEncoded>TestMiniClusterLoadSequential.setUp:104 » Bind Port...

org.apache.hadoop.hbase.util.TestMiniClusterLoadEncoded.loadTest[1](org.apache.hadoop.hbase.util.TestMiniClusterLoadEncoded)
  Run 1: TestMiniClusterLoadEncoded>TestMiniClusterLoadSequential.setUp:104 » Bind Port...
  Run 2: TestMiniClusterLoadEncoded>TestMiniClusterLoadSequential.setUp:104 » Bind Prob...
  Run 3: TestMiniClusterLoadEncoded>TestMiniClusterLoadSequential.setUp:104 » Bind Port...

org.apache.hadoop.hbase.util.TestMiniClusterLoadEncoded.loadTest[2](org.apache.hadoop.hbase.util.TestMiniClusterLoadEncoded)
  Run 1: TestMiniClusterLoadEncoded>TestMiniClusterLoadSequential.setUp:104 » Bind Port...
  Run 2: TestMiniClusterLoadEncoded>TestMiniClusterLoadSequential.setUp:104 » Bind Prob...
  Run 3: TestMiniClusterLoadEncoded>TestMiniClusterLoadSequential.setUp:104 » Bind Port...

org.apache.hadoop.hbase.util.TestMiniClusterLoadEncoded.loadTest[3](org.apache.hadoop.hbase.util.TestMiniClusterLoadEncoded)
  Run 1: TestMiniClusterLoadEncoded>TestMiniClusterLoadSequential.setUp:104 » Bind Prob...
  Run 2: TestMiniClusterLoadEncoded>TestMiniClusterLoadSequential.setUp:104 » Bind Port...
  Run 3: TestMiniClusterLoadEncoded>TestMiniClusterLoadSequential.setUp:104 » Bind Port...

org.apache.hadoop.hbase.util.TestMiniClusterLoadEncoded.loadTest[4](org.apache.hadoop.hbase.util.TestMiniClusterLoadEncoded)
  Run 1: TestMiniClusterLoadEncoded>TestMiniClusterLoadSequential.setUp:104 » Bind Prob...
  Run 2: TestMiniClusterLoadEncoded>TestMiniClusterLoadSequential.setUp:104 » Bind Port...
  Run 3: TestMiniClusterLoadEncoded>TestMiniClusterLoadSequential.setUp:104 » Bind Port...

org.apache.hadoop.hbase.util.hbck.TestOfflineMetaRebuildBase.testMetaRebuild(org.apache.hadoop.hbase.util.hbck.TestOfflineMetaRebuildBase)
  Run 1: TestOfflineMetaRebuildBase>OfflineMetaRebuildTestCore.setUpBefore:97 » Bind Po...
  Run 2: TestOfflineMetaRebuildBase>OfflineMetaRebuildTestCore.tearDownAfter:121 » NullPointer
  Run 3: TestOfflineMetaRebuildBase>OfflineMetaRebuildTestCore.setUpBefore:97 » Bind Pr...
  Run 4: TestOfflineMetaRebuildBase>OfflineMetaRebuildTestCore.tearDownAfter:121 » NullPointer
  Run 5: TestOfflineMetaRebuildBase>OfflineMetaRebuildTestCore.setUpBefore:97 » Bind Pr...
  Run 6: TestOfflineMetaRebuildBase>OfflineMetaRebuildTestCore.tearDownAfter:121 » NullPointer

org.apache.hadoop.hbase.util.hbck.TestOfflineMetaRebuildHole.testMetaRebuildHoleFail(org.apache.hadoop.hbase.util.hbck.TestOfflineMetaRebuildHole)
  Run 1: TestOfflineMetaRebuildHole>OfflineMetaRebuildTestCore.setUpBefore:97 » Bind Pr...
  Run 2: TestOfflineMetaRebuildHole>OfflineMetaRebuildTestCore.tearDownAfter:121 » NullPointer
  Run 3: TestOfflineMetaRebuildHole>OfflineMetaRebuildTestCore.setUpBefore:97 » Bind Po...
  Run 4: TestOfflineMetaRebuildHole>OfflineMetaRebuildTestCore.tearDownAfter:121 » NullPointer
  Run 5: TestOfflineMetaRebuildHole>OfflineMetaRebuildTestCore.setUpBefore:97 » Bind Pr...
  Run 6: TestOfflineMetaRebuildHole>OfflineMetaRebuildTestCore.tearDownAfter:121 » NullPointer

org.apache.hadoop.hbase.util.hbck.TestOfflineMetaRebuildOverlap.testMetaRebuildOverlapFail(org.apache.hadoop.hbase.util.hbck.TestOfflineMetaRebuildOverlap)
  Run 1: TestOfflineMetaRebuildOverlap>OfflineMetaRebuildTestCore.setUpBefore:97 » Bind
  Run 2: TestOfflineMetaRebuildOverlap>OfflineMetaRebuildTestCore.tearDownAfter:121 »
NullPointer
  Run 3: TestOfflineMetaRebuildOverlap>OfflineMetaRebuildTestCore.setUpBefore:97 » Bind
  Run 4: TestOfflineMetaRebuildOverlap>OfflineMetaRebuildTestCore.tearDownAfter:121 »
NullPointer
  Run 5: TestOfflineMetaRebuildOverlap>OfflineMetaRebuildTestCore.setUpBefore:97 » Bind
  Run 6: TestOfflineMetaRebuildOverlap>OfflineMetaRebuildTestCore.tearDownAfter:121 »
NullPointer


Tests run: 2437, Failures: 0, Errors: 15, Skipped: 21

[INFO] ------------------------------------------------------------------------
[INFO] Reactor Summary:
[INFO] 
[INFO] Apache HBase ...................................... SUCCESS [3.294s]
[INFO] Apache HBase - Checkstyle ......................... SUCCESS [0.753s]
[INFO] Apache HBase - Resource Bundle .................... SUCCESS [0.245s]
[INFO] Apache HBase - Annotations ........................ SUCCESS [0.972s]
[INFO] Apache HBase - Protocol ........................... SUCCESS [12.594s]
[INFO] Apache HBase - Common ............................. SUCCESS [1:25.365s]
[INFO] Apache HBase - Procedure .......................... SUCCESS [2:08.631s]
[INFO] Apache HBase - Client ............................. SUCCESS [1:22.743s]
[INFO] Apache HBase - Hadoop Compatibility ............... SUCCESS [7.273s]
[INFO] Apache HBase - Hadoop Two Compatibility ........... SUCCESS [6.460s]
[INFO] Apache HBase - Prefix Tree ........................ SUCCESS [8.946s]
[INFO] Apache HBase - Server ............................. FAILURE [1:28:25.371s]
[INFO] Apache HBase - Testing Util ....................... SKIPPED
[INFO] Apache HBase - Thrift ............................. SKIPPED
[INFO] Apache HBase - Rest ............................... SKIPPED
[INFO] Apache HBase - Shell .............................. SKIPPED
[INFO] Apache HBase - Integration Tests .................. SKIPPED
[INFO] Apache HBase - Examples ........................... SKIPPED
[INFO] Apache HBase - Assembly ........................... SKIPPED
[INFO] Apache HBase - Shaded ............................. SKIPPED
[INFO] Apache HBase - Shaded - Client .................... SKIPPED
[INFO] Apache HBase - Shaded - Server .................... SKIPPED
[INFO] ------------------------------------------------------------------------
[INFO] BUILD FAILURE
[INFO] ------------------------------------------------------------------------
[INFO] Total time: 1:34:04.438s
[INFO] Finished at: Wed Nov 11 15:30:51 UTC 2015
[INFO] Final Memory: 392M/648M
[INFO] ------------------------------------------------------------------------
[ERROR] Failed to execute goal org.apache.maven.plugins:maven-surefire-plugin:2.18.1:test
(secondPartTestsExecution) on project hbase-server: ExecutionException: java.lang.RuntimeException:
java.lang.RuntimeException: org.apache.maven.surefire.report.ReporterException: When writing
xml report stdout/stderr: /tmp/stderr8667859311135519425deferred (No such file or directory)
-> [Help 1]
[ERROR] 
[ERROR] To see the full stack trace of the errors, re-run Maven with the -e switch.
[ERROR] Re-run Maven using the -X switch to enable full debug logging.
[ERROR] 
[ERROR] For more information about the errors and possible solutions, please read the following
articles:
[ERROR] [Help 1] http://cwiki.apache.org/confluence/display/MAVEN/MojoFailureException
[ERROR] 
[ERROR] After correcting the problems, you can resume the build with the command
[ERROR]   mvn <goals> -rf :hbase-server
Build step 'Invoke top-level Maven targets' marked build as failure
Performing Post build task...
Match found for :.* : True
Logical operation result is TRUE
Running script  : # Post-build task script. TODO: Check this in and have all builds reference
check-in.
pwd && ls
# NOTE!!!! The below code has been copied and pasted from ./dev-tools/run-test.sh
# Do not change here without syncing there and vice-versa.
ZOMBIE_TESTS_COUNT=`jps -v | grep surefirebooter | grep -e '-Dhbase.test' | wc -l`
if [[ $ZOMBIE_TESTS_COUNT != 0 ]] ; then
 echo "Suspicious java process found - waiting 30s to see if there are just slow to stop"
 sleep 30
 ZOMBIE_TESTS_COUNT=`jps -v | grep surefirebooter | grep -e '-Dhbase.test' | wc -l`
 if [[ $ZOMBIE_TESTS_COUNT != 0 ]] ; then
   echo " {color:red}There appear to be $ZOMBIE_TESTS_COUNT zombie tests{color}, they should
have been killed by surefire but survived"
   jps -v | grep surefirebooter | grep -e '-Dhbase.test'
   jps -v | grep surefirebooter | grep -e '-Dhbase.test' | cut -d ' ' -f 1 | xargs -n 1 jstack
   # Exit with error
   exit 1
 else
   echo "We're ok: there is no zombie test, but some tests took some time to stop"
 fi
else
  echo "We're ok: there is no zombie test"
fi
[HBase-1.1-JDK7] $ /bin/bash -xe /tmp/hudson1332658404623648040.sh
+ pwd
<https://builds.apache.org/job/HBase-1.1-JDK7/ws/>
+ ls
bin
CHANGES.txt
conf
dev-support
hbase-annotations
hbase-assembly
hbase-checkstyle
hbase-client
hbase-common
hbase-examples
hbase-hadoop2-compat
hbase-hadoop-compat
hbase-it
hbase-native-client
hbase-prefix-tree
hbase-procedure
hbase-protocol
hbase-resource-bundle
hbase-rest
hbase-server
hbase-shaded
hbase-shell
hbase-testing-util
hbase-thrift
LICENSE.txt
NOTICE.txt
pom.xml
README.txt
src
target
++ jps -v
++ grep -e -Dhbase.test
++ grep surefirebooter
++ wc -l
+ ZOMBIE_TESTS_COUNT=0
+ [[ 0 != 0 ]]
+ echo 'We'\''re ok: there is no zombie test'
We're ok: there is no zombie test
POST BUILD TASK : SUCCESS
END OF POST BUILD TASK : 0
Archiving artifacts
Recording test results
Updating HBASE-13982

Mime
View raw message