hbase-builds mailing list archives

Site index · List index
Message view « Date » · « Thread »
Top « Date » · « Thread »
From Apache Jenkins Server <jenk...@builds.apache.org>
Subject Build failed in Jenkins: HBase-1.3-IT » IntegrationTestAcidGuarantees,latest1.8,Hadoop #297
Date Fri, 06 Nov 2015 03:37:54 GMT
See <https://builds.apache.org/job/HBase-1.3-IT/it.test=IntegrationTestAcidGuarantees,jdk=latest1.8,label=Hadoop/297/changes>

Changes:

[eclark] HBASE-14773 Fix HBase shell tests are skipped when skipping server

------------------------------------------
[...truncated 1652 lines...]
[INFO] --- maven-dependency-plugin:2.1:build-classpath (create-mrapp-generated-classpath)
@ hbase-it ---
[INFO] Skipped writing classpath file '<https://builds.apache.org/job/HBase-1.3-IT/it.test=IntegrationTestAcidGuarantees,jdk=latest1.8,label=Hadoop/ws/hbase-it/target/test-classes/mrapp-generated-classpath'.>
 No changes found.
[INFO] 
[INFO] --- maven-resources-plugin:2.6:testResources (default-testResources) @ hbase-it ---
[INFO] Using 'UTF-8' encoding to copy filtered resources.
[INFO] Copying 14 resources
[INFO] Copying 3 resources
[INFO] Copying 3 resources
[INFO] 
[INFO] --- maven-compiler-plugin:2.5.1:testCompile (default-testCompile) @ hbase-it ---
[INFO] Nothing to compile - all classes are up to date
[INFO] 
[INFO] --- maven-surefire-plugin:2.18.1:test (default-test) @ hbase-it ---
[INFO] Skipping execution of surefire because it has already been run for this configuration
[INFO] 
[INFO] --- maven-surefire-plugin:2.18.1:test (secondPartTestsExecution) @ hbase-it ---
[INFO] Tests are skipped.
[INFO] 
[INFO] --- maven-jar-plugin:2.4:test-jar (default) @ hbase-it ---
[INFO] Building jar: <https://builds.apache.org/job/HBase-1.3-IT/it.test=IntegrationTestAcidGuarantees,jdk=latest1.8,label=Hadoop/ws/hbase-it/target/hbase-it-1.3.0-SNAPSHOT-tests.jar>
[WARNING] Artifact org.apache.hbase:hbase-it:test-jar:tests:1.3.0-SNAPSHOT already attached
to project, ignoring duplicate
[INFO] 
[INFO] --- maven-jar-plugin:2.4:jar (default-jar) @ hbase-it ---
[INFO] Building jar: <https://builds.apache.org/job/HBase-1.3-IT/it.test=IntegrationTestAcidGuarantees,jdk=latest1.8,label=Hadoop/ws/hbase-it/target/hbase-it-1.3.0-SNAPSHOT.jar>
[INFO] 
[INFO] --- maven-failsafe-plugin:2.18.1:integration-test (integration-test) @ hbase-it ---
[WARNING] The parameter forkMode is deprecated since version 2.14. Use forkCount and reuseForks
instead.
[INFO] Failsafe report directory: <https://builds.apache.org/job/HBase-1.3-IT/it.test=IntegrationTestAcidGuarantees,jdk=latest1.8,label=Hadoop/ws/hbase-it/target/failsafe-reports>
[INFO] Using configured provider org.apache.maven.surefire.junit4.JUnit4Provider

-------------------------------------------------------
 T E S T S
-------------------------------------------------------
Running org.apache.hadoop.hbase.IntegrationTestAcidGuarantees
Tests run: 3, Failures: 0, Errors: 1, Skipped: 0, Time elapsed: 941.98 sec <<< FAILURE!
- in org.apache.hadoop.hbase.IntegrationTestAcidGuarantees
testScanAtomicity(org.apache.hadoop.hbase.IntegrationTestAcidGuarantees)  Time elapsed: 557.618
sec  <<< ERROR!
java.lang.RuntimeException: Deferred
	at org.apache.hadoop.hbase.MultithreadedTestUtil$TestContext.checkException(MultithreadedTestUtil.java:78)
	at org.apache.hadoop.hbase.MultithreadedTestUtil$TestContext.stop(MultithreadedTestUtil.java:105)
	at org.apache.hadoop.hbase.TestAcidGuarantees.runTestAtomicity(TestAcidGuarantees.java:316)
	at org.apache.hadoop.hbase.TestAcidGuarantees.runTestAtomicity(TestAcidGuarantees.java:254)
	at org.apache.hadoop.hbase.IntegrationTestAcidGuarantees.testScanAtomicity(IntegrationTestAcidGuarantees.java:101)
Caused by: org.apache.hadoop.hbase.client.RetriesExhaustedException: Failed after attempts=36,
exceptions:
Fri Nov 06 03:29:35 UTC 2015, null, java.net.SocketTimeoutException: callTimeout=60000, callDuration=68043:
row '' on table 'TestAcidGuarantees' at region=TestAcidGuarantees,,1446780518976.d41858d75e26d459aadaf41bd1dad610.,
hostname=asf904.gq1.ygridcore.net,52073,1446780514683, seqNum=2

	at org.apache.hadoop.hbase.client.RpcRetryingCallerWithReadReplicas.throwEnrichedException(RpcRetryingCallerWithReadReplicas.java:276)
	at org.apache.hadoop.hbase.client.ScannerCallableWithReplicas.call(ScannerCallableWithReplicas.java:195)
	at org.apache.hadoop.hbase.client.ScannerCallableWithReplicas.call(ScannerCallableWithReplicas.java:59)
	at org.apache.hadoop.hbase.client.RpcRetryingCaller.callWithoutRetries(RpcRetryingCaller.java:200)
	at org.apache.hadoop.hbase.client.ClientScanner.call(ClientScanner.java:320)
	at org.apache.hadoop.hbase.client.ClientScanner.nextScanner(ClientScanner.java:295)
	at org.apache.hadoop.hbase.client.ClientScanner.initializeScannerInConstruction(ClientScanner.java:160)
	at org.apache.hadoop.hbase.client.ClientScanner.<init>(ClientScanner.java:155)
	at org.apache.hadoop.hbase.client.HTable.getScanner(HTable.java:804)
	at org.apache.hadoop.hbase.TestAcidGuarantees$AtomicScanReader.doAnAction(TestAcidGuarantees.java:214)
	at org.apache.hadoop.hbase.MultithreadedTestUtil$RepeatingTestThread.doWork(MultithreadedTestUtil.java:147)
	at org.apache.hadoop.hbase.MultithreadedTestUtil$TestThread.run(MultithreadedTestUtil.java:123)
Caused by: java.net.SocketTimeoutException: callTimeout=60000, callDuration=68043: row ''
on table 'TestAcidGuarantees' at region=TestAcidGuarantees,,1446780518976.d41858d75e26d459aadaf41bd1dad610.,
hostname=asf904.gq1.ygridcore.net,52073,1446780514683, seqNum=2
	at org.apache.hadoop.hbase.client.RpcRetryingCaller.callWithRetries(RpcRetryingCaller.java:159)
	at org.apache.hadoop.hbase.client.ResultBoundedCompletionService$QueueingFuture.run(ResultBoundedCompletionService.java:65)
	at java.util.concurrent.ThreadPoolExecutor.runWorker(ThreadPoolExecutor.java:1142)
	at java.util.concurrent.ThreadPoolExecutor$Worker.run(ThreadPoolExecutor.java:617)
	at java.lang.Thread.run(Thread.java:745)
Caused by: org.apache.hadoop.hbase.NotServingRegionException: org.apache.hadoop.hbase.NotServingRegionException:
Region TestAcidGuarantees,,1446780518976.d41858d75e26d459aadaf41bd1dad610. is not online on
asf904.gq1.ygridcore.net,52073,1446780514683
	at org.apache.hadoop.hbase.regionserver.HRegionServer.getRegionByEncodedName(HRegionServer.java:2913)
	at org.apache.hadoop.hbase.regionserver.RSRpcServices.getRegion(RSRpcServices.java:976)
	at org.apache.hadoop.hbase.regionserver.RSRpcServices.scan(RSRpcServices.java:2267)
	at org.apache.hadoop.hbase.protobuf.generated.ClientProtos$ClientService$2.callBlockingMethod(ClientProtos.java:32798)
	at org.apache.hadoop.hbase.ipc.RpcServer.call(RpcServer.java:2170)
	at org.apache.hadoop.hbase.ipc.CallRunner.run(CallRunner.java:109)
	at org.apache.hadoop.hbase.ipc.RpcExecutor.consumerLoop(RpcExecutor.java:133)
	at org.apache.hadoop.hbase.ipc.RpcExecutor$1.run(RpcExecutor.java:108)
	at java.lang.Thread.run(Thread.java:745)

	at sun.reflect.GeneratedConstructorAccessor39.newInstance(Unknown Source)
	at sun.reflect.DelegatingConstructorAccessorImpl.newInstance(DelegatingConstructorAccessorImpl.java:45)
	at java.lang.reflect.Constructor.newInstance(Constructor.java:422)
	at org.apache.hadoop.ipc.RemoteException.instantiateException(RemoteException.java:106)
	at org.apache.hadoop.ipc.RemoteException.unwrapRemoteException(RemoteException.java:95)
	at org.apache.hadoop.hbase.protobuf.ProtobufUtil.getRemoteException(ProtobufUtil.java:329)
	at org.apache.hadoop.hbase.client.ScannerCallable.openScanner(ScannerCallable.java:401)
	at org.apache.hadoop.hbase.client.ScannerCallable.call(ScannerCallable.java:202)
	at org.apache.hadoop.hbase.client.ScannerCallable.call(ScannerCallable.java:64)
	at org.apache.hadoop.hbase.client.RpcRetryingCaller.callWithoutRetries(RpcRetryingCaller.java:200)
	at org.apache.hadoop.hbase.client.ScannerCallableWithReplicas$RetryingRPC.call(ScannerCallableWithReplicas.java:346)
	at org.apache.hadoop.hbase.client.ScannerCallableWithReplicas$RetryingRPC.call(ScannerCallableWithReplicas.java:320)
	at org.apache.hadoop.hbase.client.RpcRetryingCaller.callWithRetries(RpcRetryingCaller.java:126)
	at org.apache.hadoop.hbase.client.ResultBoundedCompletionService$QueueingFuture.run(ResultBoundedCompletionService.java:65)
	at java.util.concurrent.ThreadPoolExecutor.runWorker(ThreadPoolExecutor.java:1142)
	at java.util.concurrent.ThreadPoolExecutor$Worker.run(ThreadPoolExecutor.java:617)
	at java.lang.Thread.run(Thread.java:745)
Caused by: org.apache.hadoop.hbase.ipc.RemoteWithExtrasException: org.apache.hadoop.hbase.NotServingRegionException:
Region TestAcidGuarantees,,1446780518976.d41858d75e26d459aadaf41bd1dad610. is not online on
asf904.gq1.ygridcore.net,52073,1446780514683
	at org.apache.hadoop.hbase.regionserver.HRegionServer.getRegionByEncodedName(HRegionServer.java:2913)
	at org.apache.hadoop.hbase.regionserver.RSRpcServices.getRegion(RSRpcServices.java:976)
	at org.apache.hadoop.hbase.regionserver.RSRpcServices.scan(RSRpcServices.java:2267)
	at org.apache.hadoop.hbase.protobuf.generated.ClientProtos$ClientService$2.callBlockingMethod(ClientProtos.java:32798)
	at org.apache.hadoop.hbase.ipc.RpcServer.call(RpcServer.java:2170)
	at org.apache.hadoop.hbase.ipc.CallRunner.run(CallRunner.java:109)
	at org.apache.hadoop.hbase.ipc.RpcExecutor.consumerLoop(RpcExecutor.java:133)
	at org.apache.hadoop.hbase.ipc.RpcExecutor$1.run(RpcExecutor.java:108)
	at java.lang.Thread.run(Thread.java:745)

	at org.apache.hadoop.hbase.ipc.RpcClientImpl.call(RpcClientImpl.java:1258)
	at org.apache.hadoop.hbase.ipc.AbstractRpcClient.callBlockingMethod(AbstractRpcClient.java:217)
	at org.apache.hadoop.hbase.ipc.AbstractRpcClient$BlockingRpcChannelImplementation.callBlockingMethod(AbstractRpcClient.java:295)
	at org.apache.hadoop.hbase.protobuf.generated.ClientProtos$ClientService$BlockingStub.scan(ClientProtos.java:33244)
	at org.apache.hadoop.hbase.client.ScannerCallable.openScanner(ScannerCallable.java:393)
	at org.apache.hadoop.hbase.client.ScannerCallable.call(ScannerCallable.java:202)
	at org.apache.hadoop.hbase.client.ScannerCallable.call(ScannerCallable.java:64)
	at org.apache.hadoop.hbase.client.RpcRetryingCaller.callWithoutRetries(RpcRetryingCaller.java:200)
	at org.apache.hadoop.hbase.client.ScannerCallableWithReplicas$RetryingRPC.call(ScannerCallableWithReplicas.java:346)
	at org.apache.hadoop.hbase.client.ScannerCallableWithReplicas$RetryingRPC.call(ScannerCallableWithReplicas.java:320)
	at org.apache.hadoop.hbase.client.RpcRetryingCaller.callWithRetries(RpcRetryingCaller.java:126)
	at org.apache.hadoop.hbase.client.ResultBoundedCompletionService$QueueingFuture.run(ResultBoundedCompletionService.java:65)
	at java.util.concurrent.ThreadPoolExecutor.runWorker(ThreadPoolExecutor.java:1142)
	at java.util.concurrent.ThreadPoolExecutor$Worker.run(ThreadPoolExecutor.java:617)
	at java.lang.Thread.run(Thread.java:745)


Results :

Tests in error: 
  IntegrationTestAcidGuarantees.testScanAtomicity:101 » Runtime Deferred

Tests run: 3, Failures: 0, Errors: 1, Skipped: 0

[WARNING] File encoding has not been set, using platform encoding ISO-8859-1, i.e. build is
platform dependent! The file encoding for reports output files should be provided by the POM
property ${project.reporting.outputEncoding}.
[INFO] 
[INFO] --- maven-failsafe-plugin:2.18.1:verify (verify) @ hbase-it ---
[INFO] Failsafe report directory: <https://builds.apache.org/job/HBase-1.3-IT/it.test=IntegrationTestAcidGuarantees,jdk=latest1.8,label=Hadoop/ws/hbase-it/target/failsafe-reports>
[WARNING] File encoding has not been set, using platform encoding ISO-8859-1, i.e. build is
platform dependent! The file encoding for reports output files should be provided by the POM
property ${project.reporting.outputEncoding}.
[INFO] ------------------------------------------------------------------------
[INFO] Reactor Summary:
[INFO] 
[INFO] Apache HBase ...................................... SUCCESS [4.224s]
[INFO] Apache HBase - Checkstyle ......................... SUCCESS [0.906s]
[INFO] Apache HBase - Resource Bundle .................... SUCCESS [0.350s]
[INFO] Apache HBase - Annotations ........................ SUCCESS [1.423s]
[INFO] Apache HBase - Protocol ........................... SUCCESS [16.208s]
[INFO] Apache HBase - Common ............................. SUCCESS [9.427s]
[INFO] Apache HBase - Procedure .......................... SUCCESS [1.785s]
[INFO] Apache HBase - Client ............................. SUCCESS [7.416s]
[INFO] Apache HBase - Hadoop Compatibility ............... SUCCESS [0.580s]
[INFO] Apache HBase - Hadoop Two Compatibility ........... SUCCESS [1.388s]
[INFO] Apache HBase - Prefix Tree ........................ SUCCESS [1.294s]
[INFO] Apache HBase - Server ............................. SUCCESS [43.413s]
[INFO] Apache HBase - Testing Util ....................... SUCCESS [2.042s]
[INFO] Apache HBase - Thrift ............................. SUCCESS [6.395s]
[INFO] Apache HBase - Rest ............................... SUCCESS [3.374s]
[INFO] Apache HBase - Shell .............................. SUCCESS [1.192s]
[INFO] Apache HBase - Integration Tests .................. FAILURE [15:53.131s]
[INFO] Apache HBase - Examples ........................... SKIPPED
[INFO] Apache HBase - External Block Cache ............... SKIPPED
[INFO] Apache HBase - Assembly ........................... SKIPPED
[INFO] Apache HBase - Shaded ............................. SKIPPED
[INFO] Apache HBase - Shaded - Client .................... SKIPPED
[INFO] Apache HBase - Shaded - Server .................... SKIPPED
[INFO] ------------------------------------------------------------------------
[INFO] BUILD FAILURE
[INFO] ------------------------------------------------------------------------
[INFO] Total time: 17:36.177s
[INFO] Finished at: Fri Nov 06 03:37:59 UTC 2015
[INFO] Final Memory: 182M/3354M
[INFO] ------------------------------------------------------------------------
[ERROR] Failed to execute goal org.apache.maven.plugins:maven-failsafe-plugin:2.18.1:verify
(verify) on project hbase-it: There are test failures.
[ERROR] 
[ERROR] Please refer to <https://builds.apache.org/job/HBase-1.3-IT/it.test=IntegrationTestAcidGuarantees,jdk=latest1.8,label=Hadoop/ws/hbase-it/target/failsafe-reports>
for the individual test results.
[ERROR] -> [Help 1]
[ERROR] 
[ERROR] To see the full stack trace of the errors, re-run Maven with the -e switch.
[ERROR] Re-run Maven using the -X switch to enable full debug logging.
[ERROR] 
[ERROR] For more information about the errors and possible solutions, please read the following
articles:
[ERROR] [Help 1] http://cwiki.apache.org/confluence/display/MAVEN/MojoFailureException
[ERROR] 
[ERROR] After correcting the problems, you can resume the build with the command
[ERROR]   mvn <goals> -rf :hbase-it
Build step 'Invoke top-level Maven targets' marked build as failure
Performing Post build task...
Match found for :.* : True
Logical operation result is TRUE
Running script  : # Post-build task script. TODO: Check this in and have all builds reference
check-in.
pwd && ls
# NOTE!!!! The below code has been copied and pasted from ./dev-tools/run-test.sh
# Do not change here without syncing there and vice-versa.
ZOMBIE_TESTS_COUNT=`jps -v | grep surefirebooter | grep -e '-Dhbase.test' | wc -l`
if [[ $ZOMBIE_TESTS_COUNT != 0 ]] ; then
 echo "Suspicious java process found - waiting 30s to see if there are just slow to stop"
 sleep 30
 ZOMBIE_TESTS_COUNT=`jps -v | grep surefirebooter | grep -e '-Dhbase.test' | wc -l`
 if [[ $ZOMBIE_TESTS_COUNT != 0 ]] ; then
   echo " {color:red}There appear to be $ZOMBIE_TESTS_COUNT zombie tests{color}, they should
have been killed by surefire but survived"
   jps -v | grep surefirebooter | grep -e '-Dhbase.test'
   jps -v | grep surefirebooter | grep -e '-Dhbase.test' | cut -d ' ' -f 1 | xargs -n 1 jstack
   # Exit with error
   exit 1
 else
   echo "We're ok: there is no zombie test, but some tests took some time to stop"
 fi
else
  echo "We're ok: there is no zombie test"
fi
[Hadoop] $ /bin/bash -xe /tmp/hudson7136344162237337598.sh
+ pwd
<https://builds.apache.org/job/HBase-1.3-IT/it.test=IntegrationTestAcidGuarantees,jdk=latest1.8,label=Hadoop/ws/>
+ ls
bin
CHANGES.txt
conf
dev-support
hbase-annotations
hbase-assembly
hbase-checkstyle
hbase-client
hbase-common
hbase-examples
hbase-external-blockcache
hbase-hadoop2-compat
hbase-hadoop-compat
hbase-it
hbase-native-client
hbase-prefix-tree
hbase-procedure
hbase-protocol
hbase-resource-bundle
hbase-rest
hbase-server
hbase-shaded
hbase-shell
hbase-spark
hbase-testing-util
hbase-thrift
LICENSE.txt
NOTICE.txt
pom.xml
README.txt
src
target
++ jps -v
++ grep surefirebooter
++ grep -e -Dhbase.test
++ wc -l
+ ZOMBIE_TESTS_COUNT=0
+ [[ 0 != 0 ]]
+ echo 'We'\''re ok: there is no zombie test'
We're ok: there is no zombie test
POST BUILD TASK : SUCCESS
END OF POST BUILD TASK : 0
Archiving artifacts

Mime
View raw message