hbase-builds mailing list archives

Site index · List index
Message view « Date » · « Thread »
Top « Date » · « Thread »
From Apache Jenkins Server <jenk...@builds.apache.org>
Subject Build failed in Jenkins: HBase-1.3 » latest1.8,Hadoop #389
Date Mon, 23 Nov 2015 06:43:12 GMT
See <https://builds.apache.org/job/HBase-1.3/jdk=latest1.8,label=Hadoop/389/>

------------------------------------------
[...truncated 45188 lines...]
Running org.apache.hadoop.hbase.master.TestGetInfoPort
Running org.apache.hadoop.hbase.master.TestMasterStatusServlet
Tests run: 4, Failures: 0, Errors: 0, Skipped: 0, Time elapsed: 1.423 sec - in org.apache.hadoop.hbase.master.TestMasterStatusServlet
Java HotSpot(TM) 64-Bit Server VM warning: ignoring option MaxPermSize=256m; support was removed
in 8.0
Running org.apache.hadoop.hbase.master.TestWarmupRegion
Java HotSpot(TM) 64-Bit Server VM warning: ignoring option MaxPermSize=256m; support was removed
in 8.0
Java HotSpot(TM) 64-Bit Server VM warning: ignoring option MaxPermSize=256m; support was removed
in 8.0
Running org.apache.hadoop.hbase.master.balancer.TestDefaultLoadBalancer
Tests run: 1, Failures: 0, Errors: 0, Skipped: 0, Time elapsed: 3.535 sec - in org.apache.hadoop.hbase.master.balancer.TestDefaultLoadBalancer
Java HotSpot(TM) 64-Bit Server VM warning: ignoring option MaxPermSize=256m; support was removed
in 8.0
Running org.apache.hadoop.hbase.master.balancer.TestBaseLoadBalancer
Tests run: 7, Failures: 0, Errors: 0, Skipped: 0, Time elapsed: 0.82 sec - in org.apache.hadoop.hbase.master.balancer.TestBaseLoadBalancer
Java HotSpot(TM) 64-Bit Server VM warning: ignoring option MaxPermSize=256m; support was removed
in 8.0
Java HotSpot(TM) 64-Bit Server VM warning: ignoring option MaxPermSize=256m; support was removed
in 8.0
Running org.apache.hadoop.hbase.master.TestMasterFailover
Tests run: 1, Failures: 0, Errors: 0, Skipped: 0, Time elapsed: 12.17 sec - in org.apache.hadoop.hbase.master.TestGetInfoPort
Java HotSpot(TM) 64-Bit Server VM warning: ignoring option MaxPermSize=256m; support was removed
in 8.0
Running org.apache.hadoop.hbase.master.TestMasterNoCluster
Tests run: 1, Failures: 0, Errors: 0, Skipped: 0, Time elapsed: 20.572 sec - in org.apache.hadoop.hbase.master.TestWarmupRegion
Java HotSpot(TM) 64-Bit Server VM warning: ignoring option MaxPermSize=256m; support was removed
in 8.0
Running org.apache.hadoop.hbase.master.TestGetLastFlushedSequenceId
Tests run: 2, Failures: 0, Errors: 0, Skipped: 0, Time elapsed: 26.069 sec - in org.apache.hadoop.hbase.master.TestMasterOperationsForRegionReplicas
Java HotSpot(TM) 64-Bit Server VM warning: ignoring option MaxPermSize=256m; support was removed
in 8.0
Tests run: 4, Failures: 0, Errors: 0, Skipped: 0, Time elapsed: 29.448 sec - in org.apache.hadoop.hbase.master.cleaner.TestSnapshotFromMaster
Java HotSpot(TM) 64-Bit Server VM warning: ignoring option MaxPermSize=256m; support was removed
in 8.0
Running org.apache.hadoop.hbase.master.TestRollingRestart
Tests run: 3, Failures: 0, Errors: 0, Skipped: 0, Time elapsed: 13.733 sec - in org.apache.hadoop.hbase.master.TestMasterNoCluster
Java HotSpot(TM) 64-Bit Server VM warning: ignoring option MaxPermSize=256m; support was removed
in 8.0
Running org.apache.hadoop.hbase.master.TestMetaShutdownHandler
Running org.apache.hadoop.hbase.master.TestRegionPlacement2
Tests run: 1, Failures: 0, Errors: 0, Skipped: 0, Time elapsed: 20.634 sec - in org.apache.hadoop.hbase.master.TestGetLastFlushedSequenceId
Java HotSpot(TM) 64-Bit Server VM warning: ignoring option MaxPermSize=256m; support was removed
in 8.0
Tests run: 2, Failures: 0, Errors: 0, Skipped: 0, Time elapsed: 2.141 sec - in org.apache.hadoop.hbase.master.TestRegionPlacement2
Java HotSpot(TM) 64-Bit Server VM warning: ignoring option MaxPermSize=256m; support was removed
in 8.0
Tests run: 1, Failures: 0, Errors: 0, Skipped: 0, Time elapsed: 28.24 sec - in org.apache.hadoop.hbase.master.TestRollingRestart
Java HotSpot(TM) 64-Bit Server VM warning: ignoring option MaxPermSize=256m; support was removed
in 8.0
Running org.apache.hadoop.hbase.master.TestActiveMasterManager
Running org.apache.hadoop.hbase.master.TestMaster
Tests run: 2, Failures: 0, Errors: 0, Skipped: 0, Time elapsed: 0.862 sec - in org.apache.hadoop.hbase.master.TestActiveMasterManager
Java HotSpot(TM) 64-Bit Server VM warning: ignoring option MaxPermSize=256m; support was removed
in 8.0
Running org.apache.hadoop.hbase.master.TestMasterMetricsWrapper
Java HotSpot(TM) 64-Bit Server VM warning: ignoring option MaxPermSize=256m; support was removed
in 8.0
Tests run: 1, Failures: 0, Errors: 0, Skipped: 0, Time elapsed: 2.626 sec - in org.apache.hadoop.hbase.master.TestMasterMetricsWrapper
Java HotSpot(TM) 64-Bit Server VM warning: ignoring option MaxPermSize=256m; support was removed
in 8.0
Running org.apache.hadoop.hbase.master.TestMasterTransitions
Tests run: 3, Failures: 0, Errors: 0, Skipped: 3, Time elapsed: 0.001 sec - in org.apache.hadoop.hbase.master.TestMasterTransitions
Java HotSpot(TM) 64-Bit Server VM warning: ignoring option MaxPermSize=256m; support was removed
in 8.0
Java HotSpot(TM) 64-Bit Server VM warning: ignoring option MaxPermSize=256m; support was removed
in 8.0
Running org.apache.hadoop.hbase.master.TestRestartCluster
Running org.apache.hadoop.hbase.master.normalizer.TestSimpleRegionNormalizerOnCluster
Tests run: 4, Failures: 0, Errors: 0, Skipped: 0, Time elapsed: 13.519 sec - in org.apache.hadoop.hbase.master.TestMaster
Java HotSpot(TM) 64-Bit Server VM warning: ignoring option MaxPermSize=256m; support was removed
in 8.0
Running org.apache.hadoop.hbase.master.TestOpenedRegionHandler
Tests run: 1, Failures: 0, Errors: 0, Skipped: 0, Time elapsed: 31.829 sec - in org.apache.hadoop.hbase.master.TestMetaShutdownHandler
Java HotSpot(TM) 64-Bit Server VM warning: ignoring option MaxPermSize=256m; support was removed
in 8.0
Running org.apache.hadoop.hbase.master.handler.TestTableDescriptorModification
Tests run: 2, Failures: 0, Errors: 0, Skipped: 0, Time elapsed: 16.196 sec - in org.apache.hadoop.hbase.master.TestOpenedRegionHandler
Java HotSpot(TM) 64-Bit Server VM warning: ignoring option MaxPermSize=256m; support was removed
in 8.0
Running org.apache.hadoop.hbase.master.handler.TestCreateTableHandler
Tests run: 2, Failures: 0, Errors: 0, Skipped: 0, Time elapsed: 27.543 sec - in org.apache.hadoop.hbase.master.normalizer.TestSimpleRegionNormalizerOnCluster
Java HotSpot(TM) 64-Bit Server VM warning: ignoring option MaxPermSize=256m; support was removed
in 8.0
Running org.apache.hadoop.hbase.master.handler.TestEnableTableHandler
Tests run: 7, Failures: 0, Errors: 0, Skipped: 0, Time elapsed: 92.508 sec - in org.apache.hadoop.hbase.master.TestMasterFailover
Java HotSpot(TM) 64-Bit Server VM warning: ignoring option MaxPermSize=256m; support was removed
in 8.0
Tests run: 3, Failures: 0, Errors: 0, Skipped: 0, Time elapsed: 50.025 sec - in org.apache.hadoop.hbase.master.TestRestartCluster
Java HotSpot(TM) 64-Bit Server VM warning: ignoring option MaxPermSize=256m; support was removed
in 8.0
Running org.apache.hadoop.hbase.master.TestMasterPriorityRpc
Tests run: 3, Failures: 0, Errors: 0, Skipped: 0, Time elapsed: 2.053 sec - in org.apache.hadoop.hbase.master.TestMasterPriorityRpc
Java HotSpot(TM) 64-Bit Server VM warning: ignoring option MaxPermSize=256m; support was removed
in 8.0
Running org.apache.hadoop.hbase.master.TestSplitLogManager
Running org.apache.hadoop.hbase.master.handler.TestTableDeleteFamilyHandler
Tests run: 3, Failures: 0, Errors: 0, Skipped: 0, Time elapsed: 29.454 sec - in org.apache.hadoop.hbase.master.handler.TestCreateTableHandler
Java HotSpot(TM) 64-Bit Server VM warning: ignoring option MaxPermSize=256m; support was removed
in 8.0
Java HotSpot(TM) 64-Bit Server VM warning: ignoring option MaxPermSize=256m; support was removed
in 8.0
Tests run: 7, Failures: 0, Errors: 0, Skipped: 0, Time elapsed: 36.561 sec - in org.apache.hadoop.hbase.master.handler.TestTableDescriptorModification
Java HotSpot(TM) 64-Bit Server VM warning: ignoring option MaxPermSize=256m; support was removed
in 8.0
Running org.apache.hadoop.hbase.master.TestRegionPlacement
Tests run: 2, Failures: 0, Errors: 0, Skipped: 2, Time elapsed: 0.001 sec - in org.apache.hadoop.hbase.master.TestRegionPlacement
Java HotSpot(TM) 64-Bit Server VM warning: ignoring option MaxPermSize=256m; support was removed
in 8.0
Running org.apache.hadoop.hbase.master.TestClusterStatusPublisher
Tests run: 3, Failures: 0, Errors: 0, Skipped: 0, Time elapsed: 0.636 sec - in org.apache.hadoop.hbase.master.TestClusterStatusPublisher
Java HotSpot(TM) 64-Bit Server VM warning: ignoring option MaxPermSize=256m; support was removed
in 8.0
Running org.apache.hadoop.hbase.master.TestTableLockManager
Running org.apache.hadoop.hbase.master.TestAssignmentManagerOnCluster
Tests run: 2, Failures: 0, Errors: 0, Skipped: 0, Time elapsed: 15.581 sec - in org.apache.hadoop.hbase.master.handler.TestTableDeleteFamilyHandler
Java HotSpot(TM) 64-Bit Server VM warning: ignoring option MaxPermSize=256m; support was removed
in 8.0
Running org.apache.hadoop.hbase.master.TestMasterMetrics
Tests run: 3, Failures: 0, Errors: 0, Skipped: 0, Time elapsed: 49.336 sec - in org.apache.hadoop.hbase.master.handler.TestEnableTableHandler
Java HotSpot(TM) 64-Bit Server VM warning: ignoring option MaxPermSize=256m; support was removed
in 8.0
Tests run: 2, Failures: 0, Errors: 0, Skipped: 0, Time elapsed: 1.404 sec - in org.apache.hadoop.hbase.master.TestMasterMetrics
Java HotSpot(TM) 64-Bit Server VM warning: ignoring option MaxPermSize=256m; support was removed
in 8.0
Running org.apache.hadoop.hbase.master.TestMasterFileSystem
Tests run: 2, Failures: 0, Errors: 0, Skipped: 0, Time elapsed: 1.461 sec - in org.apache.hadoop.hbase.master.TestMasterFileSystem
Tests run: 4, Failures: 0, Errors: 1, Skipped: 0, Time elapsed: 83.46 sec <<< FAILURE!
- in org.apache.hadoop.hbase.master.TestTableLockManager
testReapAllTableLocks(org.apache.hadoop.hbase.master.TestTableLockManager)  Time elapsed:
0.077 sec  <<< ERROR!
org.apache.hadoop.hbase.exceptions.LockTimeoutException: Timed out acquiring writelock for
table:table4for:zero timeout after 0 ms.
	at org.apache.hadoop.hbase.master.TableLockManager$ZKTableLockManager$TableLockImpl.acquire(TableLockManager.java:282)
	at org.apache.hadoop.hbase.master.TestTableLockManager.testReapAllTableLocks(TestTableLockManager.java:283)

Tests run: 1, Failures: 0, Errors: 1, Skipped: 0, Time elapsed: 83.555 sec <<< FAILURE!
- in org.apache.hadoop.hbase.master.TestTableLockManager
testReapAllTableLocks(org.apache.hadoop.hbase.master.TestTableLockManager)  Time elapsed:
0.045 sec  <<< ERROR!
org.apache.hadoop.hbase.exceptions.LockTimeoutException: Timed out acquiring writelock for
table:table4for:zero timeout after 0 ms.
	at org.apache.hadoop.hbase.master.TableLockManager$ZKTableLockManager$TableLockImpl.acquire(TableLockManager.java:282)
	at org.apache.hadoop.hbase.master.TestTableLockManager.testReapAllTableLocks(TestTableLockManager.java:283)

Tests run: 1, Failures: 0, Errors: 1, Skipped: 0, Time elapsed: 83.646 sec <<< FAILURE!
- in org.apache.hadoop.hbase.master.TestTableLockManager
testReapAllTableLocks(org.apache.hadoop.hbase.master.TestTableLockManager)  Time elapsed:
0.012 sec  <<< ERROR!
org.apache.hadoop.hbase.exceptions.LockTimeoutException: Timed out acquiring writelock for
table:table4for:zero timeout after 0 ms.
	at org.apache.hadoop.hbase.master.TableLockManager$ZKTableLockManager$TableLockImpl.acquire(TableLockManager.java:282)
	at org.apache.hadoop.hbase.master.TestTableLockManager.testReapAllTableLocks(TestTableLockManager.java:283)

Tests run: 15, Failures: 0, Errors: 0, Skipped: 1, Time elapsed: 133.324 sec - in org.apache.hadoop.hbase.master.TestSplitLogManager
Tests run: 21, Failures: 0, Errors: 0, Skipped: 0, Time elapsed: 118.144 sec - in org.apache.hadoop.hbase.master.TestAssignmentManagerOnCluster

Results :

Tests in error: 
org.apache.hadoop.hbase.master.TestTableLockManager.testReapAllTableLocks(org.apache.hadoop.hbase.master.TestTableLockManager)
  Run 1: TestTableLockManager.testReapAllTableLocks:283 » LockTimeout Timed out acquiri...
  Run 2: TestTableLockManager.testReapAllTableLocks:283 » LockTimeout Timed out acquiri...
  Run 3: TestTableLockManager.testReapAllTableLocks:283 » LockTimeout Timed out acquiri...

Flaked tests: 
org.apache.hadoop.hbase.regionserver.TestSplitTransactionOnCluster.testShutdownFixupWhenDaughterHasSplit(org.apache.hadoop.hbase.regionserver.TestSplitTransactionOnCluster)
  Run 1: TestSplitTransactionOnCluster.testShutdownFixupWhenDaughterHasSplit:648 expected:<3>
but was:<2>
  Run 2: PASS


Tests run: 2395, Failures: 0, Errors: 1, Skipped: 39, Flakes: 1

[INFO] ------------------------------------------------------------------------
[INFO] Reactor Summary:
[INFO] 
[INFO] Apache HBase ...................................... SUCCESS [1:24.659s]
[INFO] Apache HBase - Checkstyle ......................... SUCCESS [6.230s]
[INFO] Apache HBase - Resource Bundle .................... SUCCESS [0.190s]
[INFO] Apache HBase - Annotations ........................ SUCCESS [0.976s]
[INFO] Apache HBase - Protocol ........................... SUCCESS [15.008s]
[INFO] Apache HBase - Common ............................. SUCCESS [2:02.206s]
[INFO] Apache HBase - Procedure .......................... SUCCESS [3:23.576s]
[INFO] Apache HBase - Client ............................. SUCCESS [1:15.637s]
[INFO] Apache HBase - Hadoop Compatibility ............... SUCCESS [7.883s]
[INFO] Apache HBase - Hadoop Two Compatibility ........... SUCCESS [7.891s]
[INFO] Apache HBase - Prefix Tree ........................ SUCCESS [7.706s]
[INFO] Apache HBase - Server ............................. FAILURE [1:25:32.605s]
[INFO] Apache HBase - Testing Util ....................... SKIPPED
[INFO] Apache HBase - Thrift ............................. SKIPPED
[INFO] Apache HBase - Rest ............................... SKIPPED
[INFO] Apache HBase - Shell .............................. SKIPPED
[INFO] Apache HBase - Integration Tests .................. SKIPPED
[INFO] Apache HBase - Examples ........................... SKIPPED
[INFO] Apache HBase - External Block Cache ............... SKIPPED
[INFO] Apache HBase - Assembly ........................... SKIPPED
[INFO] Apache HBase - Shaded ............................. SKIPPED
[INFO] Apache HBase - Shaded - Client .................... SKIPPED
[INFO] Apache HBase - Shaded - Server .................... SKIPPED
[INFO] ------------------------------------------------------------------------
[INFO] BUILD FAILURE
[INFO] ------------------------------------------------------------------------
[INFO] Total time: 1:34:50.068s
[INFO] Finished at: Mon Nov 23 06:40:29 UTC 2015
[INFO] Final Memory: 94M/614M
[INFO] ------------------------------------------------------------------------
[ERROR] Failed to execute goal org.apache.maven.plugins:maven-surefire-plugin:2.18.1:test
(secondPartTestsExecution) on project hbase-server: There are test failures.
[ERROR] 
[ERROR] Please refer to <https://builds.apache.org/job/HBase-1.3/jdk=latest1.8,label=Hadoop/ws/hbase-server/target/surefire-reports>
for the individual test results.
[ERROR] -> [Help 1]
[ERROR] 
[ERROR] To see the full stack trace of the errors, re-run Maven with the -e switch.
[ERROR] Re-run Maven using the -X switch to enable full debug logging.
[ERROR] 
[ERROR] For more information about the errors and possible solutions, please read the following
articles:
[ERROR] [Help 1] http://cwiki.apache.org/confluence/display/MAVEN/MojoFailureException
[ERROR] 
[ERROR] After correcting the problems, you can resume the build with the command
[ERROR]   mvn <goals> -rf :hbase-server
Build step 'Invoke top-level Maven targets' marked build as failure
Performing Post build task...
Match found for :.* : True
Logical operation result is TRUE
Running script  : # Post-build task script. TODO: Check this in and have all builds reference
check-in.
pwd && ls
# NOTE!!!! The below code has been copied and pasted from ./dev-tools/run-test.sh
# Do not change here without syncing there and vice-versa.
ZOMBIE_TESTS_COUNT=`jps -v | grep surefirebooter | grep -e '-Dhbase.test' | wc -l`
if [[ $ZOMBIE_TESTS_COUNT != 0 ]] ; then
 echo "Suspicious java process found - waiting 30s to see if there are just slow to stop"
 sleep 30
 ZOMBIE_TESTS_COUNT=`jps -v | grep surefirebooter | grep -e '-Dhbase.test' | wc -l`
 if [[ $ZOMBIE_TESTS_COUNT != 0 ]] ; then
   echo " {color:red}There appear to be $ZOMBIE_TESTS_COUNT zombie tests{color}, they should
have been killed by surefire but survived"
   jps -v | grep surefirebooter | grep -e '-Dhbase.test'
   jps -v | grep surefirebooter | grep -e '-Dhbase.test' | cut -d ' ' -f 1 | xargs -n 1 jstack
   # Exit with error
   exit 1
 else
   echo "We're ok: there is no zombie test, but some tests took some time to stop"
 fi
else
  echo "We're ok: there is no zombie test"
fi
[Hadoop] $ /bin/bash -xe /tmp/hudson4761176630445793449.sh
+ pwd
<https://builds.apache.org/job/HBase-1.3/jdk=latest1.8,label=Hadoop/ws/>
+ ls
bin
CHANGES.txt
conf
dev-support
hbase-annotations
hbase-assembly
hbase-checkstyle
hbase-client
hbase-common
hbase-examples
hbase-external-blockcache
hbase-hadoop2-compat
hbase-hadoop-compat
hbase-it
hbase-native-client
hbase-prefix-tree
hbase-procedure
hbase-protocol
hbase-resource-bundle
hbase-rest
hbase-server
hbase-shaded
hbase-shell
hbase-spark
hbase-testing-util
hbase-thrift
LICENSE.txt
NOTICE.txt
pom.xml
README.txt
src
target
++ jps -v
++ grep surefirebooter
++ grep -e -Dhbase.test
++ wc -l
+ ZOMBIE_TESTS_COUNT=0
+ [[ 0 != 0 ]]
+ echo 'We'\''re ok: there is no zombie test'
We're ok: there is no zombie test
POST BUILD TASK : SUCCESS
END OF POST BUILD TASK : 0
Archiving artifacts
Recording test results

Mime
View raw message