hbase-builds mailing list archives

Site index · List index
Message view « Date » · « Thread »
Top « Date » · « Thread »
From Apache Jenkins Server <jenk...@builds.apache.org>
Subject Build failed in Jenkins: HBase-Trunk_matrix » latest1.7,Hadoop #439
Date Fri, 06 Nov 2015 07:56:15 GMT
See <https://builds.apache.org/job/HBase-Trunk_matrix/jdk=latest1.7,label=Hadoop/439/>

------------------------------------------
[...truncated 1090 lines...]
[INFO] --- maven-source-plugin:2.2.1:jar-no-fork (attach-sources) @ hbase-rest ---
[INFO] Building jar: <https://builds.apache.org/job/HBase-Trunk_matrix/jdk=latest1.7,label=Hadoop/ws/hbase-rest/target/hbase-rest-2.0.0-SNAPSHOT-sources.jar>
[INFO] 
[INFO] --- maven-jar-plugin:2.4:test-jar (default) @ hbase-rest ---
[INFO] Building jar: <https://builds.apache.org/job/HBase-Trunk_matrix/jdk=latest1.7,label=Hadoop/ws/hbase-rest/target/hbase-rest-2.0.0-SNAPSHOT-tests.jar>
[INFO] 
[INFO] --- maven-jar-plugin:2.4:jar (default-jar) @ hbase-rest ---
[INFO] Building jar: <https://builds.apache.org/job/HBase-Trunk_matrix/jdk=latest1.7,label=Hadoop/ws/hbase-rest/target/hbase-rest-2.0.0-SNAPSHOT.jar>
[INFO] 
[INFO] --- findbugs-maven-plugin:3.0.0:findbugs (default-cli) @ hbase-rest ---
[INFO] Fork Value is true
     [java] Warnings generated: 2
[INFO] Done FindBugs Analysis....
[INFO]                                                                         
[INFO] ------------------------------------------------------------------------
[INFO] Building Apache HBase - External Block Cache 2.0.0-SNAPSHOT
[INFO] ------------------------------------------------------------------------
[INFO] 
[INFO] --- maven-clean-plugin:2.5:clean (default-clean) @ hbase-external-blockcache ---
[INFO] 
[INFO] --- maven-enforcer-plugin:1.0.1:enforce (enforce) @ hbase-external-blockcache ---
[INFO] 
[INFO] --- buildnumber-maven-plugin:1.3:create-timestamp (default) @ hbase-external-blockcache
---
[INFO] 
[INFO] --- build-helper-maven-plugin:1.9.1:add-source (versionInfo-source) @ hbase-external-blockcache
---
[INFO] Source directory: <https://builds.apache.org/job/HBase-Trunk_matrix/jdk=latest1.7,label=Hadoop/ws/hbase-external-blockcache/target/generated-sources/java>
added.
[INFO] 
[INFO] --- maven-remote-resources-plugin:1.5:process (default) @ hbase-external-blockcache
---
[INFO] 
[INFO] --- maven-resources-plugin:2.6:resources (default-resources) @ hbase-external-blockcache
---
[INFO] Using 'UTF-8' encoding to copy filtered resources.
[INFO] skip non existing resourceDirectory <https://builds.apache.org/job/HBase-Trunk_matrix/jdk=latest1.7,label=Hadoop/ws/hbase-external-blockcache/src/main/resources>
[INFO] Copying 3 resources
[INFO] 
[INFO] --- maven-compiler-plugin:3.2:compile (default-compile) @ hbase-external-blockcache
---
[INFO] Compiling 1 source file to <https://builds.apache.org/job/HBase-Trunk_matrix/jdk=latest1.7,label=Hadoop/ws/hbase-external-blockcache/target/classes>
[INFO] 
[INFO] --- maven-dependency-plugin:2.8:build-classpath (create-mrapp-generated-classpath)
@ hbase-external-blockcache ---
[INFO] Wrote classpath file '<https://builds.apache.org/job/HBase-Trunk_matrix/jdk=latest1.7,label=Hadoop/ws/hbase-external-blockcache/target/test-classes/mrapp-generated-classpath'.>
[INFO] 
[INFO] --- maven-resources-plugin:2.6:testResources (default-testResources) @ hbase-external-blockcache
---
[INFO] Using 'UTF-8' encoding to copy filtered resources.
[INFO] skip non existing resourceDirectory <https://builds.apache.org/job/HBase-Trunk_matrix/jdk=latest1.7,label=Hadoop/ws/hbase-external-blockcache/src/test/resources/META-INF>
[INFO] Copying 3 resources
[INFO] 
[INFO] --- maven-compiler-plugin:3.2:testCompile (default-testCompile) @ hbase-external-blockcache
---
[INFO] No sources to compile
[INFO] 
[INFO] --- maven-surefire-plugin:2.18.1:test (default-test) @ hbase-external-blockcache ---
[INFO] Tests are skipped.
[INFO] 
[INFO] --- maven-surefire-plugin:2.18.1:test (secondPartTestsExecution) @ hbase-external-blockcache
---
[INFO] Tests are skipped.
[INFO] 
[INFO] --- maven-source-plugin:2.2.1:jar-no-fork (attach-sources) @ hbase-external-blockcache
---
[INFO] No sources in project. Archive not created.
[INFO] 
[INFO] --- maven-jar-plugin:2.4:test-jar (default) @ hbase-external-blockcache ---
[INFO] Building jar: <https://builds.apache.org/job/HBase-Trunk_matrix/jdk=latest1.7,label=Hadoop/ws/hbase-external-blockcache/target/hbase-external-blockcache-2.0.0-SNAPSHOT-tests.jar>
[INFO] 
[INFO] --- maven-jar-plugin:2.4:jar (default-jar) @ hbase-external-blockcache ---
[INFO] Building jar: <https://builds.apache.org/job/HBase-Trunk_matrix/jdk=latest1.7,label=Hadoop/ws/hbase-external-blockcache/target/hbase-external-blockcache-2.0.0-SNAPSHOT.jar>
[INFO] 
[INFO] --- findbugs-maven-plugin:3.0.0:findbugs (default-cli) @ hbase-external-blockcache
---
[INFO] Fork Value is true
[INFO] Done FindBugs Analysis....
[INFO]                                                                         
[INFO] ------------------------------------------------------------------------
[INFO] Building Apache HBase - Assembly 2.0.0-SNAPSHOT
[INFO] ------------------------------------------------------------------------
[INFO] 
[INFO] --- maven-clean-plugin:2.5:clean (default-clean) @ hbase-assembly ---
[INFO] 
[INFO] --- maven-enforcer-plugin:1.0.1:enforce (enforce) @ hbase-assembly ---
[INFO] 
[INFO] --- buildnumber-maven-plugin:1.3:create-timestamp (default) @ hbase-assembly ---
[INFO] 
[INFO] --- maven-remote-resources-plugin:1.5:process (default) @ hbase-assembly ---
[ERROR] Error invoking method 'get(java.lang.Integer)' in java.util.ArrayList at META-INF/LICENSE.vm[line
1627, column 22]
java.lang.reflect.InvocationTargetException
	at sun.reflect.GeneratedMethodAccessor279.invoke(Unknown Source)
	at sun.reflect.DelegatingMethodAccessorImpl.invoke(DelegatingMethodAccessorImpl.java:43)
	at java.lang.reflect.Method.invoke(Method.java:606)
	at org.apache.velocity.util.introspection.UberspectImpl$VelMethodImpl.doInvoke(UberspectImpl.java:395)
	at org.apache.velocity.util.introspection.UberspectImpl$VelMethodImpl.invoke(UberspectImpl.java:384)
	at org.apache.velocity.runtime.parser.node.ASTIndex.execute(ASTIndex.java:149)
	at org.apache.velocity.runtime.parser.node.ASTReference.execute(ASTReference.java:280)
	at org.apache.velocity.runtime.parser.node.ASTReference.evaluate(ASTReference.java:530)
	at org.apache.velocity.runtime.parser.node.ASTExpression.evaluate(ASTExpression.java:62)
	at org.apache.velocity.runtime.parser.node.ASTNotNode.evaluate(ASTNotNode.java:63)
	at org.apache.velocity.runtime.parser.node.ASTExpression.evaluate(ASTExpression.java:62)
	at org.apache.velocity.runtime.parser.node.ASTIfStatement.render(ASTIfStatement.java:85)
	at org.apache.velocity.runtime.parser.node.ASTBlock.render(ASTBlock.java:72)
	at org.apache.velocity.runtime.directive.Foreach.render(Foreach.java:420)
	at org.apache.velocity.runtime.parser.node.ASTDirective.render(ASTDirective.java:207)
	at org.apache.velocity.runtime.parser.node.ASTBlock.render(ASTBlock.java:72)
	at org.apache.velocity.runtime.parser.node.ASTIfStatement.render(ASTIfStatement.java:87)
	at org.apache.velocity.runtime.parser.node.SimpleNode.render(SimpleNode.java:342)
	at org.apache.velocity.Template.merge(Template.java:356)
	at org.apache.velocity.Template.merge(Template.java:260)
	at org.apache.velocity.app.VelocityEngine.mergeTemplate(VelocityEngine.java:354)
	at org.apache.maven.plugin.resources.remote.ProcessRemoteResourcesMojo.processResourceBundles(ProcessRemoteResourcesMojo.java:1164)
	at org.apache.maven.plugin.resources.remote.ProcessRemoteResourcesMojo.execute(ProcessRemoteResourcesMojo.java:520)
	at org.apache.maven.plugin.DefaultBuildPluginManager.executeMojo(DefaultBuildPluginManager.java:133)
	at org.apache.maven.lifecycle.internal.MojoExecutor.execute(MojoExecutor.java:208)
	at org.apache.maven.lifecycle.internal.MojoExecutor.execute(MojoExecutor.java:153)
	at org.apache.maven.lifecycle.internal.MojoExecutor.execute(MojoExecutor.java:145)
	at org.apache.maven.lifecycle.internal.LifecycleModuleBuilder.buildProject(LifecycleModuleBuilder.java:108)
	at org.apache.maven.lifecycle.internal.LifecycleModuleBuilder.buildProject(LifecycleModuleBuilder.java:76)
	at org.apache.maven.lifecycle.internal.builder.singlethreaded.SingleThreadedBuilder.build(SingleThreadedBuilder.java:51)
	at org.apache.maven.lifecycle.internal.LifecycleStarter.execute(LifecycleStarter.java:116)
	at org.apache.maven.DefaultMaven.doExecute(DefaultMaven.java:361)
	at org.apache.maven.DefaultMaven.execute(DefaultMaven.java:155)
	at org.apache.maven.cli.MavenCli.execute(MavenCli.java:584)
	at org.apache.maven.cli.MavenCli.doMain(MavenCli.java:213)
	at org.apache.maven.cli.MavenCli.main(MavenCli.java:157)
	at sun.reflect.NativeMethodAccessorImpl.invoke0(Native Method)
	at sun.reflect.NativeMethodAccessorImpl.invoke(NativeMethodAccessorImpl.java:57)
	at sun.reflect.DelegatingMethodAccessorImpl.invoke(DelegatingMethodAccessorImpl.java:43)
	at java.lang.reflect.Method.invoke(Method.java:606)
	at org.codehaus.plexus.classworlds.launcher.Launcher.launchEnhanced(Launcher.java:289)
	at org.codehaus.plexus.classworlds.launcher.Launcher.launch(Launcher.java:229)
	at org.codehaus.plexus.classworlds.launcher.Launcher.mainWithExitCode(Launcher.java:415)
	at org.codehaus.plexus.classworlds.launcher.Launcher.main(Launcher.java:356)
Caused by: java.lang.IndexOutOfBoundsException: Index: 0, Size: 0
	at java.util.ArrayList.rangeCheck(ArrayList.java:635)
	at java.util.ArrayList.get(ArrayList.java:411)
	... 44 more
[INFO] ------------------------------------------------------------------------
[INFO] Reactor Summary:
[INFO] 
[INFO] Apache HBase ...................................... SUCCESS [  2.615 s]
[INFO] Apache HBase - Checkstyle ......................... SUCCESS [  0.635 s]
[INFO] Apache HBase - Resource Bundle .................... SUCCESS [  0.214 s]
[INFO] Apache HBase - Annotations ........................ SUCCESS [  8.837 s]
[INFO] Apache HBase - Protocol ........................... SUCCESS [01:37 min]
[INFO] Apache HBase - Common ............................. SUCCESS [ 35.241 s]
[INFO] Apache HBase - Procedure .......................... SUCCESS [ 15.963 s]
[INFO] Apache HBase - Client ............................. SUCCESS [ 48.871 s]
[INFO] Apache HBase - Hadoop Compatibility ............... SUCCESS [  6.620 s]
[INFO] Apache HBase - Hadoop Two Compatibility ........... SUCCESS [ 13.285 s]
[INFO] Apache HBase - Prefix Tree ........................ SUCCESS [ 14.420 s]
[INFO] Apache HBase - Server ............................. SUCCESS [01:59 min]
[INFO] Apache HBase - Testing Util ....................... SUCCESS [  0.991 s]
[INFO] Apache HBase - Thrift ............................. SUCCESS [01:04 min]
[INFO] Apache HBase - Shell .............................. SUCCESS [  1.173 s]
[INFO] Apache HBase - Integration Tests .................. SUCCESS [  1.605 s]
[INFO] Apache HBase - Examples ........................... SUCCESS [ 17.059 s]
[INFO] Apache HBase - Rest ............................... SUCCESS [ 29.755 s]
[INFO] Apache HBase - External Block Cache ............... SUCCESS [  7.500 s]
[INFO] Apache HBase - Assembly ........................... FAILURE [  1.073 s]
[INFO] Apache HBase - Shaded ............................. SKIPPED
[INFO] Apache HBase - Shaded - Client .................... SKIPPED
[INFO] Apache HBase - Shaded - Server .................... SKIPPED
[INFO] Apache HBase - Spark .............................. SKIPPED
[INFO] ------------------------------------------------------------------------
[INFO] BUILD FAILURE
[INFO] ------------------------------------------------------------------------
[INFO] Total time: 08:09 min
[INFO] Finished at: 2015-11-06T07:56:13+00:00
[INFO] Final Memory: 202M/3420M
[INFO] ------------------------------------------------------------------------
[ERROR] Failed to execute goal org.apache.maven.plugins:maven-remote-resources-plugin:1.5:process
(default) on project hbase-assembly: Error rendering velocity resource. Error invoking method
'get(java.lang.Integer)' in java.util.ArrayList at META-INF/LICENSE.vm[line 1627, column 22]:
InvocationTargetException: Index: 0, Size: 0 -> [Help 1]
[ERROR] 
[ERROR] To see the full stack trace of the errors, re-run Maven with the -e switch.
[ERROR] Re-run Maven using the -X switch to enable full debug logging.
[ERROR] 
[ERROR] For more information about the errors and possible solutions, please read the following
articles:
[ERROR] [Help 1] http://cwiki.apache.org/confluence/display/MAVEN/MojoExecutionException
[ERROR] 
[ERROR] After correcting the problems, you can resume the build with the command
[ERROR]   mvn <goals> -rf :hbase-assembly
Build step 'Invoke top-level Maven targets' marked build as failure
Performing Post build task...
Match found for :.* : True
Logical operation result is TRUE
Running script  : # Post-build task script. TODO: Check this in and have all builds reference
check-in.
pwd && ls
# NOTE!!!! The below code has been copied and pasted from ./dev-tools/run-test.sh
# Do not change here without syncing there and vice-versa.
ZOMBIE_TESTS_COUNT=`jps -v | grep surefirebooter | grep -e '-Dhbase.test' | wc -l`
if [[ $ZOMBIE_TESTS_COUNT != 0 ]] ; then
 echo "Suspicious java process found - waiting 30s to see if there are just slow to stop"
 sleep 30
 ZOMBIE_TESTS_COUNT=`jps -v | grep surefirebooter | grep -e '-Dhbase.test' | wc -l`
 if [[ $ZOMBIE_TESTS_COUNT != 0 ]] ; then
   echo " {color:red}There appear to be $ZOMBIE_TESTS_COUNT zombie tests{color}, they should
have been killed by surefire but survived"
   jps -v | grep surefirebooter | grep -e '-Dhbase.test'
   jps -v | grep surefirebooter | grep -e '-Dhbase.test' | cut -d ' ' -f 1 | xargs -n 1 jstack
   # Exit with error
   exit 1
 else
   echo "We're ok: there is no zombie test, but some tests took some time to stop"
 fi
else
  echo "We're ok: there is no zombie test"
fi
[Hadoop] $ /bin/bash -xe /tmp/hudson8520699759574139804.sh
+ pwd
<https://builds.apache.org/job/HBase-Trunk_matrix/jdk=latest1.7,label=Hadoop/ws/>
+ ls
bin
CHANGES.txt
conf
dev-support
hbase-annotations
hbase-assembly
hbase-checkstyle
hbase-client
hbase-common
hbase-examples
hbase-external-blockcache
hbase-hadoop2-compat
hbase-hadoop-compat
hbase-it
hbase-native-client
hbase-prefix-tree
hbase-procedure
hbase-protocol
hbase-resource-bundle
hbase-rest
hbase-server
hbase-shaded
hbase-shell
hbase-spark
hbase-testing-util
hbase-thrift
LICENSE.txt
NOTICE.txt
pom.xml
README.txt
src
target
++ jps -v
++ grep surefirebooter
++ wc -l
++ grep -e -Dhbase.test
+ ZOMBIE_TESTS_COUNT=0
+ [[ 0 != 0 ]]
+ echo 'We'\''re ok: there is no zombie test'
We're ok: there is no zombie test
POST BUILD TASK : SUCCESS
END OF POST BUILD TASK : 0
Archiving artifacts
Compressed 3.26 MB of artifacts by 55.5% relative to #437
Recording test results
ERROR: Publisher 'Publish JUnit test result report' failed: No test report files were found.
Configuration error?
[FINDBUGS] Skipping publisher since build result is FAILURE
[CHECKSTYLE] Skipping publisher since build result is FAILURE

Mime
View raw message