hbase-builds mailing list archives

Site index · List index
Message view « Date » · « Thread »
Top « Date » · « Thread »
From Apache Jenkins Server <jenk...@builds.apache.org>
Subject Build failed in Jenkins: HBase-Trunk_matrix » latest1.7,Hadoop #435
Date Thu, 05 Nov 2015 04:30:11 GMT
See <https://builds.apache.org/job/HBase-Trunk_matrix/jdk=latest1.7,label=Hadoop/435/changes>

Changes:

[jmhsieh] HBASE-14713 Remove simple deprecated-since-1.0 code in hbase-server from

[mstanleyjones] HBASE-14764 Stop using post-site target

------------------------------------------
[...truncated 4814 lines...]
Running org.apache.hadoop.hbase.TestMetaTableAccessor
Tests run: 3, Failures: 0, Errors: 0, Skipped: 0, Time elapsed: 13.874 sec - in org.apache.hadoop.hbase.TestMultiVersions
Running org.apache.hadoop.hbase.trace.TestHTraceHooks
Running org.apache.hadoop.hbase.TestMetaTableLocator
Tests run: 1, Failures: 0, Errors: 0, Skipped: 0, Time elapsed: 4.307 sec - in org.apache.hadoop.hbase.trace.TestHTraceHooks
Tests run: 9, Failures: 0, Errors: 0, Skipped: 0, Time elapsed: 40.794 sec - in org.apache.hadoop.hbase.coprocessor.TestClassLoading
Tests run: 7, Failures: 0, Errors: 0, Skipped: 0, Time elapsed: 4.892 sec - in org.apache.hadoop.hbase.TestMetaTableLocator
Running org.apache.hadoop.hbase.snapshot.TestRestoreFlushSnapshotFromClient
Running org.apache.hadoop.hbase.snapshot.TestMobRestoreFlushSnapshotFromClient
Tests run: 14, Failures: 0, Errors: 0, Skipped: 0, Time elapsed: 29.012 sec - in org.apache.hadoop.hbase.TestMetaTableAccessor
Running org.apache.hadoop.hbase.snapshot.TestFlushSnapshotFromClient
Tests run: 8, Failures: 0, Errors: 0, Skipped: 0, Time elapsed: 66.768 sec - in org.apache.hadoop.hbase.TestNamespace
Running org.apache.hadoop.hbase.snapshot.TestMobExportSnapshot
Running org.apache.hadoop.hbase.snapshot.TestExportSnapshot
Tests run: 5, Failures: 0, Errors: 0, Skipped: 0, Time elapsed: 82.009 sec - in org.apache.hadoop.hbase.snapshot.TestRestoreFlushSnapshotFromClient
Tests run: 9, Failures: 0, Errors: 0, Skipped: 1, Time elapsed: 109.899 sec - in org.apache.hadoop.hbase.snapshot.TestFlushSnapshotFromClient
Running org.apache.hadoop.hbase.snapshot.TestSnapshotClientRetries
Running org.apache.hadoop.hbase.snapshot.TestSecureExportSnapshot
Tests run: 5, Failures: 0, Errors: 0, Skipped: 0, Time elapsed: 122.881 sec - in org.apache.hadoop.hbase.snapshot.TestMobRestoreFlushSnapshotFromClient
Tests run: 2, Failures: 0, Errors: 0, Skipped: 0, Time elapsed: 33.473 sec - in org.apache.hadoop.hbase.snapshot.TestSnapshotClientRetries
Running org.apache.hadoop.hbase.snapshot.TestSnapshotDescriptionUtils
Tests run: 2, Failures: 0, Errors: 0, Skipped: 0, Time elapsed: 0.174 sec - in org.apache.hadoop.hbase.snapshot.TestSnapshotDescriptionUtils
Running org.apache.hadoop.hbase.TestMovedRegionsCleaner
Running org.apache.hadoop.hbase.snapshot.TestMobSecureExportSnapshot
Tests run: 1, Failures: 0, Errors: 0, Skipped: 0, Time elapsed: 18.241 sec - in org.apache.hadoop.hbase.TestMovedRegionsCleaner
Running org.apache.hadoop.hbase.quotas.TestQuotaTableUtil
Tests run: 3, Failures: 0, Errors: 0, Skipped: 0, Time elapsed: 1.794 sec - in org.apache.hadoop.hbase.quotas.TestQuotaTableUtil
Running org.apache.hadoop.hbase.quotas.TestQuotaAdmin
Tests run: 3, Failures: 0, Errors: 0, Skipped: 0, Time elapsed: 5.317 sec - in org.apache.hadoop.hbase.quotas.TestQuotaAdmin
Running org.apache.hadoop.hbase.quotas.TestQuotaThrottle
Tests run: 12, Failures: 0, Errors: 0, Skipped: 0, Time elapsed: 32.227 sec - in org.apache.hadoop.hbase.quotas.TestQuotaThrottle
Running org.apache.hadoop.hbase.util.TestMiniClusterLoadParallel
Tests run: 4, Failures: 0, Errors: 0, Skipped: 0, Time elapsed: 72.277 sec - in org.apache.hadoop.hbase.util.TestMiniClusterLoadParallel
Running org.apache.hadoop.hbase.util.TestIdLock
Tests run: 1, Failures: 0, Errors: 0, Skipped: 0, Time elapsed: 15.2 sec - in org.apache.hadoop.hbase.util.TestIdLock
Running org.apache.hadoop.hbase.util.TestHBaseFsckTwoRS
Tests run: 9, Failures: 0, Errors: 0, Skipped: 0, Time elapsed: 404.755 sec - in org.apache.hadoop.hbase.snapshot.TestMobExportSnapshot
Running org.apache.hadoop.hbase.util.TestMergeTable
Tests run: 9, Failures: 0, Errors: 0, Skipped: 0, Time elapsed: 403.245 sec - in org.apache.hadoop.hbase.snapshot.TestExportSnapshot
Running org.apache.hadoop.hbase.util.TestFSTableDescriptors
Tests run: 16, Failures: 0, Errors: 0, Skipped: 0, Time elapsed: 2.38 sec - in org.apache.hadoop.hbase.util.TestFSTableDescriptors
Running org.apache.hadoop.hbase.util.TestMiniClusterLoadSequential
Tests run: 1, Failures: 0, Errors: 0, Skipped: 0, Time elapsed: 28.08 sec - in org.apache.hadoop.hbase.util.TestMergeTable
Running org.apache.hadoop.hbase.util.TestHBaseFsckReplicas
Tests run: 9, Failures: 0, Errors: 0, Skipped: 0, Time elapsed: 383.614 sec - in org.apache.hadoop.hbase.snapshot.TestSecureExportSnapshot
Running org.apache.hadoop.hbase.util.TestConnectionCache
Tests run: 1, Failures: 0, Errors: 0, Skipped: 0, Time elapsed: 21.574 sec - in org.apache.hadoop.hbase.util.TestConnectionCache
Tests run: 15, Failures: 0, Errors: 0, Skipped: 1, Time elapsed: 150.887 sec - in org.apache.hadoop.hbase.util.TestHBaseFsckTwoRS
Tests run: 4, Failures: 0, Errors: 0, Skipped: 0, Time elapsed: 68.743 sec - in org.apache.hadoop.hbase.util.TestMiniClusterLoadSequential
Running org.apache.hadoop.hbase.util.TestDefaultEnvironmentEdge
Tests run: 1, Failures: 0, Errors: 0, Skipped: 0, Time elapsed: 0.141 sec - in org.apache.hadoop.hbase.util.TestDefaultEnvironmentEdge
Running org.apache.hadoop.hbase.util.TestTableName
Tests run: 6, Failures: 0, Errors: 0, Skipped: 0, Time elapsed: 0.341 sec - in org.apache.hadoop.hbase.util.TestTableName
Running org.apache.hadoop.hbase.util.TestFSVisitor
Running org.apache.hadoop.hbase.util.TestHBaseFsckEncryption
Running org.apache.hadoop.hbase.util.TestFSHDFSUtils
Tests run: 1, Failures: 0, Errors: 0, Skipped: 0, Time elapsed: 1.69 sec - in org.apache.hadoop.hbase.util.TestFSVisitor
Running org.apache.hadoop.hbase.util.TestMiniClusterLoadEncoded
Tests run: 9, Failures: 0, Errors: 0, Skipped: 0, Time elapsed: 376.796 sec - in org.apache.hadoop.hbase.snapshot.TestMobSecureExportSnapshot
Tests run: 3, Failures: 0, Errors: 0, Skipped: 0, Time elapsed: 8.063 sec - in org.apache.hadoop.hbase.util.TestFSHDFSUtils
Tests run: 1, Failures: 0, Errors: 0, Skipped: 0, Time elapsed: 20.243 sec - in org.apache.hadoop.hbase.util.TestHBaseFsckEncryption
Running org.apache.hadoop.hbase.util.TestHBaseFsckMOB
Running org.apache.hadoop.hbase.util.TestHBaseFsckOneRS
Running org.apache.hadoop.hbase.util.TestRegionMover
Tests run: 11, Failures: 0, Errors: 0, Skipped: 1, Time elapsed: 119.361 sec - in org.apache.hadoop.hbase.util.TestHBaseFsckReplicas
Running org.apache.hadoop.hbase.util.hbck.TestOfflineMetaRebuildOverlap
Tests run: 5, Failures: 0, Errors: 0, Skipped: 0, Time elapsed: 45.378 sec - in org.apache.hadoop.hbase.util.TestRegionMover
Running org.apache.hadoop.hbase.util.hbck.TestOfflineMetaRebuildBase
Tests run: 5, Failures: 0, Errors: 0, Skipped: 0, Time elapsed: 81.388 sec - in org.apache.hadoop.hbase.util.TestMiniClusterLoadEncoded
Running org.apache.hadoop.hbase.util.hbck.TestOfflineMetaRebuildHole
Tests run: 1, Failures: 0, Errors: 0, Skipped: 0, Time elapsed: 31.784 sec - in org.apache.hadoop.hbase.util.hbck.TestOfflineMetaRebuildOverlap
Running org.apache.hadoop.hbase.util.TestMergeTool
Tests run: 1, Failures: 0, Errors: 0, Skipped: 0, Time elapsed: 31.197 sec - in org.apache.hadoop.hbase.util.hbck.TestOfflineMetaRebuildBase
Running org.apache.hadoop.hbase.util.TestFSUtils
Tests run: 1, Failures: 0, Errors: 0, Skipped: 0, Time elapsed: 31.152 sec - in org.apache.hadoop.hbase.util.hbck.TestOfflineMetaRebuildHole
Tests run: 8, Failures: 0, Errors: 0, Skipped: 1, Time elapsed: 93.747 sec - in org.apache.hadoop.hbase.util.TestHBaseFsckMOB
Running org.apache.hadoop.hbase.util.TestCoprocessorScanPolicy
Running org.apache.hadoop.hbase.util.TestRegionSplitter
Tests run: 1, Failures: 0, Errors: 0, Skipped: 0, Time elapsed: 23.707 sec - in org.apache.hadoop.hbase.util.TestMergeTool
Tests run: 11, Failures: 0, Errors: 0, Skipped: 0, Time elapsed: 28.162 sec - in org.apache.hadoop.hbase.util.TestFSUtils
Tests run: 6, Failures: 0, Errors: 0, Skipped: 0, Time elapsed: 10.555 sec - in org.apache.hadoop.hbase.util.TestRegionSplitter
Running org.apache.hadoop.hbase.wal.TestBoundedRegionGroupingStrategy
Running org.apache.hadoop.hbase.TestFullLogReconstruction
Running org.apache.hadoop.hbase.wal.TestDefaultWALProvider
Tests run: 4, Failures: 0, Errors: 0, Skipped: 0, Time elapsed: 22.24 sec - in org.apache.hadoop.hbase.util.TestCoprocessorScanPolicy
Running org.apache.hadoop.hbase.wal.TestWALFactory
Tests run: 5, Failures: 0, Errors: 0, Skipped: 0, Time elapsed: 10.293 sec - in org.apache.hadoop.hbase.wal.TestDefaultWALProvider
Running org.apache.hadoop.hbase.wal.TestSecureWAL
Tests run: 1, Failures: 0, Errors: 0, Skipped: 0, Time elapsed: 1.7 sec - in org.apache.hadoop.hbase.wal.TestSecureWAL
Running org.apache.hadoop.hbase.wal.TestWALFiltering
Tests run: 9, Failures: 0, Errors: 0, Skipped: 0, Time elapsed: 12.895 sec - in org.apache.hadoop.hbase.wal.TestWALFactory
Running org.apache.hadoop.hbase.wal.TestWALReaderOnSecureWAL
Tests run: 5, Failures: 0, Errors: 0, Skipped: 0, Time elapsed: 28.339 sec - in org.apache.hadoop.hbase.wal.TestBoundedRegionGroupingStrategy
Tests run: 2, Failures: 0, Errors: 0, Skipped: 0, Time elapsed: 1.763 sec - in org.apache.hadoop.hbase.wal.TestWALReaderOnSecureWAL
Running org.apache.hadoop.hbase.TestHBaseOnOtherDfsCluster
Running org.apache.hadoop.hbase.wal.TestDefaultWALProviderWithHLogKey
Tests run: 1, Failures: 0, Errors: 0, Skipped: 0, Time elapsed: 40.413 sec - in org.apache.hadoop.hbase.TestFullLogReconstruction
Tests run: 5, Failures: 0, Errors: 0, Skipped: 0, Time elapsed: 7.874 sec - in org.apache.hadoop.hbase.wal.TestDefaultWALProviderWithHLogKey
Tests run: 1, Failures: 0, Errors: 0, Skipped: 0, Time elapsed: 18.632 sec - in org.apache.hadoop.hbase.TestHBaseOnOtherDfsCluster
Tests run: 1, Failures: 0, Errors: 0, Skipped: 0, Time elapsed: 33.306 sec - in org.apache.hadoop.hbase.wal.TestWALFiltering
Running org.apache.hadoop.hbase.TestZooKeeper
Running org.apache.hadoop.hbase.TestServerSideScanMetricsFromClientSide
Tests run: 2, Failures: 0, Errors: 0, Skipped: 0, Time elapsed: 2.918 sec - in org.apache.hadoop.hbase.TestServerSideScanMetricsFromClientSide
Running org.apache.hadoop.hbase.filter.TestFuzzyRowFilterEndToEnd
Running org.apache.hadoop.hbase.filter.TestFilterWithScanLimits
Running org.apache.hadoop.hbase.filter.TestColumnRangeFilter
Tests run: 1, Failures: 0, Errors: 0, Skipped: 0, Time elapsed: 8.37 sec - in org.apache.hadoop.hbase.filter.TestColumnRangeFilter
Running org.apache.hadoop.hbase.filter.TestMultiRowRangeFilter
Tests run: 1, Failures: 0, Errors: 0, Skipped: 0, Time elapsed: 54.235 sec - in org.apache.hadoop.hbase.filter.TestFilterWithScanLimits
Tests run: 20, Failures: 0, Errors: 0, Skipped: 0, Time elapsed: 24.116 sec - in org.apache.hadoop.hbase.filter.TestMultiRowRangeFilter
Running org.apache.hadoop.hbase.filter.TestFilterWrapper
Running org.apache.hadoop.hbase.filter.TestFuzzyRowAndColumnRangeFilter
Tests run: 1, Failures: 0, Errors: 0, Skipped: 0, Time elapsed: 4.288 sec - in org.apache.hadoop.hbase.filter.TestFuzzyRowAndColumnRangeFilter
Tests run: 1, Failures: 0, Errors: 0, Skipped: 0, Time elapsed: 4.67 sec - in org.apache.hadoop.hbase.filter.TestFilterWrapper
Running org.apache.hadoop.hbase.filter.TestScanRowPrefix
Tests run: 1, Failures: 0, Errors: 0, Skipped: 0, Time elapsed: 7.42 sec - in org.apache.hadoop.hbase.filter.TestScanRowPrefix
Tests run: 40, Failures: 0, Errors: 0, Skipped: 1, Time elapsed: 359.136 sec - in org.apache.hadoop.hbase.util.TestHBaseFsckOneRS
Tests run: 12, Failures: 0, Errors: 0, Skipped: 0, Time elapsed: 262.036 sec - in org.apache.hadoop.hbase.TestZooKeeper
Tests run: 2, Failures: 0, Errors: 0, Skipped: 0, Time elapsed: 405.333 sec - in org.apache.hadoop.hbase.filter.TestFuzzyRowFilterEndToEnd

Results :

Failed tests: 
  TestMasterReplication.testCyclicReplication2:204->wait:386 Waited too much time for replication.
Row:row4. IsDeleteReplication:true

Tests run: 2440, Failures: 1, Errors: 0, Skipped: 40

[INFO] ------------------------------------------------------------------------
[INFO] Reactor Summary:
[INFO] 
[INFO] Apache HBase ...................................... SUCCESS [  3.394 s]
[INFO] Apache HBase - Checkstyle ......................... SUCCESS [  0.998 s]
[INFO] Apache HBase - Resource Bundle .................... SUCCESS [  0.376 s]
[INFO] Apache HBase - Annotations ........................ SUCCESS [  0.388 s]
[INFO] Apache HBase - Protocol ........................... SUCCESS [  5.014 s]
[INFO] Apache HBase - Common ............................. SUCCESS [01:35 min]
[INFO] Apache HBase - Procedure .......................... SUCCESS [ 53.401 s]
[INFO] Apache HBase - Client ............................. SUCCESS [ 40.800 s]
[INFO] Apache HBase - Hadoop Compatibility ............... SUCCESS [  8.355 s]
[INFO] Apache HBase - Hadoop Two Compatibility ........... SUCCESS [  8.288 s]
[INFO] Apache HBase - Prefix Tree ........................ SUCCESS [ 11.534 s]
[INFO] Apache HBase - Server ............................. FAILURE [  01:41 h]
[INFO] Apache HBase - Testing Util ....................... SKIPPED
[INFO] Apache HBase - Thrift ............................. SKIPPED
[INFO] Apache HBase - Shell .............................. SKIPPED
[INFO] Apache HBase - Integration Tests .................. SKIPPED
[INFO] Apache HBase - Examples ........................... SKIPPED
[INFO] Apache HBase - Rest ............................... SKIPPED
[INFO] Apache HBase - External Block Cache ............... SKIPPED
[INFO] Apache HBase - Assembly ........................... SKIPPED
[INFO] Apache HBase - Shaded ............................. SKIPPED
[INFO] Apache HBase - Shaded - Client .................... SKIPPED
[INFO] Apache HBase - Shaded - Server .................... SKIPPED
[INFO] Apache HBase - Spark .............................. SKIPPED
[INFO] ------------------------------------------------------------------------
[INFO] BUILD FAILURE
[INFO] ------------------------------------------------------------------------
[INFO] Total time: 01:45 h
[INFO] Finished at: 2015-11-05T04:27:58+00:00
[INFO] Final Memory: 62M/645M
[INFO] ------------------------------------------------------------------------
[ERROR] Failed to execute goal org.apache.maven.plugins:maven-surefire-plugin:2.18.1:test
(secondPartTestsExecution) on project hbase-server: There are test failures.
[ERROR] 
[ERROR] Please refer to <https://builds.apache.org/job/HBase-Trunk_matrix/jdk=latest1.7,label=Hadoop/ws/hbase-server/target/surefire-reports>
for the individual test results.
[ERROR] -> [Help 1]
[ERROR] 
[ERROR] To see the full stack trace of the errors, re-run Maven with the -e switch.
[ERROR] Re-run Maven using the -X switch to enable full debug logging.
[ERROR] 
[ERROR] For more information about the errors and possible solutions, please read the following
articles:
[ERROR] [Help 1] http://cwiki.apache.org/confluence/display/MAVEN/MojoFailureException
[ERROR] 
[ERROR] After correcting the problems, you can resume the build with the command
[ERROR]   mvn <goals> -rf :hbase-server
Build step 'Invoke top-level Maven targets' marked build as failure
Performing Post build task...
Match found for :.* : True
Logical operation result is TRUE
Running script  : # Post-build task script. TODO: Check this in and have all builds reference
check-in.
pwd && ls
# NOTE!!!! The below code has been copied and pasted from ./dev-tools/run-test.sh
# Do not change here without syncing there and vice-versa.
ZOMBIE_TESTS_COUNT=`jps -v | grep surefirebooter | grep -e '-Dhbase.test' | wc -l`
if [[ $ZOMBIE_TESTS_COUNT != 0 ]] ; then
 echo "Suspicious java process found - waiting 30s to see if there are just slow to stop"
 sleep 30
 ZOMBIE_TESTS_COUNT=`jps -v | grep surefirebooter | grep -e '-Dhbase.test' | wc -l`
 if [[ $ZOMBIE_TESTS_COUNT != 0 ]] ; then
   echo " {color:red}There appear to be $ZOMBIE_TESTS_COUNT zombie tests{color}, they should
have been killed by surefire but survived"
   jps -v | grep surefirebooter | grep -e '-Dhbase.test'
   jps -v | grep surefirebooter | grep -e '-Dhbase.test' | cut -d ' ' -f 1 | xargs -n 1 jstack
   # Exit with error
   exit 1
 else
   echo "We're ok: there is no zombie test, but some tests took some time to stop"
 fi
else
  echo "We're ok: there is no zombie test"
fi
[Hadoop] $ /bin/bash -xe /tmp/hudson4621420476202728076.sh
+ pwd
<https://builds.apache.org/job/HBase-Trunk_matrix/jdk=latest1.7,label=Hadoop/ws/>
+ ls
bin
CHANGES.txt
conf
dev-support
hbase-annotations
hbase-assembly
hbase-checkstyle
hbase-client
hbase-common
hbase-examples
hbase-external-blockcache
hbase-hadoop2-compat
hbase-hadoop-compat
hbase-it
hbase-native-client
hbase-prefix-tree
hbase-procedure
hbase-protocol
hbase-resource-bundle
hbase-rest
hbase-server
hbase-shaded
hbase-shell
hbase-spark
hbase-testing-util
hbase-thrift
LICENSE.txt
NOTICE.txt
pom.xml
README.txt
src
target
++ jps -v
++ grep surefirebooter
++ wc -l
++ grep -e -Dhbase.test
+ ZOMBIE_TESTS_COUNT=0
+ [[ 0 != 0 ]]
+ echo 'We'\''re ok: there is no zombie test'
We're ok: there is no zombie test
POST BUILD TASK : SUCCESS
END OF POST BUILD TASK : 0
Archiving artifacts
Recording test results
[FINDBUGS] Skipping publisher since build result is FAILURE
[CHECKSTYLE] Skipping publisher since build result is FAILURE

Mime
View raw message