hbase-builds mailing list archives

Site index · List index
Message view « Date » · « Thread »
Top « Date » · « Thread »
From Stack <st...@duboce.net>
Subject Re: Build failed in Jenkins: HBase-1.3 » latest1.8,Hadoop #269
Date Thu, 15 Oct 2015 22:20:19 GMT
Flaked tests:
org.apache.hadoop.hbase.client.TestSnapshotCloneIndependence.
testOnlineSnapshotDeleteIndependent(org.apache.hadoop.hbase.client.
TestSnapshotCloneIndependence)
  Run 1: TestSnapshotCloneIndependence.testOnlineSnapshotDeleteIndepe
ndent:191->runTestSnapshotDeleteIndependent:459 expected:<17576> but
was:<14046>
  Run 2: PASS

org.apache.hadoop.hbase.master.TestTableLockManager.
testReapAllTableLocks(org.apache.hadoop.hbase.master.TestTableLockManager)
  Run 1: TestTableLockManager.testReapAllTableLocks:283 » LockTimeout Timed
out acquiri...
  Run 2: PASS


Tests run: 2381, Failures: 0, Errors: 0, Skipped: 55, Flakes: 2

....

[ERROR] Failed to execute goal org.apache.maven.plugins:
maven-surefire-plugin:2.18.1:test (secondPartTestsExecution) on project
hbase-server: ExecutionException: java.lang.RuntimeException: The forked VM
terminated without properly saying goodbye. VM crash or System.exit called?


St.Ack

On Thu, Oct 15, 2015 at 3:17 PM, Apache Jenkins Server <
jenkins@builds.apache.org> wrote:

> See <
> https://builds.apache.org/job/HBase-1.3/jdk=latest1.8,label=Hadoop/269/changes
> >
>
> Changes:
>
> [stack]  HBASE-14589 Builds are being killed...; CHANGE FROM 10 MINS TO
>
> [stack] HBASE-14622 Purge TestZkLess* tests from branch-1
>
> ------------------------------------------
> [...truncated 45491 lines...]
> Tests run: 5, Failures: 0, Errors: 0, Skipped: 0, Time elapsed: 2.335 sec
> - in org.apache.hadoop.hbase.replication.regionserver.TestReplicationSink
> Java HotSpot(TM) 64-Bit Server VM warning: ignoring option
> MaxPermSize=256m; support was removed in 8.0
> Java HotSpot(TM) 64-Bit Server VM warning: ignoring option
> MaxPermSize=256m; support was removed in 8.0
> Running org.apache.hadoop.hbase.replication.TestReplicationKillSlaveRS
> Tests run: 1, Failures: 0, Errors: 0, Skipped: 0, Time elapsed: 19.311 sec
> - in
> org.apache.hadoop.hbase.replication.multiwal.TestReplicationKillMasterRSCompressedWithMultipleWAL
> Java HotSpot(TM) 64-Bit Server VM warning: ignoring option
> MaxPermSize=256m; support was removed in 8.0
> Running
> org.apache.hadoop.hbase.replication.regionserver.TestReplicationWALReaderManager
> Running
> org.apache.hadoop.hbase.replication.regionserver.TestRegionReplicaReplicationEndpoint
> Tests run: 1, Failures: 0, Errors: 0, Skipped: 0, Time elapsed: 17.294 sec
> - in org.apache.hadoop.hbase.replication.TestReplicationKillSlaveRS
> Java HotSpot(TM) 64-Bit Server VM warning: ignoring option
> MaxPermSize=256m; support was removed in 8.0
> Tests run: 1, Failures: 0, Errors: 0, Skipped: 0, Time elapsed: 52.805 sec
> - in org.apache.hadoop.hbase.replication.TestReplicationSyncUpTool
> Java HotSpot(TM) 64-Bit Server VM warning: ignoring option
> MaxPermSize=256m; support was removed in 8.0
> Java HotSpot(TM) 64-Bit Server VM warning: ignoring option
> MaxPermSize=256m; support was removed in 8.0
> Running
> org.apache.hadoop.hbase.replication.regionserver.TestReplicationSourceManager
> Tests run: 5, Failures: 0, Errors: 0, Skipped: 0, Time elapsed: 4.469 sec
> - in
> org.apache.hadoop.hbase.replication.regionserver.TestReplicationSourceManager
> Java HotSpot(TM) 64-Bit Server VM warning: ignoring option
> MaxPermSize=256m; support was removed in 8.0
> Running
> org.apache.hadoop.hbase.replication.regionserver.TestRegionReplicaReplicationEndpointNoMaster
> Tests run: 1, Failures: 0, Errors: 0, Skipped: 0, Time elapsed: 53.641 sec
> - in
> org.apache.hadoop.hbase.replication.multiwal.TestReplicationSyncUpToolWithMultipleWAL
> Java HotSpot(TM) 64-Bit Server VM warning: ignoring option
> MaxPermSize=256m; support was removed in 8.0
> Running org.apache.hadoop.hbase.replication.TestPerTableCFReplication
> Running
> org.apache.hadoop.hbase.replication.TestReplicationChangingPeerRegionservers
> Tests run: 4, Failures: 0, Errors: 0, Skipped: 0, Time elapsed: 33.238 sec
> - in
> org.apache.hadoop.hbase.replication.regionserver.TestRegionReplicaReplicationEndpointNoMaster
> Java HotSpot(TM) 64-Bit Server VM warning: ignoring option
> MaxPermSize=256m; support was removed in 8.0
> Tests run: 1, Failures: 0, Errors: 0, Skipped: 0, Time elapsed: 5.849 sec
> - in
> org.apache.hadoop.hbase.replication.TestReplicationChangingPeerRegionservers
> Java HotSpot(TM) 64-Bit Server VM warning: ignoring option
> MaxPermSize=256m; support was removed in 8.0
> Tests run: 2, Failures: 0, Errors: 0, Skipped: 0, Time elapsed: 34.847 sec
> - in org.apache.hadoop.hbase.replication.TestPerTableCFReplication
> Java HotSpot(TM) 64-Bit Server VM warning: ignoring option
> MaxPermSize=256m; support was removed in 8.0
> Running org.apache.hadoop.hbase.replication.TestReplicationStateZKImpl
> Tests run: 6, Failures: 0, Errors: 0, Skipped: 0, Time elapsed: 0.849 sec
> - in org.apache.hadoop.hbase.replication.TestReplicationStateZKImpl
> Java HotSpot(TM) 64-Bit Server VM warning: ignoring option
> MaxPermSize=256m; support was removed in 8.0
> Running org.apache.hadoop.hbase.replication.TestMultiSlaveReplication
> Running org.apache.hadoop.hbase.replication.TestReplicationKillMasterRS
> Running
> org.apache.hadoop.hbase.replication.TestReplicationKillMasterRSCompressed
> Tests run: 9, Failures: 0, Errors: 0, Skipped: 0, Time elapsed: 86.258 sec
> - in
> org.apache.hadoop.hbase.replication.regionserver.TestRegionReplicaReplicationEndpoint
> Java HotSpot(TM) 64-Bit Server VM warning: ignoring option
> MaxPermSize=256m; support was removed in 8.0
> Tests run: 1, Failures: 0, Errors: 0, Skipped: 0, Time elapsed: 21.135 sec
> - in org.apache.hadoop.hbase.replication.TestReplicationKillMasterRS
> Java HotSpot(TM) 64-Bit Server VM warning: ignoring option
> MaxPermSize=256m; support was removed in 8.0
> Tests run: 1, Failures: 0, Errors: 0, Skipped: 0, Time elapsed: 21.466 sec
> - in
> org.apache.hadoop.hbase.replication.TestReplicationKillMasterRSCompressed
> Java HotSpot(TM) 64-Bit Server VM warning: ignoring option
> MaxPermSize=256m; support was removed in 8.0
> Running org.apache.hadoop.hbase.replication.TestReplicationSource
> Tests run: 1, Failures: 0, Errors: 0, Skipped: 0, Time elapsed: 0.385 sec
> - in org.apache.hadoop.hbase.replication.TestReplicationSource
> Java HotSpot(TM) 64-Bit Server VM warning: ignoring option
> MaxPermSize=256m; support was removed in 8.0
> Running org.apache.hadoop.hbase.replication.TestMasterReplication
> Running org.apache.hadoop.hbase.replication.TestReplicationWithTags
> Tests run: 1, Failures: 0, Errors: 0, Skipped: 0, Time elapsed: 40.744 sec
> - in org.apache.hadoop.hbase.replication.TestMultiSlaveReplication
> Java HotSpot(TM) 64-Bit Server VM warning: ignoring option
> MaxPermSize=256m; support was removed in 8.0
> Tests run: 1, Failures: 0, Errors: 0, Skipped: 0, Time elapsed: 2.757 sec
> - in org.apache.hadoop.hbase.replication.TestReplicationWithTags
> Java HotSpot(TM) 64-Bit Server VM warning: ignoring option
> MaxPermSize=256m; support was removed in 8.0
> Java HotSpot(TM) 64-Bit Server VM warning: ignoring option
> MaxPermSize=256m; support was removed in 8.0
> Running org.apache.hadoop.hbase.replication.TestReplicationTrackerZKImpl
> Tests run: 5, Failures: 0, Errors: 0, Skipped: 0, Time elapsed: 1.094 sec
> - in org.apache.hadoop.hbase.replication.TestReplicationTrackerZKImpl
> Java HotSpot(TM) 64-Bit Server VM warning: ignoring option
> MaxPermSize=256m; support was removed in 8.0
> Running org.apache.hadoop.hbase.replication.TestReplicationSmallTests
> Running
> org.apache.hadoop.hbase.replication.TestReplicationDisableInactivePeer
> Running org.apache.hadoop.hbase.replication.TestReplicationEndpoint
> Tests run: 3, Failures: 0, Errors: 0, Skipped: 0, Time elapsed: 2.677 sec
> - in org.apache.hadoop.hbase.replication.TestReplicationEndpoint
> Java HotSpot(TM) 64-Bit Server VM warning: ignoring option
> MaxPermSize=256m; support was removed in 8.0
> Java HotSpot(TM) 64-Bit Server VM warning: ignoring option
> MaxPermSize=256m; support was removed in 8.0
> Running
> org.apache.hadoop.hbase.coprocessor.TestMasterCoprocessorExceptionWithRemove
> Tests run: 1, Failures: 0, Errors: 0, Skipped: 0, Time elapsed: 19.237 sec
> - in org.apache.hadoop.hbase.replication.TestReplicationDisableInactivePeer
> Java HotSpot(TM) 64-Bit Server VM warning: ignoring option
> MaxPermSize=256m; support was removed in 8.0
> Tests run: 1, Failures: 0, Errors: 0, Skipped: 0, Time elapsed: 5.66 sec -
> in
> org.apache.hadoop.hbase.coprocessor.TestMasterCoprocessorExceptionWithRemove
> Java HotSpot(TM) 64-Bit Server VM warning: ignoring option
> MaxPermSize=256m; support was removed in 8.0
> Running org.apache.hadoop.hbase.coprocessor.TestWALObserver
> Tests run: 10, Failures: 0, Errors: 0, Skipped: 0, Time elapsed: 49.078
> sec - in org.apache.hadoop.hbase.replication.TestReplicationSmallTests
> Java HotSpot(TM) 64-Bit Server VM warning: ignoring option
> MaxPermSize=256m; support was removed in 8.0
> Running org.apache.hadoop.hbase.coprocessor.TestRegionObserverInterface
> Tests run: 6, Failures: 0, Errors: 0, Skipped: 0, Time elapsed: 8.379 sec
> - in org.apache.hadoop.hbase.coprocessor.TestWALObserver
> Java HotSpot(TM) 64-Bit Server VM warning: ignoring option
> MaxPermSize=256m; support was removed in 8.0
> Running org.apache.hadoop.hbase.coprocessor.TestRegionServerObserver
> Running org.apache.hadoop.hbase.coprocessor.TestBatchCoprocessorEndpoint
> Tests run: 4, Failures: 0, Errors: 0, Skipped: 0, Time elapsed: 1.584 sec
> - in org.apache.hadoop.hbase.coprocessor.TestBatchCoprocessorEndpoint
> Java HotSpot(TM) 64-Bit Server VM warning: ignoring option
> MaxPermSize=256m; support was removed in 8.0
> Java HotSpot(TM) 64-Bit Server VM warning: ignoring option
> MaxPermSize=256m; support was removed in 8.0
> Tests run: 3, Failures: 0, Errors: 0, Skipped: 0, Time elapsed: 82.711 sec
> - in org.apache.hadoop.hbase.replication.TestMasterReplication
> Java HotSpot(TM) 64-Bit Server VM warning: ignoring option
> MaxPermSize=256m; support was removed in 8.0
> Tests run: 1, Failures: 0, Errors: 0, Skipped: 0, Time elapsed: 16.348 sec
> - in org.apache.hadoop.hbase.coprocessor.TestRegionServerObserver
> Java HotSpot(TM) 64-Bit Server VM warning: ignoring option
> MaxPermSize=256m; support was removed in 8.0
> Java HotSpot(TM) 64-Bit Server VM warning: ignoring option
> MaxPermSize=256m; support was removed in 8.0
> Java HotSpot(TM) 64-Bit Server VM warning: ignoring option
> MaxPermSize=256m; support was removed in 8.0
> Running org.apache.hadoop.hbase.coprocessor.TestDoubleColumnInterpreter
> Running org.apache.hadoop.hbase.coprocessor.TestHTableWrapper
> Tests run: 38, Failures: 0, Errors: 0, Skipped: 0, Time elapsed: 5.216 sec
> - in org.apache.hadoop.hbase.coprocessor.TestDoubleColumnInterpreter
> Java HotSpot(TM) 64-Bit Server VM warning: ignoring option
> MaxPermSize=256m; support was removed in 8.0
> Running
> org.apache.hadoop.hbase.coprocessor.TestRegionObserverScannerOpenHook
> Tests run: 1, Failures: 0, Errors: 0, Skipped: 0, Time elapsed: 5.176 sec
> - in org.apache.hadoop.hbase.coprocessor.TestHTableWrapper
> Java HotSpot(TM) 64-Bit Server VM warning: ignoring option
> MaxPermSize=256m; support was removed in 8.0
> Tests run: 8, Failures: 0, Errors: 0, Skipped: 0, Time elapsed: 214.873
> sec - in
> org.apache.hadoop.hbase.replication.regionserver.TestReplicationWALReaderManager
> Java HotSpot(TM) 64-Bit Server VM warning: ignoring option
> MaxPermSize=256m; support was removed in 8.0
> Running org.apache.hadoop.hbase.coprocessor.TestAggregateProtocol
> Java HotSpot(TM) 64-Bit Server VM warning: ignoring option
> MaxPermSize=256m; support was removed in 8.0
> Tests run: 44, Failures: 0, Errors: 0, Skipped: 0, Time elapsed: 6.123 sec
> - in org.apache.hadoop.hbase.coprocessor.TestAggregateProtocol
> Java HotSpot(TM) 64-Bit Server VM warning: ignoring option
> MaxPermSize=256m; support was removed in 8.0
> Tests run: 3, Failures: 0, Errors: 0, Skipped: 0, Time elapsed: 12.581 sec
> - in org.apache.hadoop.hbase.coprocessor.TestRegionObserverScannerOpenHook
> Java HotSpot(TM) 64-Bit Server VM warning: ignoring option
> MaxPermSize=256m; support was removed in 8.0
> Running org.apache.hadoop.hbase.coprocessor.TestCoprocessorStop
> Running
> org.apache.hadoop.hbase.coprocessor.TestMasterCoprocessorExceptionWithAbort
> Running org.apache.hadoop.hbase.coprocessor.TestMasterObserver
> Running org.apache.hadoop.hbase.coprocessor.TestOpenTableInCoprocessor
> Tests run: 1, Failures: 0, Errors: 0, Skipped: 0, Time elapsed: 16.42 sec
> - in org.apache.hadoop.hbase.coprocessor.TestCoprocessorStop
> Java HotSpot(TM) 64-Bit Server VM warning: ignoring option
> MaxPermSize=256m; support was removed in 8.0
> Tests run: 1, Failures: 0, Errors: 0, Skipped: 0, Time elapsed: 17.31 sec
> - in
> org.apache.hadoop.hbase.coprocessor.TestMasterCoprocessorExceptionWithAbort
> Java HotSpot(TM) 64-Bit Server VM warning: ignoring option
> MaxPermSize=256m; support was removed in 8.0
> Running
> org.apache.hadoop.hbase.coprocessor.TestRegionServerCoprocessorExceptionWithAbort
> Tests run: 2, Failures: 0, Errors: 0, Skipped: 0, Time elapsed: 18.326 sec
> - in org.apache.hadoop.hbase.coprocessor.TestOpenTableInCoprocessor
> Tests run: 14, Failures: 0, Errors: 0, Skipped: 2, Time elapsed: 74.318
> sec - in org.apache.hadoop.hbase.coprocessor.TestRegionObserverInterface
> Java HotSpot(TM) 64-Bit Server VM warning: ignoring option
> MaxPermSize=256m; support was removed in 8.0
> Java HotSpot(TM) 64-Bit Server VM warning: ignoring option
> MaxPermSize=256m; support was removed in 8.0
> Running
> org.apache.hadoop.hbase.coprocessor.TestRegionServerCoprocessorEndpoint
> Tests run: 2, Failures: 0, Errors: 0, Skipped: 0, Time elapsed: 1.434 sec
> - in org.apache.hadoop.hbase.coprocessor.TestRegionServerCoprocessorEndpoint
> Java HotSpot(TM) 64-Bit Server VM warning: ignoring option
> MaxPermSize=256m; support was removed in 8.0
> Running org.apache.hadoop.hbase.coprocessor.TestCoprocessorTableEndpoint
> Running org.apache.hadoop.hbase.coprocessor.TestCoprocessorEndpoint
> Tests run: 2, Failures: 0, Errors: 0, Skipped: 0, Time elapsed: 21.483 sec
> - in
> org.apache.hadoop.hbase.coprocessor.TestRegionServerCoprocessorExceptionWithAbort
> Tests run: 6, Failures: 0, Errors: 0, Skipped: 0, Time elapsed: 1.91 sec -
> in org.apache.hadoop.hbase.coprocessor.TestCoprocessorEndpoint
> Java HotSpot(TM) 64-Bit Server VM warning: ignoring option
> MaxPermSize=256m; support was removed in 8.0
> Java HotSpot(TM) 64-Bit Server VM warning: ignoring option
> MaxPermSize=256m; support was removed in 8.0
> Running org.apache.hadoop.hbase.coprocessor.TestBigDecimalColumnInterpreter
> Tests run: 9, Failures: 0, Errors: 0, Skipped: 0, Time elapsed: 39.682 sec
> - in org.apache.hadoop.hbase.coprocessor.TestMasterObserver
> Tests run: 2, Failures: 0, Errors: 0, Skipped: 0, Time elapsed: 8.709 sec
> - in org.apache.hadoop.hbase.coprocessor.TestCoprocessorTableEndpoint
> Java HotSpot(TM) 64-Bit Server VM warning: ignoring option
> MaxPermSize=256m; support was removed in 8.0
> Java HotSpot(TM) 64-Bit Server VM warning: ignoring option
> MaxPermSize=256m; support was removed in 8.0
> Tests run: 38, Failures: 0, Errors: 0, Skipped: 0, Time elapsed: 5.946 sec
> - in org.apache.hadoop.hbase.coprocessor.TestBigDecimalColumnInterpreter
> Java HotSpot(TM) 64-Bit Server VM warning: ignoring option
> MaxPermSize=256m; support was removed in 8.0
> Running org.apache.hadoop.hbase.coprocessor.TestRegionObserverBypass
> Running org.apache.hadoop.hbase.coprocessor.TestClassLoading
> Running
> org.apache.hadoop.hbase.coprocessor.TestRegionServerCoprocessorExceptionWithRemove
> Running org.apache.hadoop.hbase.coprocessor.TestRowProcessorEndpoint
> Running org.apache.hadoop.hbase.TestStochasticBalancerJmxMetrics
> Tests run: 2, Failures: 0, Errors: 0, Skipped: 0, Time elapsed: 8.826 sec
> - in org.apache.hadoop.hbase.coprocessor.TestRegionObserverBypass
> Java HotSpot(TM) 64-Bit Server VM warning: ignoring option
> MaxPermSize=256m; support was removed in 8.0
> Tests run: 2, Failures: 0, Errors: 0, Skipped: 0, Time elapsed: 1.242 sec
> - in org.apache.hadoop.hbase.TestStochasticBalancerJmxMetrics
> Java HotSpot(TM) 64-Bit Server VM warning: ignoring option
> MaxPermSize=256m; support was removed in 8.0
> Running org.apache.hadoop.hbase.TestMetaTableLocator
> Tests run: 7, Failures: 0, Errors: 0, Skipped: 0, Time elapsed: 3.404 sec
> - in org.apache.hadoop.hbase.TestMetaTableLocator
> Java HotSpot(TM) 64-Bit Server VM warning: ignoring option
> MaxPermSize=256m; support was removed in 8.0
> Running org.apache.hadoop.hbase.TestHBaseTestingUtility
> Running org.apache.hadoop.hbase.TestJMXListener
> Tests run: 1, Failures: 0, Errors: 0, Skipped: 0, Time elapsed: 16.071 sec
> - in
> org.apache.hadoop.hbase.coprocessor.TestRegionServerCoprocessorExceptionWithRemove
> Java HotSpot(TM) 64-Bit Server VM warning: ignoring option
> MaxPermSize=256m; support was removed in 8.0
> Tests run: 4, Failures: 0, Errors: 0, Skipped: 0, Time elapsed: 18.599 sec
> - in org.apache.hadoop.hbase.coprocessor.TestRowProcessorEndpoint
> Tests run: 9, Failures: 0, Errors: 0, Skipped: 0, Time elapsed: 28.534 sec
> - in org.apache.hadoop.hbase.coprocessor.TestClassLoading
> Running org.apache.hadoop.hbase.namespace.TestNamespaceAuditor
> Tests run: 2, Failures: 0, Errors: 0, Skipped: 0, Time elapsed: 16.443 sec
> - in org.apache.hadoop.hbase.TestJMXListener
> Tests run: 11, Failures: 0, Errors: 0, Skipped: 0, Time elapsed: 61.01 sec
> - in org.apache.hadoop.hbase.TestHBaseTestingUtility
> Tests run: 12, Failures: 0, Errors: 0, Skipped: 1, Time elapsed: 104.588
> sec - in org.apache.hadoop.hbase.namespace.TestNamespaceAuditor
>
> Results :
>
> Flaked tests:
>
> org.apache.hadoop.hbase.client.TestSnapshotCloneIndependence.testOnlineSnapshotDeleteIndependent(org.apache.hadoop.hbase.client.TestSnapshotCloneIndependence)
>   Run 1:
> TestSnapshotCloneIndependence.testOnlineSnapshotDeleteIndependent:191->runTestSnapshotDeleteIndependent:459
> expected:<17576> but was:<14046>
>   Run 2: PASS
>
>
> org.apache.hadoop.hbase.master.TestTableLockManager.testReapAllTableLocks(org.apache.hadoop.hbase.master.TestTableLockManager)
>   Run 1: TestTableLockManager.testReapAllTableLocks:283 » LockTimeout
> Timed out acquiri...
>   Run 2: PASS
>
>
> Tests run: 2381, Failures: 0, Errors: 0, Skipped: 55, Flakes: 2
>
> [INFO]
> ------------------------------------------------------------------------
> [INFO] Reactor Summary:
> [INFO]
> [INFO] Apache HBase ...................................... SUCCESS
> [1:01.691s]
> [INFO] Apache HBase - Checkstyle ......................... SUCCESS [5.974s]
> [INFO] Apache HBase - Resource Bundle .................... SUCCESS [0.140s]
> [INFO] Apache HBase - Annotations ........................ SUCCESS [0.928s]
> [INFO] Apache HBase - Protocol ........................... SUCCESS
> [15.477s]
> [INFO] Apache HBase - Common ............................. SUCCESS
> [1:43.261s]
> [INFO] Apache HBase - Procedure .......................... SUCCESS
> [1:51.436s]
> [INFO] Apache HBase - Client ............................. SUCCESS
> [1:22.136s]
> [INFO] Apache HBase - Hadoop Compatibility ............... SUCCESS [8.116s]
> [INFO] Apache HBase - Hadoop Two Compatibility ........... SUCCESS [7.811s]
> [INFO] Apache HBase - Prefix Tree ........................ SUCCESS [7.434s]
> [INFO] Apache HBase - Server ............................. FAILURE
> [1:29:56.499s]
> [INFO] Apache HBase - Testing Util ....................... SKIPPED
> [INFO] Apache HBase - Thrift ............................. SKIPPED
> [INFO] Apache HBase - Rest ............................... SKIPPED
> [INFO] Apache HBase - Shell .............................. SKIPPED
> [INFO] Apache HBase - Integration Tests .................. SKIPPED
> [INFO] Apache HBase - Examples ........................... SKIPPED
> [INFO] Apache HBase - External Block Cache ............... SKIPPED
> [INFO] Apache HBase - Assembly ........................... SKIPPED
> [INFO] Apache HBase - Shaded ............................. SKIPPED
> [INFO] Apache HBase - Shaded - Client .................... SKIPPED
> [INFO] Apache HBase - Shaded - Server .................... SKIPPED
> [INFO]
> ------------------------------------------------------------------------
> [INFO] BUILD FAILURE
> [INFO]
> ------------------------------------------------------------------------
> [INFO] Total time: 1:37:01.971s
> [INFO] Finished at: Thu Oct 15 22:16:08 UTC 2015
> [INFO] Final Memory: 94M/758M
> [INFO]
> ------------------------------------------------------------------------
> [ERROR] Failed to execute goal
> org.apache.maven.plugins:maven-surefire-plugin:2.18.1:test
> (secondPartTestsExecution) on project hbase-server: ExecutionException:
> java.lang.RuntimeException: The forked VM terminated without properly
> saying goodbye. VM crash or System.exit called?
> [ERROR] Command was /bin/sh -c cd <
> https://builds.apache.org/job/HBase-1.3/jdk=latest1.8,label=Hadoop/ws/hbase-server>
> &&
> /home/jenkins/jenkins-slave/tools/hudson.model.JDK/latest1.8/jre/bin/java
> -enableassertions -Dhbase.test -Xmx2800m -XX:MaxPermSize=256m
> -Djava.security.egd=file:/dev/./urandom -Djava.net.preferIPv4Stack=true
> -Djava.awt.headless=true -jar <
> https://builds.apache.org/job/HBase-1.3/jdk=latest1.8,label=Hadoop/ws/hbase-server/target/surefire/surefirebooter684335202767454119.jar>
> <
> https://builds.apache.org/job/HBase-1.3/jdk=latest1.8,label=Hadoop/ws/hbase-server/target/surefire/surefire4013079445664697584tmp>
> <
> https://builds.apache.org/job/HBase-1.3/jdk=latest1.8,label=Hadoop/ws/hbase-server/target/surefire/surefire_8515151184275734724629tmp
> >
> [ERROR] -> [Help 1]
> [ERROR]
> [ERROR] To see the full stack trace of the errors, re-run Maven with the
> -e switch.
> [ERROR] Re-run Maven using the -X switch to enable full debug logging.
> [ERROR]
> [ERROR] For more information about the errors and possible solutions,
> please read the following articles:
> [ERROR] [Help 1]
> http://cwiki.apache.org/confluence/display/MAVEN/MojoFailureException
> [ERROR]
> [ERROR] After correcting the problems, you can resume the build with the
> command
> [ERROR]   mvn <goals> -rf :hbase-server
> Build step 'Invoke top-level Maven targets' marked build as failure
> Performing Post build task...
> Match found for :.* : True
> Logical operation result is TRUE
> Running script  :     ZOMBIE_TESTS_COUNT=`jps -v | grep surefirebooter |
> grep '-Dhbase.test' | wc -l`
>   if [[ $ZOMBIE_TESTS_COUNT != 0 ]] ; then
>     #It seems sometimes the tests are not dying immediately. Let's give
> them 30s
>     echo "Suspicious java process found - waiting 30s to see if there are
> just slow to stop"
>     sleep 30
>     ZOMBIE_TESTS_COUNT=`jps -v | grep surefirebooter | grep '-Dhbase.test'
> | wc -l`
>     if [[ $ZOMBIE_TESTS_COUNT != 0 ]] ; then
>       echo "There are $ZOMBIE_TESTS_COUNT zombie tests, they should have
> been killed by surefire but survived"
>       echo "************ zombies jps listing"
>       jps -v
>       jps -v | grep surefirebooter | grep '-Dhbase.test'
>       echo "************ BEGIN zombies jstack extract"
>       # HBase tests have been flagged with an innocuous '-Dhbase.test'
> just so they can
>       # be identified as hbase in a process listing.
>       ZB_STACK=`jps -v | grep surefirebooter | grep '-Dhbase.test' | cut
> -d ' ' -f 1 | xargs -n 1 jstack | grep ".test" | grep "\.java"`
>       jps -v | grep surefirebooter | grep '-Dhbase.test' | cut -d ' ' -f 1
> | xargs -n 1 jstack
>       echo "************ END  zombies jstack extract"
>       JIRA_COMMENT="$JIRA_COMMENT
>
>      {color:red}-1 core zombie tests{color}.  There are
> ${ZOMBIE_TESTS_COUNT} zombie test(s): ${ZB_STACK}"
>       BAD=1
>       # Killing these zombies
>       echo 'Killing ZOMBIES!!!'
>       jps -v
>       jps -v | grep surefirebooter | grep '-Dhbase.test' | cut -d ' ' -f 1
> | xargs kill -9
>     else
>       echo "We're ok: there is no zombie test, but some tests took some
> time to stop"
>     fi
> [Hadoop] $ /bin/bash -xe /tmp/hudson3463412485585991718.sh
> ++ jps -v
> ++ grep surefirebooter
> ++ grep -Dhbase.test
> ++ wc -l
> grep: unknown devices method
> + ZOMBIE_TESTS_COUNT=0
> /tmp/hudson3463412485585991718.sh: line 30: syntax error: unexpected end
> of file
> POST BUILD TASK : FAILURE
> END OF POST BUILD TASK : 0
> Archiving artifacts
>

Mime
  • Unnamed multipart/alternative (inline, None, 0 bytes)
View raw message