hbase-builds mailing list archives

Site index · List index
Message view « Date » · « Thread »
Top « Date » · « Thread »
From Stack <st...@duboce.net>
Subject Re: Build failed in Jenkins: HBase-TRUNK #6878
Date Tue, 06 Oct 2015 22:15:09 GMT
Killed:


[ERROR] Failed to execute goal
org.apache.maven.plugins:maven-surefire-plugin:2.18.1:test
(default-test) on project hbase-server: ExecutionException:
java.lang.RuntimeException: The forked VM terminated without properly
saying goodbye. VM crash or System.exit called?[ERROR] Command was
/bin/sh -c cd /home/jenkins/jenkins-slave/workspace/HBase-TRUNK/hbase-server
&& /home/jenkins/jenkins-slave/tools/hudson.model.JDK/jdk-1.7u51/jre/bin/java
-enableassertions -XX:MaxDirectMemorySize=1G -Xmx2800m
-XX:MaxPermSize=256m -Djava.security.egd=file:/dev/./urandom
-Djava.net.preferIPv4Stack=true -Djava.awt.headless=true
'-javaagent:/home/jenkins/.m2/repository/org/jacoco/org.jacoco.agent/0.7.5.201505241946/org.jacoco.agent-0.7.5.201505241946-runtime.jar=destfile=/home/jenkins/jenkins-slave/workspace/HBase-TRUNK/hbase-server/target/jacoco.exec,excludes=**/generated/**/*.class'
-jar /home/jenkins/jenkins-slave/workspace/HBase-TRUNK/hbase-server/target/surefire/surefirebooter5543091014172823065.jar
/home/jenkins/jenkins-slave/workspace/HBase-TRUNK/hbase-server/target/surefire/surefire2941104625513933360tmp
/home/jenkins/jenkins-slave/workspace/HBase-TRUNK/hbase-server/target/surefire/surefire_6296943032260994904650tmp[ERROR]
-> [Help 1][ERROR] [ERROR] To see the full stack trace of the errors,
re-run Maven with the -e switch.[ERROR] Re-run Maven using the -X
switch to enable full debug logging.[ERROR] [ERROR] For more
information about the errors and possible solutions, please read the
following articles:[ERROR] [Help 1]
http://cwiki.apache.org/confluence/display/MAVEN/MojoFailureException[ERROR]
[ERROR] After correcting the problems, you can resume the build with
the command[ERROR]   mvn <goals> -rf :hbase-server




On Tue, Oct 6, 2015 at 2:32 PM, Apache Jenkins Server <
jenkins@builds.apache.org> wrote:

> See <https://builds.apache.org/job/HBase-TRUNK/6878/changes>
>
> Changes:
>
> [stack] HBASE-14561 Disable zombie TestReplicationShell
>
> ------------------------------------------
> [...truncated 4394 lines...]
> Running org.apache.hadoop.hbase.http.jmx.TestJMXJsonServlet
> Tests run: 1, Failures: 0, Errors: 0, Skipped: 0, Time elapsed: 0.559 sec
> - in org.apache.hadoop.hbase.http.jmx.TestJMXJsonServlet
> Running org.apache.hadoop.hbase.http.TestGlobalFilter
> Tests run: 1, Failures: 0, Errors: 0, Skipped: 0, Time elapsed: 1.785 sec
> - in org.apache.hadoop.hbase.http.TestGlobalFilter
> Running org.apache.hadoop.hbase.http.TestHttpServerLifecycle
> Tests run: 6, Failures: 0, Errors: 0, Skipped: 6, Time elapsed: 0.002 sec
> - in org.apache.hadoop.hbase.http.TestHttpServerLifecycle
> Running org.apache.hadoop.hbase.http.TestHttpRequestLog
> Tests run: 2, Failures: 0, Errors: 0, Skipped: 0, Time elapsed: 0.352 sec
> - in org.apache.hadoop.hbase.http.TestHttpRequestLog
> Running org.apache.hadoop.hbase.http.TestHttpServerWebapps
> Tests run: 2, Failures: 0, Errors: 0, Skipped: 0, Time elapsed: 1.186 sec
> - in org.apache.hadoop.hbase.http.TestHttpServerWebapps
> Running org.apache.hadoop.hbase.http.TestHttpServer
> Killed
> Running org.apache.hadoop.hbase.http.TestSSLHttpServer
> Tests run: 1, Failures: 0, Errors: 0, Skipped: 0, Time elapsed: 0.4 sec -
> in org.apache.hadoop.hbase.http.TestSSLHttpServer
> Running org.apache.hadoop.hbase.TestPerformanceEvaluation
> Tests run: 4, Failures: 0, Errors: 0, Skipped: 1, Time elapsed: 0.762 sec
> - in org.apache.hadoop.hbase.TestPerformanceEvaluation
> Running org.apache.hadoop.hbase.filter.TestParseFilter
> Tests run: 34, Failures: 0, Errors: 0, Skipped: 0, Time elapsed: 1.434 sec
> - in org.apache.hadoop.hbase.filter.TestParseFilter
> Running org.apache.hadoop.hbase.filter.TestComparatorSerialization
> Tests run: 6, Failures: 0, Errors: 0, Skipped: 0, Time elapsed: 2.768 sec
> - in org.apache.hadoop.hbase.filter.TestComparatorSerialization
> Running org.apache.hadoop.hbase.filter.TestSingleColumnValueExcludeFilter
> Tests run: 1, Failures: 0, Errors: 0, Skipped: 0, Time elapsed: 0.188 sec
> - in org.apache.hadoop.hbase.filter.TestSingleColumnValueExcludeFilter
> Running org.apache.hadoop.hbase.filter.TestFilterSerialization
> Tests run: 26, Failures: 0, Errors: 0, Skipped: 0, Time elapsed: 3.593 sec
> - in org.apache.hadoop.hbase.filter.TestFilterSerialization
> Running org.apache.hadoop.hbase.filter.TestFilterList
> Tests run: 7, Failures: 0, Errors: 0, Skipped: 0, Time elapsed: 2.457 sec
> - in org.apache.hadoop.hbase.filter.TestFilterList
> Running org.apache.hadoop.hbase.filter.TestNullComparator
> Tests run: 3, Failures: 0, Errors: 0, Skipped: 0, Time elapsed: 0.369 sec
> - in org.apache.hadoop.hbase.filter.TestNullComparator
> Running org.apache.hadoop.hbase.filter.TestRegexComparator
> Tests run: 3, Failures: 0, Errors: 0, Skipped: 0, Time elapsed: 0.944 sec
> - in org.apache.hadoop.hbase.filter.TestRegexComparator
> Running org.apache.hadoop.hbase.filter.TestDependentColumnFilter
> Tests run: 4, Failures: 0, Errors: 0, Skipped: 0, Time elapsed: 2.821 sec
> - in org.apache.hadoop.hbase.filter.TestDependentColumnFilter
> Running org.apache.hadoop.hbase.filter.TestPrefixFilter
> Tests run: 3, Failures: 0, Errors: 0, Skipped: 0, Time elapsed: 0.324 sec
> - in org.apache.hadoop.hbase.filter.TestPrefixFilter
> Running
> org.apache.hadoop.hbase.filter.TestFirstKeyValueMatchingQualifiersFilter
> Tests run: 1, Failures: 0, Errors: 0, Skipped: 0, Time elapsed: 0.17 sec -
> in org.apache.hadoop.hbase.filter.TestFirstKeyValueMatchingQualifiersFilter
> Running org.apache.hadoop.hbase.filter.TestFuzzyRowFilter
> Tests run: 6, Failures: 0, Errors: 0, Skipped: 0, Time elapsed: 0.668 sec
> - in org.apache.hadoop.hbase.filter.TestFuzzyRowFilter
> Running org.apache.hadoop.hbase.filter.TestMultipleColumnPrefixFilter
> Tests run: 3, Failures: 0, Errors: 0, Skipped: 0, Time elapsed: 8.672 sec
> - in org.apache.hadoop.hbase.filter.TestMultipleColumnPrefixFilter
> Running org.apache.hadoop.hbase.filter.TestSingleColumnValueFilter
> Tests run: 3, Failures: 0, Errors: 0, Skipped: 0, Time elapsed: 2.322 sec
> - in org.apache.hadoop.hbase.filter.TestSingleColumnValueFilter
> Running org.apache.hadoop.hbase.filter.TestColumnPrefixFilter
> Tests run: 2, Failures: 0, Errors: 0, Skipped: 0, Time elapsed: 6.555 sec
> - in org.apache.hadoop.hbase.filter.TestColumnPrefixFilter
> Running org.apache.hadoop.hbase.filter.TestBitComparator
> Tests run: 6, Failures: 0, Errors: 0, Skipped: 0, Time elapsed: 0.458 sec
> - in org.apache.hadoop.hbase.filter.TestBitComparator
> Running org.apache.hadoop.hbase.filter.TestInclusiveStopFilter
> Tests run: 2, Failures: 0, Errors: 0, Skipped: 0, Time elapsed: 0.389 sec
> - in org.apache.hadoop.hbase.filter.TestInclusiveStopFilter
> Running org.apache.hadoop.hbase.filter.TestPageFilter
> Tests run: 2, Failures: 0, Errors: 0, Skipped: 0, Time elapsed: 0.42 sec -
> in org.apache.hadoop.hbase.filter.TestPageFilter
> Running org.apache.hadoop.hbase.filter.TestRandomRowFilter
> Tests run: 2, Failures: 0, Errors: 0, Skipped: 0, Time elapsed: 0.954 sec
> - in org.apache.hadoop.hbase.filter.TestRandomRowFilter
> Running org.apache.hadoop.hbase.filter.TestFilter
> Tests run: 21, Failures: 0, Errors: 0, Skipped: 0, Time elapsed: 7.045 sec
> - in org.apache.hadoop.hbase.filter.TestFilter
> Running org.apache.hadoop.hbase.filter.TestInvocationRecordFilter
> Tests run: 1, Failures: 0, Errors: 0, Skipped: 0, Time elapsed: 2.459 sec
> - in org.apache.hadoop.hbase.filter.TestInvocationRecordFilter
> Running org.apache.hadoop.hbase.filter.TestColumnPaginationFilter
> Tests run: 1, Failures: 0, Errors: 0, Skipped: 0, Time elapsed: 2.237 sec
> - in org.apache.hadoop.hbase.filter.TestColumnPaginationFilter
> Running org.apache.hadoop.hbase.constraint.TestConstraints
> Tests run: 6, Failures: 0, Errors: 0, Skipped: 0, Time elapsed: 2.732 sec
> - in org.apache.hadoop.hbase.constraint.TestConstraints
> Running org.apache.hadoop.hbase.protobuf.TestProtobufUtil
> Tests run: 7, Failures: 0, Errors: 0, Skipped: 0, Time elapsed: 2.657 sec
> - in org.apache.hadoop.hbase.protobuf.TestProtobufUtil
> Running org.apache.hadoop.hbase.protobuf.TestReplicationProtobuf
> Tests run: 1, Failures: 0, Errors: 0, Skipped: 0, Time elapsed: 0.43 sec -
> in org.apache.hadoop.hbase.protobuf.TestReplicationProtobuf
> Running org.apache.hadoop.hbase.TestSerialization
> Tests run: 9, Failures: 0, Errors: 0, Skipped: 0, Time elapsed: 2.934 sec
> - in org.apache.hadoop.hbase.TestSerialization
> Running org.apache.hadoop.hbase.codec.TestCellMessageCodec
> Tests run: 3, Failures: 0, Errors: 0, Skipped: 0, Time elapsed: 0.443 sec
> - in org.apache.hadoop.hbase.codec.TestCellMessageCodec
> Running org.apache.hadoop.hbase.quotas.TestRateLimiter
> Tests run: 12, Failures: 0, Errors: 0, Skipped: 0, Time elapsed: 0.587 sec
> - in org.apache.hadoop.hbase.quotas.TestRateLimiter
> Running org.apache.hadoop.hbase.quotas.TestQuotaState
> Tests run: 5, Failures: 0, Errors: 0, Skipped: 0, Time elapsed: 2.3 sec -
> in org.apache.hadoop.hbase.quotas.TestQuotaState
> Running org.apache.hadoop.hbase.TestServerName
> Tests run: 7, Failures: 0, Errors: 0, Skipped: 0, Time elapsed: 0.551 sec
> - in org.apache.hadoop.hbase.TestServerName
> Running org.apache.hadoop.hbase.wal.TestWALMethods
> Tests run: 3, Failures: 0, Errors: 0, Skipped: 0, Time elapsed: 1.352 sec
> - in org.apache.hadoop.hbase.wal.TestWALMethods
> Running
> org.apache.hadoop.hbase.errorhandling.TestForeignExceptionDispatcher
> Tests run: 3, Failures: 0, Errors: 0, Skipped: 0, Time elapsed: 0.573 sec
> - in org.apache.hadoop.hbase.errorhandling.TestForeignExceptionDispatcher
> Running
> org.apache.hadoop.hbase.errorhandling.TestForeignExceptionSerialization
> Tests run: 2, Failures: 0, Errors: 0, Skipped: 0, Time elapsed: 0.822 sec
> - in org.apache.hadoop.hbase.errorhandling.TestForeignExceptionSerialization
> Running org.apache.hadoop.hbase.errorhandling.TestTimeoutExceptionInjector
> Tests run: 4, Failures: 0, Errors: 0, Skipped: 0, Time elapsed: 0.636 sec
> - in org.apache.hadoop.hbase.errorhandling.TestTimeoutExceptionInjector
> Running
> org.apache.hadoop.hbase.replication.regionserver.TestReplicationThrottler
> Tests run: 1, Failures: 0, Errors: 0, Skipped: 0, Time elapsed: 0.094 sec
> - in
> org.apache.hadoop.hbase.replication.regionserver.TestReplicationThrottler
> Running
> org.apache.hadoop.hbase.replication.regionserver.TestReplicationSinkManager
> Tests run: 5, Failures: 0, Errors: 0, Skipped: 0, Time elapsed: 2.106 sec
> - in
> org.apache.hadoop.hbase.replication.regionserver.TestReplicationSinkManager
> Running org.apache.hadoop.hbase.replication.TestReplicationWALEntryFilters
> Tests run: 4, Failures: 0, Errors: 0, Skipped: 0, Time elapsed: 1.135 sec
> - in org.apache.hadoop.hbase.replication.TestReplicationWALEntryFilters
> Running org.apache.hadoop.hbase.TestServerLoad
> Tests run: 3, Failures: 0, Errors: 0, Skipped: 0, Time elapsed: 0.585 sec
> - in org.apache.hadoop.hbase.TestServerLoad
> Running org.apache.hadoop.hbase.coprocessor.TestCoprocessorHost
> Tests run: 1, Failures: 0, Errors: 0, Skipped: 0, Time elapsed: 1.642 sec
> - in org.apache.hadoop.hbase.coprocessor.TestCoprocessorHost
> Running org.apache.hadoop.hbase.coprocessor.TestRegionObserverStacking
> Tests run: 1, Failures: 0, Errors: 0, Skipped: 0, Time elapsed: 2.494 sec
> - in org.apache.hadoop.hbase.coprocessor.TestRegionObserverStacking
> Running org.apache.hadoop.hbase.coprocessor.TestCoprocessorInterface
> Tests run: 2, Failures: 0, Errors: 0, Skipped: 0, Time elapsed: 11.469 sec
> - in org.apache.hadoop.hbase.coprocessor.TestCoprocessorInterface
> Running org.apache.hadoop.hbase.coprocessor.TestCoprocessorConfiguration
> Tests run: 5, Failures: 0, Errors: 0, Skipped: 0, Time elapsed: 1.122 sec
> - in org.apache.hadoop.hbase.coprocessor.TestCoprocessorConfiguration
>
> Results :
>
> Tests run: 995, Failures: 0, Errors: 0, Skipped: 18
>
> [INFO]
> ------------------------------------------------------------------------
> [INFO] Reactor Summary:
> [INFO]
> [INFO] Apache HBase ...................................... SUCCESS [
> 2.916 s]
> [INFO] Apache HBase - Checkstyle ......................... SUCCESS [
> 0.637 s]
> [INFO] Apache HBase - Resource Bundle .................... SUCCESS [
> 0.180 s]
> [INFO] Apache HBase - Annotations ........................ SUCCESS [
> 0.210 s]
> [INFO] Apache HBase - Protocol ........................... SUCCESS [
> 2.780 s]
> [INFO] Apache HBase - Common ............................. SUCCESS [02:40
> min]
> [INFO] Apache HBase - Procedure .......................... SUCCESS [02:08
> min]
> [INFO] Apache HBase - Client ............................. SUCCESS [02:14
> min]
> [INFO] Apache HBase - Hadoop Compatibility ............... SUCCESS [
> 14.434 s]
> [INFO] Apache HBase - Hadoop Two Compatibility ........... SUCCESS [
> 20.499 s]
> [INFO] Apache HBase - Prefix Tree ........................ SUCCESS [
> 28.177 s]
> [INFO] Apache HBase - Server ............................. FAILURE [32:34
> min]
> [INFO] Apache HBase - Testing Util ....................... SKIPPED
> [INFO] Apache HBase - Thrift ............................. SKIPPED
> [INFO] Apache HBase - Shell .............................. SKIPPED
> [INFO] Apache HBase - Integration Tests .................. SKIPPED
> [INFO] Apache HBase - Examples ........................... SKIPPED
> [INFO] Apache HBase - Rest ............................... SKIPPED
> [INFO] Apache HBase - External Block Cache ............... SKIPPED
> [INFO] Apache HBase - Assembly ........................... SKIPPED
> [INFO] Apache HBase - Shaded ............................. SKIPPED
> [INFO] Apache HBase - Shaded - Client .................... SKIPPED
> [INFO] Apache HBase - Shaded - Server .................... SKIPPED
> [INFO] Apache HBase - Spark .............................. SKIPPED
> [INFO]
> ------------------------------------------------------------------------
> [INFO] BUILD FAILURE
> [INFO]
> ------------------------------------------------------------------------
> [INFO] Total time: 40:48 min
> [INFO] Finished at: 2015-10-06T21:27:58+00:00
> [INFO] Final Memory: 64M/598M
> [INFO]
> ------------------------------------------------------------------------
> [ERROR] Failed to execute goal
> org.apache.maven.plugins:maven-surefire-plugin:2.18.1:test (default-test)
> on project hbase-server: ExecutionException: java.lang.RuntimeException:
> The forked VM terminated without properly saying goodbye. VM crash or
> System.exit called?
> [ERROR] Command was /bin/sh -c cd <
> https://builds.apache.org/job/HBase-TRUNK/ws/hbase-server> &&
> /home/jenkins/jenkins-slave/tools/hudson.model.JDK/jdk-1.7u51/jre/bin/java
> -enableassertions -XX:MaxDirectMemorySize=1G -Xmx2800m -XX:MaxPermSize=256m
> -Djava.security.egd=file:/dev/./urandom -Djava.net.preferIPv4Stack=true
> -Djava.awt.headless=true
> '-javaagent:/home/jenkins/.m2/repository/org/jacoco/org.jacoco.agent/0.7.5.201505241946/org.jacoco.agent-0.7.5.201505241946-runtime.jar=destfile=<
> https://builds.apache.org/job/HBase-TRUNK/ws/hbase-server/target/jacoco.exec,excludes=**/generated/**/*.class'>
> -jar <
> https://builds.apache.org/job/HBase-TRUNK/ws/hbase-server/target/surefire/surefirebooter5543091014172823065.jar>
> <
> https://builds.apache.org/job/HBase-TRUNK/ws/hbase-server/target/surefire/surefire2941104625513933360tmp>
> <
> https://builds.apache.org/job/HBase-TRUNK/ws/hbase-server/target/surefire/surefire_6296943032260994904650tmp
> >
> [ERROR] -> [Help 1]
> [ERROR]
> [ERROR] To see the full stack trace of the errors, re-run Maven with the
> -e switch.
> [ERROR] Re-run Maven using the -X switch to enable full debug logging.
> [ERROR]
> [ERROR] For more information about the errors and possible solutions,
> please read the following articles:
> [ERROR] [Help 1]
> http://cwiki.apache.org/confluence/display/MAVEN/MojoFailureException
> [ERROR]
> [ERROR] After correcting the problems, you can resume the build with the
> command
> [ERROR]   mvn <goals> -rf :hbase-server
> Build step 'Invoke top-level Maven targets' marked build as failure
> Performing Post build task...
> Match found for :.* : True
> Logical operation result is TRUE
> Running script  :   ZOMBIE_TESTS_COUNT=`jps | grep surefirebooter | wc -l`
>   if [[ $ZOMBIE_TESTS_COUNT != 0 ]] ; then
>     #It seems sometimes the tests are not dying immediately. Let's give
> them 10s
>     echo "Suspicious java process found - waiting 10s to see if there are
> just slow to stop"
>     sleep 10
>     ZOMBIE_TESTS_COUNT=`jps | grep surefirebooter | wc -l`
>     if [[ $ZOMBIE_TESTS_COUNT != 0 ]] ; then
>       echo "There are $ZOMBIE_TESTS_COUNT zombie tests, they should have
> been killed by surefire but survived"
>       echo "************ BEGIN zombies jstack extract"
>       ZB_STACK=`jps | grep surefirebooter | cut -d ' ' -f 1 | xargs -n 1
> jstack | grep ".test" | grep "\.java"`
>       jps | grep surefirebooter | cut -d ' ' -f 1 | xargs -n 1 jstack
>       echo "************ END  zombies jstack extract"
>       JIRA_COMMENT="$JIRA_COMMENT
>
>      {color:red}-1 core zombie tests{color}.  There are
> ${ZOMBIE_TESTS_COUNT} zombie test(s): ${ZB_STACK}"
>       BAD=1
>       jps | grep surefirebooter | cut -d ' ' -f 1 | xargs kill -9
>     else
>       echo "We're ok: there is no zombie test, but some tests took some
> time to stop"
>     fi
>   else
>     echo "We're ok: there is no zombie test"
>   fi
> [HBase-TRUNK] $ /bin/bash -xe /tmp/hudson6841359885089519366.sh
> ++ jps
> ++ grep surefirebooter
> ++ wc -l
> + ZOMBIE_TESTS_COUNT=0
> + [[ 0 != 0 ]]
> + echo 'We'\''re ok: there is no zombie test'
> We're ok: there is no zombie test
> POST BUILD TASK : SUCCESS
> END OF POST BUILD TASK : 0
> Archiving artifacts
> Recording test results
> [FINDBUGS] Collecting findbugs analysis files...
> [FINDBUGS] Finding all files that match the pattern
> **/findbugs.xml,**/findbugsXml.xml
> [FINDBUGS] Parsing 28 files in <
> https://builds.apache.org/job/HBase-TRUNK/ws/>
> [FINDBUGS] Successfully parsed file <
> https://builds.apache.org/job/HBase-TRUNK/6878/artifact/hbase-annotations/target/findbugs.xml>
> with 0 unique warnings and 0 duplicates.
> [FINDBUGS] Successfully parsed file <
> https://builds.apache.org/job/HBase-TRUNK/6878/artifact/hbase-annotations/target/findbugsXml.xml>
> with 0 unique warnings and 0 duplicates.
> [FINDBUGS] Successfully parsed file <
> https://builds.apache.org/job/HBase-TRUNK/6878/artifact/hbase-client/target/findbugs.xml>
> with 0 unique warnings and 0 duplicates.
> [FINDBUGS] Successfully parsed file <
> https://builds.apache.org/job/HBase-TRUNK/6878/artifact/hbase-client/target/findbugsXml.xml>
> with 12 unique warnings and 0 duplicates.
> [FINDBUGS] Successfully parsed file <
> https://builds.apache.org/job/HBase-TRUNK/6878/artifact/hbase-common/target/findbugs.xml>
> with 12 unique warnings and 0 duplicates.
> [FINDBUGS] Successfully parsed file <
> https://builds.apache.org/job/HBase-TRUNK/6878/artifact/hbase-common/target/findbugsXml.xml>
> with 20 unique warnings and 0 duplicates.
> [FINDBUGS] Successfully parsed file <
> https://builds.apache.org/job/HBase-TRUNK/6878/artifact/hbase-examples/target/findbugs.xml>
> with 20 unique warnings and 0 duplicates.
> [FINDBUGS] Successfully parsed file <
> https://builds.apache.org/job/HBase-TRUNK/6878/artifact/hbase-examples/target/findbugsXml.xml>
> with 20 unique warnings and 0 duplicates.
> [FINDBUGS] Successfully parsed file <
> https://builds.apache.org/job/HBase-TRUNK/6878/artifact/hbase-external-blockcache/target/findbugs.xml>
> with 20 unique warnings and 0 duplicates.
> [FINDBUGS] Successfully parsed file <
> https://builds.apache.org/job/HBase-TRUNK/6878/artifact/hbase-external-blockcache/target/findbugsXml.xml>
> with 20 unique warnings and 0 duplicates.
> [FINDBUGS] Successfully parsed file <
> https://builds.apache.org/job/HBase-TRUNK/6878/artifact/hbase-hadoop-compat/target/findbugs.xml>
> with 20 unique warnings and 0 duplicates.
> [FINDBUGS] Successfully parsed file <
> https://builds.apache.org/job/HBase-TRUNK/6878/artifact/hbase-hadoop-compat/target/findbugsXml.xml>
> with 20 unique warnings and 0 duplicates.
> [FINDBUGS] Successfully parsed file <
> https://builds.apache.org/job/HBase-TRUNK/6878/artifact/hbase-hadoop2-compat/target/findbugs.xml>
> with 20 unique warnings and 0 duplicates.
> [FINDBUGS] Successfully parsed file <
> https://builds.apache.org/job/HBase-TRUNK/6878/artifact/hbase-hadoop2-compat/target/findbugsXml.xml>
> with 20 unique warnings and 0 duplicates.
> [FINDBUGS] Successfully parsed file <
> https://builds.apache.org/job/HBase-TRUNK/6878/artifact/hbase-prefix-tree/target/findbugs.xml>
> with 20 unique warnings and 0 duplicates.
> [FINDBUGS] Successfully parsed file <
> https://builds.apache.org/job/HBase-TRUNK/6878/artifact/hbase-prefix-tree/target/findbugsXml.xml>
> with 21 unique warnings and 0 duplicates.
> [FINDBUGS] Successfully parsed file <
> https://builds.apache.org/job/HBase-TRUNK/6878/artifact/hbase-procedure/target/findbugs.xml>
> with 21 unique warnings and 0 duplicates.
> [FINDBUGS] Successfully parsed file <
> https://builds.apache.org/job/HBase-TRUNK/6878/artifact/hbase-procedure/target/findbugsXml.xml>
> with 22 unique warnings and 0 duplicates.
> [FINDBUGS] Successfully parsed file <
> https://builds.apache.org/job/HBase-TRUNK/6878/artifact/hbase-protocol/target/findbugs.xml>
> with 22 unique warnings and 0 duplicates.
> [FINDBUGS] Successfully parsed file <
> https://builds.apache.org/job/HBase-TRUNK/6878/artifact/hbase-protocol/target/findbugsXml.xml>
> with 22 unique warnings and 0 duplicates.
> [FINDBUGS] Successfully parsed file <
> https://builds.apache.org/job/HBase-TRUNK/6878/artifact/hbase-rest/target/findbugs.xml>
> with 22 unique warnings and 0 duplicates.
> [FINDBUGS] Successfully parsed file <
> https://builds.apache.org/job/HBase-TRUNK/6878/artifact/hbase-rest/target/findbugsXml.xml>
> with 24 unique warnings and 0 duplicates.
> [FINDBUGS] Successfully parsed file <
> https://builds.apache.org/job/HBase-TRUNK/6878/artifact/hbase-server/target/findbugs.xml>
> with 24 unique warnings and 0 duplicates.
> [FINDBUGS] Successfully parsed file <
> https://builds.apache.org/job/HBase-TRUNK/6878/artifact/hbase-server/target/findbugsXml.xml>
> with 100 unique warnings and 1 duplicate.
> [FINDBUGS] Successfully parsed file <
> https://builds.apache.org/job/HBase-TRUNK/6878/artifact/hbase-spark/target/findbugs.xml>
> with 100 unique warnings and 0 duplicates.
> [FINDBUGS] Successfully parsed file <
> https://builds.apache.org/job/HBase-TRUNK/6878/artifact/hbase-spark/target/findbugsXml.xml>
> with 131 unique warnings and 0 duplicates.
> [FINDBUGS] Successfully parsed file <
> https://builds.apache.org/job/HBase-TRUNK/6878/artifact/hbase-thrift/target/findbugs.xml>
> with 131 unique warnings and 0 duplicates.
> [FINDBUGS] Successfully parsed file <
> https://builds.apache.org/job/HBase-TRUNK/6878/artifact/hbase-thrift/target/findbugsXml.xml>
> with 131 unique warnings and 0 duplicates.
> [FINDBUGS] Computing warning deltas based on reference build #6751
> [CHECKSTYLE] Collecting checkstyle analysis files...
> [CHECKSTYLE] Finding all files that match the pattern
> **/checkstyle-result.xml
> [CHECKSTYLE] Parsing 24 files in <
> https://builds.apache.org/job/HBase-TRUNK/ws/>
> [CHECKSTYLE] Successfully parsed file <
> https://builds.apache.org/job/HBase-TRUNK/6878/artifact/hbase-annotations/target/checkstyle-result.xml>
> with 0 unique warnings and 0 duplicates.
> [CHECKSTYLE] Successfully parsed file <
> https://builds.apache.org/job/HBase-TRUNK/6878/artifact/hbase-assembly/target/checkstyle-result.xml>
> with 0 unique warnings and 0 duplicates.
> [CHECKSTYLE] Successfully parsed file <
> https://builds.apache.org/job/HBase-TRUNK/6878/artifact/hbase-checkstyle/target/checkstyle-result.xml>
> with 0 unique warnings and 0 duplicates.
> [CHECKSTYLE] Successfully parsed file <
> https://builds.apache.org/job/HBase-TRUNK/6878/artifact/hbase-client/target/checkstyle-result.xml>
> with 202 unique warnings and 0 duplicates.
> [CHECKSTYLE] Successfully parsed file <
> https://builds.apache.org/job/HBase-TRUNK/6878/artifact/hbase-common/target/checkstyle-result.xml>
> with 303 unique warnings and 0 duplicates.
> [CHECKSTYLE] Successfully parsed file <
> https://builds.apache.org/job/HBase-TRUNK/6878/artifact/hbase-examples/target/checkstyle-result.xml>
> with 331 unique warnings and 0 duplicates.
> [CHECKSTYLE] Successfully parsed file <
> https://builds.apache.org/job/HBase-TRUNK/6878/artifact/hbase-external-blockcache/target/checkstyle-result.xml>
> with 331 unique warnings and 0 duplicates.
> [CHECKSTYLE] Successfully parsed file <
> https://builds.apache.org/job/HBase-TRUNK/6878/artifact/hbase-hadoop-compat/target/checkstyle-result.xml>
> with 333 unique warnings and 0 duplicates.
> [CHECKSTYLE] Successfully parsed file <
> https://builds.apache.org/job/HBase-TRUNK/6878/artifact/hbase-hadoop2-compat/target/checkstyle-result.xml>
> with 364 unique warnings and 0 duplicates.
> [CHECKSTYLE] Successfully parsed file <
> https://builds.apache.org/job/HBase-TRUNK/6878/artifact/hbase-it/target/checkstyle-result.xml>
> with 364 unique warnings and 0 duplicates.
> [CHECKSTYLE] Successfully parsed file <
> https://builds.apache.org/job/HBase-TRUNK/6878/artifact/hbase-prefix-tree/target/checkstyle-result.xml>
> with 380 unique warnings and 0 duplicates.
> [CHECKSTYLE] Successfully parsed file <
> https://builds.apache.org/job/HBase-TRUNK/6878/artifact/hbase-procedure/target/checkstyle-result.xml>
> with 380 unique warnings and 0 duplicates.
> [CHECKSTYLE] Successfully parsed file <
> https://builds.apache.org/job/HBase-TRUNK/6878/artifact/hbase-protocol/target/checkstyle-result.xml>
> with 382 unique warnings and 0 duplicates.
> [CHECKSTYLE] Successfully parsed file <
> https://builds.apache.org/job/HBase-TRUNK/6878/artifact/hbase-resource-bundle/target/checkstyle-result.xml>
> with 382 unique warnings and 0 duplicates.
> [CHECKSTYLE] Successfully parsed file <
> https://builds.apache.org/job/HBase-TRUNK/6878/artifact/hbase-rest/target/checkstyle-result.xml>
> with 424 unique warnings and 0 duplicates.
> [CHECKSTYLE] Successfully parsed file <
> https://builds.apache.org/job/HBase-TRUNK/6878/artifact/hbase-server/target/checkstyle-result.xml>
> with 1752 unique warnings and 0 duplicates.
> [CHECKSTYLE] Successfully parsed file <
> https://builds.apache.org/job/HBase-TRUNK/6878/artifact/hbase-shaded/hbase-shaded-client/target/checkstyle-result.xml>
> with 1752 unique warnings and 0 duplicates.
> [CHECKSTYLE] Successfully parsed file <
> https://builds.apache.org/job/HBase-TRUNK/6878/artifact/hbase-shaded/hbase-shaded-server/target/checkstyle-result.xml>
> with 1752 unique warnings and 0 duplicates.
> [CHECKSTYLE] Successfully parsed file <
> https://builds.apache.org/job/HBase-TRUNK/6878/artifact/hbase-shaded/target/checkstyle-result.xml>
> with 1752 unique warnings and 0 duplicates.
> [CHECKSTYLE] Successfully parsed file <
> https://builds.apache.org/job/HBase-TRUNK/6878/artifact/hbase-shell/target/checkstyle-result.xml>
> with 1752 unique warnings and 0 duplicates.
> [CHECKSTYLE] Successfully parsed file <
> https://builds.apache.org/job/HBase-TRUNK/6878/artifact/hbase-spark/target/checkstyle-result.xml>
> with 1752 unique warnings and 0 duplicates.
> [CHECKSTYLE] Successfully parsed file <
> https://builds.apache.org/job/HBase-TRUNK/6878/artifact/hbase-testing-util/target/checkstyle-result.xml>
> with 1752 unique warnings and 0 duplicates.
> [CHECKSTYLE] Successfully parsed file <
> https://builds.apache.org/job/HBase-TRUNK/6878/artifact/hbase-thrift/target/checkstyle-result.xml>
> with 1774 unique warnings and 0 duplicates.
> [CHECKSTYLE] Successfully parsed file <
> https://builds.apache.org/job/HBase-TRUNK/6878/artifact/target/checkstyle-result.xml>
> with 1774 unique warnings and 0 duplicates.
> [CHECKSTYLE] Computing warning deltas based on reference build #6751
> Updating HBASE-14561
>

Mime
  • Unnamed multipart/alternative (inline, None, 0 bytes)
View raw message