hbase-builds mailing list archives

Site index · List index
Message view « Date » · « Thread »
Top « Date » · « Thread »
From Stack <st...@duboce.net>
Subject Re: Build failed in Jenkins: HBase-1.3 » latest1.8,Hadoop #265
Date Wed, 14 Oct 2015 21:38:43 GMT
These are hard to debug:

[ERROR] Failed to execute goal
org.apache.maven.plugins:maven-surefire-plugin:2.18.1:test
(default-test) on project hbase-server: ExecutionException:
java.lang.RuntimeException: The forked VM terminated without properly
saying goodbye. VM crash or System.exit called?


St.Ack


On Wed, Oct 14, 2015 at 2:21 PM, Apache Jenkins Server <
jenkins@builds.apache.org> wrote:

> See <
> https://builds.apache.org/job/HBase-1.3/jdk=latest1.8,label=Hadoop/265/changes
> >
>
> Changes:
>
> [stack] HBASE-14598 ByteBufferOutputStream grows its HeapByteBuffer beyond
> JVM
>
> ------------------------------------------
> [...truncated 44907 lines...]
> Running org.apache.hadoop.hbase.ipc.TestRpcClientLeaks
> Tests run: 1, Failures: 0, Errors: 0, Skipped: 0, Time elapsed: 14.708 sec
> - in org.apache.hadoop.hbase.ipc.TestRpcClientLeaks
> Java HotSpot(TM) 64-Bit Server VM warning: ignoring option
> MaxPermSize=256m; support was removed in 8.0
> Running org.apache.hadoop.hbase.ipc.TestGlobalEventLoopGroup
> Tests run: 1, Failures: 0, Errors: 0, Skipped: 0, Time elapsed: 0.89 sec -
> in org.apache.hadoop.hbase.ipc.TestGlobalEventLoopGroup
> Java HotSpot(TM) 64-Bit Server VM warning: ignoring option
> MaxPermSize=256m; support was removed in 8.0
> Running org.apache.hadoop.hbase.ipc.TestAsyncIPC
> Tests run: 24, Failures: 0, Errors: 0, Skipped: 0, Time elapsed: 5.36 sec
> - in org.apache.hadoop.hbase.ipc.TestAsyncIPC
> Java HotSpot(TM) 64-Bit Server VM warning: ignoring option
> MaxPermSize=256m; support was removed in 8.0
> Running org.apache.hadoop.hbase.ipc.TestRpcMetrics
> Tests run: 3, Failures: 0, Errors: 0, Skipped: 0, Time elapsed: 0.807 sec
> - in org.apache.hadoop.hbase.ipc.TestRpcMetrics
> Java HotSpot(TM) 64-Bit Server VM warning: ignoring option
> MaxPermSize=256m; support was removed in 8.0
> Java HotSpot(TM) 64-Bit Server VM warning: ignoring option
> MaxPermSize=256m; support was removed in 8.0
> Java HotSpot(TM) 64-Bit Server VM warning: ignoring option
> MaxPermSize=256m; support was removed in 8.0
> Java HotSpot(TM) 64-Bit Server VM warning: ignoring option
> MaxPermSize=256m; support was removed in 8.0
> Java HotSpot(TM) 64-Bit Server VM warning: ignoring option
> MaxPermSize=256m; support was removed in 8.0
> Java HotSpot(TM) 64-Bit Server VM warning: ignoring option
> MaxPermSize=256m; support was removed in 8.0
> Java HotSpot(TM) 64-Bit Server VM warning: ignoring option
> MaxPermSize=256m; support was removed in 8.0
> Java HotSpot(TM) 64-Bit Server VM warning: ignoring option
> MaxPermSize=256m; support was removed in 8.0
> Java HotSpot(TM) 64-Bit Server VM warning: ignoring option
> MaxPermSize=256m; support was removed in 8.0
> Java HotSpot(TM) 64-Bit Server VM warning: ignoring option
> MaxPermSize=256m; support was removed in 8.0
> Running org.apache.hadoop.hbase.zookeeper.TestZKConfig
> Tests run: 1, Failures: 0, Errors: 0, Skipped: 0, Time elapsed: 0.662 sec
> - in org.apache.hadoop.hbase.zookeeper.TestZKConfig
> Java HotSpot(TM) 64-Bit Server VM warning: ignoring option
> MaxPermSize=256m; support was removed in 8.0
> Java HotSpot(TM) 64-Bit Server VM warning: ignoring option
> MaxPermSize=256m; support was removed in 8.0
> Java HotSpot(TM) 64-Bit Server VM warning: ignoring option
> MaxPermSize=256m; support was removed in 8.0
> Running org.apache.hadoop.hbase.zookeeper.TestZooKeeperMainServer
> Tests run: 2, Failures: 0, Errors: 0, Skipped: 0, Time elapsed: 1.413 sec
> - in org.apache.hadoop.hbase.zookeeper.TestZooKeeperMainServer
> Java HotSpot(TM) 64-Bit Server VM warning: ignoring option
> MaxPermSize=256m; support was removed in 8.0
> Java HotSpot(TM) 64-Bit Server VM warning: ignoring option
> MaxPermSize=256m; support was removed in 8.0
> Java HotSpot(TM) 64-Bit Server VM warning: ignoring option
> MaxPermSize=256m; support was removed in 8.0
> Java HotSpot(TM) 64-Bit Server VM warning: ignoring option
> MaxPermSize=256m; support was removed in 8.0
> Java HotSpot(TM) 64-Bit Server VM warning: ignoring option
> MaxPermSize=256m; support was removed in 8.0
> Java HotSpot(TM) 64-Bit Server VM warning: ignoring option
> MaxPermSize=256m; support was removed in 8.0
> Java HotSpot(TM) 64-Bit Server VM warning: ignoring option
> MaxPermSize=256m; support was removed in 8.0
> Running
> org.apache.hadoop.hbase.replication.regionserver.TestReplicationThrottler
> Tests run: 1, Failures: 0, Errors: 0, Skipped: 0, Time elapsed: 0.325 sec
> - in
> org.apache.hadoop.hbase.replication.regionserver.TestReplicationThrottler
> Java HotSpot(TM) 64-Bit Server VM warning: ignoring option
> MaxPermSize=256m; support was removed in 8.0
> Java HotSpot(TM) 64-Bit Server VM warning: ignoring option
> MaxPermSize=256m; support was removed in 8.0
> Java HotSpot(TM) 64-Bit Server VM warning: ignoring option
> MaxPermSize=256m; support was removed in 8.0
> Java HotSpot(TM) 64-Bit Server VM warning: ignoring option
> MaxPermSize=256m; support was removed in 8.0
> Java HotSpot(TM) 64-Bit Server VM warning: ignoring option
> MaxPermSize=256m; support was removed in 8.0
> Running
> org.apache.hadoop.hbase.replication.regionserver.TestReplicationSinkManager
> Tests run: 5, Failures: 0, Errors: 0, Skipped: 0, Time elapsed: 1.138 sec
> - in
> org.apache.hadoop.hbase.replication.regionserver.TestReplicationSinkManager
> Java HotSpot(TM) 64-Bit Server VM warning: ignoring option
> MaxPermSize=256m; support was removed in 8.0
> Java HotSpot(TM) 64-Bit Server VM warning: ignoring option
> MaxPermSize=256m; support was removed in 8.0
> Java HotSpot(TM) 64-Bit Server VM warning: ignoring option
> MaxPermSize=256m; support was removed in 8.0
> Java HotSpot(TM) 64-Bit Server VM warning: ignoring option
> MaxPermSize=256m; support was removed in 8.0
> Java HotSpot(TM) 64-Bit Server VM warning: ignoring option
> MaxPermSize=256m; support was removed in 8.0
> Java HotSpot(TM) 64-Bit Server VM warning: ignoring option
> MaxPermSize=256m; support was removed in 8.0
> Java HotSpot(TM) 64-Bit Server VM warning: ignoring option
> MaxPermSize=256m; support was removed in 8.0
> Java HotSpot(TM) 64-Bit Server VM warning: ignoring option
> MaxPermSize=256m; support was removed in 8.0
> Java HotSpot(TM) 64-Bit Server VM warning: ignoring option
> MaxPermSize=256m; support was removed in 8.0
> Java HotSpot(TM) 64-Bit Server VM warning: ignoring option
> MaxPermSize=256m; support was removed in 8.0
> Java HotSpot(TM) 64-Bit Server VM warning: ignoring option
> MaxPermSize=256m; support was removed in 8.0
> Java HotSpot(TM) 64-Bit Server VM warning: ignoring option
> MaxPermSize=256m; support was removed in 8.0
> Java HotSpot(TM) 64-Bit Server VM warning: ignoring option
> MaxPermSize=256m; support was removed in 8.0
> Java HotSpot(TM) 64-Bit Server VM warning: ignoring option
> MaxPermSize=256m; support was removed in 8.0
> Java HotSpot(TM) 64-Bit Server VM warning: ignoring option
> MaxPermSize=256m; support was removed in 8.0
> Java HotSpot(TM) 64-Bit Server VM warning: ignoring option
> MaxPermSize=256m; support was removed in 8.0
> Java HotSpot(TM) 64-Bit Server VM warning: ignoring option
> MaxPermSize=256m; support was removed in 8.0
> Running org.apache.hadoop.hbase.replication.TestReplicationWALEntryFilters
> Tests run: 4, Failures: 0, Errors: 0, Skipped: 0, Time elapsed: 0.852 sec
> - in org.apache.hadoop.hbase.replication.TestReplicationWALEntryFilters
> Java HotSpot(TM) 64-Bit Server VM warning: ignoring option
> MaxPermSize=256m; support was removed in 8.0
> Java HotSpot(TM) 64-Bit Server VM warning: ignoring option
> MaxPermSize=256m; support was removed in 8.0
> Java HotSpot(TM) 64-Bit Server VM warning: ignoring option
> MaxPermSize=256m; support was removed in 8.0
> Running
> org.apache.hadoop.hbase.monitoring.TestMemoryBoundedLogMessageBuffer
> Tests run: 2, Failures: 0, Errors: 0, Skipped: 0, Time elapsed: 0.613 sec
> - in org.apache.hadoop.hbase.monitoring.TestMemoryBoundedLogMessageBuffer
> Java HotSpot(TM) 64-Bit Server VM warning: ignoring option
> MaxPermSize=256m; support was removed in 8.0
> Running org.apache.hadoop.hbase.monitoring.TestTaskMonitor
> Tests run: 3, Failures: 0, Errors: 0, Skipped: 0, Time elapsed: 1.02 sec -
> in org.apache.hadoop.hbase.monitoring.TestTaskMonitor
> Java HotSpot(TM) 64-Bit Server VM warning: ignoring option
> MaxPermSize=256m; support was removed in 8.0
> Java HotSpot(TM) 64-Bit Server VM warning: ignoring option
> MaxPermSize=256m; support was removed in 8.0
> Running
> org.apache.hadoop.hbase.errorhandling.TestForeignExceptionSerialization
> Tests run: 2, Failures: 0, Errors: 0, Skipped: 0, Time elapsed: 0.651 sec
> - in org.apache.hadoop.hbase.errorhandling.TestForeignExceptionSerialization
> Java HotSpot(TM) 64-Bit Server VM warning: ignoring option
> MaxPermSize=256m; support was removed in 8.0
> Running
> org.apache.hadoop.hbase.errorhandling.TestForeignExceptionDispatcher
> Tests run: 3, Failures: 0, Errors: 0, Skipped: 0, Time elapsed: 0.868 sec
> - in org.apache.hadoop.hbase.errorhandling.TestForeignExceptionDispatcher
> Java HotSpot(TM) 64-Bit Server VM warning: ignoring option
> MaxPermSize=256m; support was removed in 8.0
> Running org.apache.hadoop.hbase.errorhandling.TestTimeoutExceptionInjector
> Tests run: 4, Failures: 0, Errors: 0, Skipped: 0, Time elapsed: 0.83 sec -
> in org.apache.hadoop.hbase.errorhandling.TestTimeoutExceptionInjector
> Java HotSpot(TM) 64-Bit Server VM warning: ignoring option
> MaxPermSize=256m; support was removed in 8.0
> Running org.apache.hadoop.hbase.TestCompare
> Tests run: 1, Failures: 0, Errors: 0, Skipped: 0, Time elapsed: 0.715 sec
> - in org.apache.hadoop.hbase.TestCompare
> Java HotSpot(TM) 64-Bit Server VM warning: ignoring option
> MaxPermSize=256m; support was removed in 8.0
> Java HotSpot(TM) 64-Bit Server VM warning: ignoring option
> MaxPermSize=256m; support was removed in 8.0
> Java HotSpot(TM) 64-Bit Server VM warning: ignoring option
> MaxPermSize=256m; support was removed in 8.0
> Running org.apache.hadoop.hbase.http.TestGlobalFilter
> Tests run: 1, Failures: 0, Errors: 0, Skipped: 0, Time elapsed: 1.229 sec
> - in org.apache.hadoop.hbase.http.TestGlobalFilter
> Java HotSpot(TM) 64-Bit Server VM warning: ignoring option
> MaxPermSize=256m; support was removed in 8.0
> Running org.apache.hadoop.hbase.http.TestPathFilter
> Tests run: 1, Failures: 0, Errors: 0, Skipped: 0, Time elapsed: 1.332 sec
> - in org.apache.hadoop.hbase.http.TestPathFilter
> Java HotSpot(TM) 64-Bit Server VM warning: ignoring option
> MaxPermSize=256m; support was removed in 8.0
> Running org.apache.hadoop.hbase.http.TestHttpRequestLogAppender
> Tests run: 1, Failures: 0, Errors: 0, Skipped: 0, Time elapsed: 0.463 sec
> - in org.apache.hadoop.hbase.http.TestHttpRequestLogAppender
> Java HotSpot(TM) 64-Bit Server VM warning: ignoring option
> MaxPermSize=256m; support was removed in 8.0
> Running org.apache.hadoop.hbase.http.TestHtmlQuoting
> Tests run: 4, Failures: 0, Errors: 0, Skipped: 0, Time elapsed: 0.974 sec
> - in org.apache.hadoop.hbase.http.TestHtmlQuoting
> Java HotSpot(TM) 64-Bit Server VM warning: ignoring option
> MaxPermSize=256m; support was removed in 8.0
> Running org.apache.hadoop.hbase.http.log.TestLogLevel
> Tests run: 1, Failures: 0, Errors: 0, Skipped: 0, Time elapsed: 1.213 sec
> - in org.apache.hadoop.hbase.http.log.TestLogLevel
> Java HotSpot(TM) 64-Bit Server VM warning: ignoring option
> MaxPermSize=256m; support was removed in 8.0
> Running org.apache.hadoop.hbase.http.conf.TestConfServlet
> Tests run: 3, Failures: 0, Errors: 0, Skipped: 0, Time elapsed: 0.856 sec
> - in org.apache.hadoop.hbase.http.conf.TestConfServlet
> Java HotSpot(TM) 64-Bit Server VM warning: ignoring option
> MaxPermSize=256m; support was removed in 8.0
> Running org.apache.hadoop.hbase.http.TestHttpRequestLog
> Tests run: 2, Failures: 0, Errors: 0, Skipped: 0, Time elapsed: 0.639 sec
> - in org.apache.hadoop.hbase.http.TestHttpRequestLog
> Java HotSpot(TM) 64-Bit Server VM warning: ignoring option
> MaxPermSize=256m; support was removed in 8.0
> Running org.apache.hadoop.hbase.http.TestHttpServerWebapps
> Tests run: 2, Failures: 0, Errors: 0, Skipped: 0, Time elapsed: 0.712 sec
> - in org.apache.hadoop.hbase.http.TestHttpServerWebapps
> Java HotSpot(TM) 64-Bit Server VM warning: ignoring option
> MaxPermSize=256m; support was removed in 8.0
> Running org.apache.hadoop.hbase.http.TestHttpServerLifecycle
> Tests run: 6, Failures: 0, Errors: 0, Skipped: 6, Time elapsed: 0.002 sec
> - in org.apache.hadoop.hbase.http.TestHttpServerLifecycle
> Java HotSpot(TM) 64-Bit Server VM warning: ignoring option
> MaxPermSize=256m; support was removed in 8.0
> Running org.apache.hadoop.hbase.http.TestHttpServer
> Tests run: 16, Failures: 0, Errors: 0, Skipped: 3, Time elapsed: 3.972 sec
> - in org.apache.hadoop.hbase.http.TestHttpServer
> Java HotSpot(TM) 64-Bit Server VM warning: ignoring option
> MaxPermSize=256m; support was removed in 8.0
> Running org.apache.hadoop.hbase.http.lib.TestStaticUserWebFilter
> Tests run: 3, Failures: 0, Errors: 0, Skipped: 0, Time elapsed: 1.175 sec
> - in org.apache.hadoop.hbase.http.lib.TestStaticUserWebFilter
> Java HotSpot(TM) 64-Bit Server VM warning: ignoring option
> MaxPermSize=256m; support was removed in 8.0
> Running org.apache.hadoop.hbase.http.jmx.TestJMXJsonServlet
> Tests run: 1, Failures: 0, Errors: 0, Skipped: 0, Time elapsed: 0.593 sec
> - in org.apache.hadoop.hbase.http.jmx.TestJMXJsonServlet
> Java HotSpot(TM) 64-Bit Server VM warning: ignoring option
> MaxPermSize=256m; support was removed in 8.0
> Running org.apache.hadoop.hbase.http.TestServletFilter
> Tests run: 3, Failures: 0, Errors: 0, Skipped: 1, Time elapsed: 1.333 sec
> - in org.apache.hadoop.hbase.http.TestServletFilter
> Java HotSpot(TM) 64-Bit Server VM warning: ignoring option
> MaxPermSize=256m; support was removed in 8.0
> Running org.apache.hadoop.hbase.http.TestSSLHttpServer
> Tests run: 1, Failures: 0, Errors: 0, Skipped: 0, Time elapsed: 0.54 sec -
> in org.apache.hadoop.hbase.http.TestSSLHttpServer
> Java HotSpot(TM) 64-Bit Server VM warning: ignoring option
> MaxPermSize=256m; support was removed in 8.0
> Java HotSpot(TM) 64-Bit Server VM warning: ignoring option
> MaxPermSize=256m; support was removed in 8.0
> Java HotSpot(TM) 64-Bit Server VM warning: ignoring option
> MaxPermSize=256m; support was removed in 8.0
> Java HotSpot(TM) 64-Bit Server VM warning: ignoring option
> MaxPermSize=256m; support was removed in 8.0
> Running org.apache.hadoop.hbase.TestServerName
> Tests run: 7, Failures: 0, Errors: 0, Skipped: 0, Time elapsed: 0.811 sec
> - in org.apache.hadoop.hbase.TestServerName
> Java HotSpot(TM) 64-Bit Server VM warning: ignoring option
> MaxPermSize=256m; support was removed in 8.0
> Java HotSpot(TM) 64-Bit Server VM warning: ignoring option
> MaxPermSize=256m; support was removed in 8.0
> Running org.apache.hadoop.hbase.mapred.TestRowCounter
> Tests run: 4, Failures: 0, Errors: 0, Skipped: 0, Time elapsed: 4.468 sec
> - in org.apache.hadoop.hbase.mapred.TestRowCounter
> Java HotSpot(TM) 64-Bit Server VM warning: ignoring option
> MaxPermSize=256m; support was removed in 8.0
> Java HotSpot(TM) 64-Bit Server VM warning: ignoring option
> MaxPermSize=256m; support was removed in 8.0
> Running org.apache.hadoop.hbase.mapred.TestDriver
> Tests run: 1, Failures: 0, Errors: 0, Skipped: 0, Time elapsed: 0.771 sec
> - in org.apache.hadoop.hbase.mapred.TestDriver
> Java HotSpot(TM) 64-Bit Server VM warning: ignoring option
> MaxPermSize=256m; support was removed in 8.0
> Running org.apache.hadoop.hbase.mapred.TestSplitTable
> Tests run: 3, Failures: 0, Errors: 0, Skipped: 0, Time elapsed: 0.696 sec
> - in org.apache.hadoop.hbase.mapred.TestSplitTable
> Java HotSpot(TM) 64-Bit Server VM warning: ignoring option
> MaxPermSize=256m; support was removed in 8.0
> Java HotSpot(TM) 64-Bit Server VM warning: ignoring option
> MaxPermSize=256m; support was removed in 8.0
> Java HotSpot(TM) 64-Bit Server VM warning: ignoring option
> MaxPermSize=256m; support was removed in 8.0
> Running org.apache.hadoop.hbase.mapred.TestIdentityTableMap
> Tests run: 1, Failures: 0, Errors: 0, Skipped: 0, Time elapsed: 1.018 sec
> - in org.apache.hadoop.hbase.mapred.TestIdentityTableMap
> Java HotSpot(TM) 64-Bit Server VM warning: ignoring option
> MaxPermSize=256m; support was removed in 8.0
> Running org.apache.hadoop.hbase.mapred.TestGroupingTableMap
> Tests run: 4, Failures: 0, Errors: 0, Skipped: 0, Time elapsed: 1.299 sec
> - in org.apache.hadoop.hbase.mapred.TestGroupingTableMap
> Java HotSpot(TM) 64-Bit Server VM warning: ignoring option
> MaxPermSize=256m; support was removed in 8.0
> Java HotSpot(TM) 64-Bit Server VM warning: ignoring option
> MaxPermSize=256m; support was removed in 8.0
> Java HotSpot(TM) 64-Bit Server VM warning: ignoring option
> MaxPermSize=256m; support was removed in 8.0
>
> Results :
>
> Tests run: 977, Failures: 0, Errors: 0, Skipped: 20
>
> [INFO]
> ------------------------------------------------------------------------
> [INFO] Reactor Summary:
> [INFO]
> [INFO] Apache HBase ...................................... SUCCESS
> [1:17.523s]
> [INFO] Apache HBase - Checkstyle ......................... SUCCESS [7.824s]
> [INFO] Apache HBase - Resource Bundle .................... SUCCESS [0.278s]
> [INFO] Apache HBase - Annotations ........................ SUCCESS [1.645s]
> [INFO] Apache HBase - Protocol ........................... SUCCESS
> [23.331s]
> [INFO] Apache HBase - Common ............................. SUCCESS
> [2:36.865s]
> [INFO] Apache HBase - Procedure .......................... SUCCESS
> [2:06.540s]
> [INFO] Apache HBase - Client ............................. SUCCESS
> [1:34.481s]
> [INFO] Apache HBase - Hadoop Compatibility ............... SUCCESS
> [10.650s]
> [INFO] Apache HBase - Hadoop Two Compatibility ........... SUCCESS
> [12.112s]
> [INFO] Apache HBase - Prefix Tree ........................ SUCCESS
> [11.130s]
> [INFO] Apache HBase - Server ............................. FAILURE
> [18:27.935s]
> [INFO] Apache HBase - Testing Util ....................... SKIPPED
> [INFO] Apache HBase - Thrift ............................. SKIPPED
> [INFO] Apache HBase - Rest ............................... SKIPPED
> [INFO] Apache HBase - Shell .............................. SKIPPED
> [INFO] Apache HBase - Integration Tests .................. SKIPPED
> [INFO] Apache HBase - Examples ........................... SKIPPED
> [INFO] Apache HBase - External Block Cache ............... SKIPPED
> [INFO] Apache HBase - Assembly ........................... SKIPPED
> [INFO] Apache HBase - Shaded ............................. SKIPPED
> [INFO] Apache HBase - Shaded - Client .................... SKIPPED
> [INFO] Apache HBase - Shaded - Server .................... SKIPPED
> [INFO]
> ------------------------------------------------------------------------
> [INFO] BUILD FAILURE
> [INFO]
> ------------------------------------------------------------------------
> [INFO] Total time: 27:38.836s
> [INFO] Finished at: Wed Oct 14 21:21:36 UTC 2015
> [INFO] Final Memory: 97M/922M
> [INFO]
> ------------------------------------------------------------------------
> [ERROR] Failed to execute goal
> org.apache.maven.plugins:maven-surefire-plugin:2.18.1:test (default-test)
> on project hbase-server: ExecutionException: java.lang.RuntimeException:
> The forked VM terminated without properly saying goodbye. VM crash or
> System.exit called?
> [ERROR] Command was /bin/sh -c cd <
> https://builds.apache.org/job/HBase-1.3/jdk=latest1.8,label=Hadoop/ws/hbase-server>
> &&
> /home/jenkins/jenkins-slave/tools/hudson.model.JDK/latest1.8/jre/bin/java
> -enableassertions -Dhbase.test -Xmx2800m -XX:MaxPermSize=256m
> -Djava.security.egd=file:/dev/./urandom -Djava.net.preferIPv4Stack=true
> -Djava.awt.headless=true -jar <
> https://builds.apache.org/job/HBase-1.3/jdk=latest1.8,label=Hadoop/ws/hbase-server/target/surefire/surefirebooter4338071069363431900.jar>
> <
> https://builds.apache.org/job/HBase-1.3/jdk=latest1.8,label=Hadoop/ws/hbase-server/target/surefire/surefire956974863575589071tmp>
> <
> https://builds.apache.org/job/HBase-1.3/jdk=latest1.8,label=Hadoop/ws/hbase-server/target/surefire/surefire_366633724041720645086tmp
> >
> [ERROR] -> [Help 1]
> [ERROR]
> [ERROR] To see the full stack trace of the errors, re-run Maven with the
> -e switch.
> [ERROR] Re-run Maven using the -X switch to enable full debug logging.
> [ERROR]
> [ERROR] For more information about the errors and possible solutions,
> please read the following articles:
> [ERROR] [Help 1]
> http://cwiki.apache.org/confluence/display/MAVEN/MojoFailureException
> [ERROR]
> [ERROR] After correcting the problems, you can resume the build with the
> command
> [ERROR]   mvn <goals> -rf :hbase-server
> Build step 'Invoke top-level Maven targets' marked build as failure
> Performing Post build task...
> Match found for :.* : True
> Logical operation result is TRUE
> Running script  :     ZOMBIE_TESTS_COUNT=`jps -v | grep surefirebooter |
> grep '-Dhbase.test' | wc -l`
>   if [[ $ZOMBIE_TESTS_COUNT != 0 ]] ; then
>     #It seems sometimes the tests are not dying immediately. Let's give
> them 30s
>     echo "Suspicious java process found - waiting 30s to see if there are
> just slow to stop"
>     sleep 30
>     ZOMBIE_TESTS_COUNT=`jps -v | grep surefirebooter | grep '-Dhbase.test'
> | wc -l`
>     if [[ $ZOMBIE_TESTS_COUNT != 0 ]] ; then
>       echo "There are $ZOMBIE_TESTS_COUNT zombie tests, they should have
> been killed by surefire but survived"
>       echo "************ zombies jps listing"
>       jps -v
>       jps -v | grep surefirebooter | grep '-Dhbase.test'
>       echo "************ BEGIN zombies jstack extract"
>       # HBase tests have been flagged with an innocuous '-Dhbase.test'
> just so they can
>       # be identified as hbase in a process listing.
>       ZB_STACK=`jps -v | grep surefirebooter | grep '-Dhbase.test' | cut
> -d ' ' -f 1 | xargs -n 1 jstack | grep ".test" | grep "\.java"`
>       jps -v | grep surefirebooter | grep '-Dhbase.test' | cut -d ' ' -f 1
> | xargs -n 1 jstack
>       echo "************ END  zombies jstack extract"
>       JIRA_COMMENT="$JIRA_COMMENT
>
>      {color:red}-1 core zombie tests{color}.  There are
> ${ZOMBIE_TESTS_COUNT} zombie test(s): ${ZB_STACK}"
>       BAD=1
>       # Killing these zombies
>       echo 'Killing ZOMBIES!!!'
>       jps -v
>       jps -v | grep surefirebooter | grep '-Dhbase.test' | cut -d ' ' -f 1
> | xargs kill -9
>     else
>       echo "We're ok: there is no zombie test, but some tests took some
> time to stop"
>     fi
> [Hadoop] $ /bin/bash -xe /tmp/hudson4143164710477418315.sh
> ++ wc -l
> ++ grep -Dhbase.test
> ++ jps -v
> ++ grep surefirebooter
> grep: unknown devices method
> + ZOMBIE_TESTS_COUNT=0
> /tmp/hudson4143164710477418315.sh: line 30: syntax error: unexpected end
> of file
> POST BUILD TASK : FAILURE
> END OF POST BUILD TASK : 0
> Archiving artifacts
>

Mime
  • Unnamed multipart/alternative (inline, None, 0 bytes)
View raw message