hbase-builds mailing list archives

Site index · List index
Message view « Date » · « Thread »
Top « Date » · « Thread »
From Apache Jenkins Server <jenk...@builds.apache.org>
Subject Build failed in Jenkins: HBase-TRUNK #6952
Date Sat, 24 Oct 2015 19:32:18 GMT
See <https://builds.apache.org/job/HBase-TRUNK/6952/changes>

Changes:

[stack] Revert "HBASE-14684 Try to remove all MiniMapReduceCluster in unit

[eclark] HBASE-14683 Fix Batching in buffered mutator is awful when adding lists

------------------------------------------
[...truncated 4854 lines...]
Tests run: 1, Failures: 0, Errors: 0, Skipped: 0, Time elapsed: 83.448 sec - in org.apache.hadoop.hbase.replication.TestReplicationSyncUpTool
Running org.apache.hadoop.hbase.replication.TestReplicationWithTags
Tests run: 7, Failures: 0, Errors: 0, Skipped: 0, Time elapsed: 515.139 sec - in org.apache.hadoop.hbase.mapred.TestTableSnapshotInputFormat
Tests run: 1, Failures: 0, Errors: 0, Skipped: 0, Time elapsed: 7.09 sec - in org.apache.hadoop.hbase.replication.TestReplicationWithTags
Running org.apache.hadoop.hbase.replication.TestReplicationStateZKImpl
Running org.apache.hadoop.hbase.replication.TestReplicationKillSlaveRS
Tests run: 6, Failures: 0, Errors: 0, Skipped: 0, Time elapsed: 6.685 sec - in org.apache.hadoop.hbase.replication.TestReplicationStateZKImpl
Running org.apache.hadoop.hbase.replication.TestMasterReplication
Tests run: 1, Failures: 0, Errors: 0, Skipped: 0, Time elapsed: 107.765 sec - in org.apache.hadoop.hbase.replication.TestMultiSlaveReplication
Running org.apache.hadoop.hbase.util.TestMergeTool
Tests run: 1, Failures: 0, Errors: 0, Skipped: 0, Time elapsed: 14.896 sec - in org.apache.hadoop.hbase.replication.TestReplicationKillSlaveRS
Running org.apache.hadoop.hbase.util.TestFSTableDescriptors
Tests run: 16, Failures: 0, Errors: 0, Skipped: 0, Time elapsed: 2.591 sec - in org.apache.hadoop.hbase.util.TestFSTableDescriptors
Running org.apache.hadoop.hbase.util.TestConnectionCache
Tests run: 1, Failures: 0, Errors: 0, Skipped: 0, Time elapsed: 28.305 sec - in org.apache.hadoop.hbase.util.TestMergeTool
Running org.apache.hadoop.hbase.util.TestHBaseFsckEncryption
Running org.apache.hadoop.hbase.replication.TestReplicationSmallTests
Tests run: 1, Failures: 0, Errors: 0, Skipped: 0, Time elapsed: 28.147 sec - in org.apache.hadoop.hbase.util.TestConnectionCache
Running org.apache.hadoop.hbase.util.TestIdLock
Tests run: 8, Failures: 0, Errors: 0, Skipped: 0, Time elapsed: 378.412 sec - in org.apache.hadoop.hbase.replication.regionserver.TestReplicationWALReaderManager
Tests run: 1, Failures: 0, Errors: 0, Skipped: 0, Time elapsed: 24.569 sec - in org.apache.hadoop.hbase.util.TestHBaseFsckEncryption
Running org.apache.hadoop.hbase.util.TestMiniClusterLoadSequential
Tests run: 1, Failures: 0, Errors: 0, Skipped: 0, Time elapsed: 15.127 sec - in org.apache.hadoop.hbase.util.TestIdLock
Running org.apache.hadoop.hbase.util.TestHBaseFsckTwoRS
Running org.apache.hadoop.hbase.util.TestHBaseFsckMOB
Tests run: 10, Failures: 0, Errors: 0, Skipped: 0, Time elapsed: 97.322 sec - in org.apache.hadoop.hbase.replication.TestReplicationSmallTests
Running org.apache.hadoop.hbase.util.TestHBaseFsckOneRS
Tests run: 4, Failures: 0, Errors: 0, Skipped: 0, Time elapsed: 102.003 sec - in org.apache.hadoop.hbase.util.TestMiniClusterLoadSequential
Running org.apache.hadoop.hbase.util.TestMergeTable
Tests run: 3, Failures: 1, Errors: 0, Skipped: 0, Time elapsed: 165.074 sec <<< FAILURE!
- in org.apache.hadoop.hbase.replication.TestMasterReplication
testCyclicReplication2(org.apache.hadoop.hbase.replication.TestMasterReplication)  Time elapsed:
58.645 sec  <<< FAILURE!
java.lang.AssertionError: Waited too much time for replication. Row:row4. IsDeleteReplication:true
	at org.junit.Assert.fail(Assert.java:88)
	at org.apache.hadoop.hbase.replication.TestMasterReplication.wait(TestMasterReplication.java:386)
	at org.apache.hadoop.hbase.replication.TestMasterReplication.testCyclicReplication2(TestMasterReplication.java:204)

Running org.apache.hadoop.hbase.util.TestMiniClusterLoadParallel
Tests run: 1, Failures: 0, Errors: 0, Skipped: 0, Time elapsed: 46.337 sec - in org.apache.hadoop.hbase.util.TestMergeTable
Running org.apache.hadoop.hbase.util.TestFSUtils
Tests run: 8, Failures: 0, Errors: 0, Skipped: 1, Time elapsed: 142.102 sec - in org.apache.hadoop.hbase.util.TestHBaseFsckMOB
Running org.apache.hadoop.hbase.util.TestRegionSplitter
Tests run: 11, Failures: 0, Errors: 0, Skipped: 0, Time elapsed: 41.177 sec - in org.apache.hadoop.hbase.util.TestFSUtils
Running org.apache.hadoop.hbase.util.TestTableName
Tests run: 6, Failures: 0, Errors: 0, Skipped: 0, Time elapsed: 0.299 sec - in org.apache.hadoop.hbase.util.TestTableName
Running org.apache.hadoop.hbase.util.TestMiniClusterLoadEncoded
Tests run: 6, Failures: 0, Errors: 0, Skipped: 0, Time elapsed: 11.357 sec - in org.apache.hadoop.hbase.util.TestRegionSplitter
Tests run: 4, Failures: 0, Errors: 0, Skipped: 0, Time elapsed: 99.997 sec - in org.apache.hadoop.hbase.util.TestMiniClusterLoadParallel
Running org.apache.hadoop.hbase.util.TestFSVisitor
Tests run: 1, Failures: 0, Errors: 0, Skipped: 0, Time elapsed: 9.689 sec - in org.apache.hadoop.hbase.util.TestFSVisitor
Running org.apache.hadoop.hbase.util.hbck.TestOfflineMetaRebuildBase
Running org.apache.hadoop.hbase.util.TestCoprocessorScanPolicy
Tests run: 15, Failures: 0, Errors: 0, Skipped: 1, Time elapsed: 215.586 sec - in org.apache.hadoop.hbase.util.TestHBaseFsckTwoRS
Running org.apache.hadoop.hbase.util.hbck.TestOfflineMetaRebuildOverlap
Tests run: 4, Failures: 0, Errors: 0, Skipped: 0, Time elapsed: 22.317 sec - in org.apache.hadoop.hbase.util.TestCoprocessorScanPolicy
Running org.apache.hadoop.hbase.util.hbck.TestOfflineMetaRebuildHole
Tests run: 1, Failures: 0, Errors: 0, Skipped: 0, Time elapsed: 35.412 sec - in org.apache.hadoop.hbase.util.hbck.TestOfflineMetaRebuildBase
Tests run: 1, Failures: 0, Errors: 0, Skipped: 0, Time elapsed: 42.942 sec - in org.apache.hadoop.hbase.util.hbck.TestOfflineMetaRebuildOverlap
Running org.apache.hadoop.hbase.util.TestDefaultEnvironmentEdge
Tests run: 1, Failures: 0, Errors: 0, Skipped: 0, Time elapsed: 0.148 sec - in org.apache.hadoop.hbase.util.TestDefaultEnvironmentEdge
Running org.apache.hadoop.hbase.util.TestFSHDFSUtils
Running org.apache.hadoop.hbase.util.TestHBaseFsckReplicas
Tests run: 3, Failures: 0, Errors: 0, Skipped: 0, Time elapsed: 8.393 sec - in org.apache.hadoop.hbase.util.TestFSHDFSUtils
Tests run: 1, Failures: 0, Errors: 0, Skipped: 0, Time elapsed: 42.966 sec - in org.apache.hadoop.hbase.util.hbck.TestOfflineMetaRebuildHole
Running org.apache.hadoop.hbase.TestMetaTableAccessorNoCluster
Tests run: 2, Failures: 0, Errors: 0, Skipped: 0, Time elapsed: 3.971 sec - in org.apache.hadoop.hbase.TestMetaTableAccessorNoCluster
Running org.apache.hadoop.hbase.mob.TestExpiredMobFileCleaner
Tests run: 5, Failures: 0, Errors: 0, Skipped: 0, Time elapsed: 119.23 sec - in org.apache.hadoop.hbase.util.TestMiniClusterLoadEncoded
Running org.apache.hadoop.hbase.TestNamespace
Running org.apache.hadoop.hbase.mob.mapreduce.TestMobSweepReducer
Tests run: 1, Failures: 0, Errors: 0, Skipped: 0, Time elapsed: 38.49 sec - in org.apache.hadoop.hbase.mob.TestExpiredMobFileCleaner
Tests run: 1, Failures: 0, Errors: 0, Skipped: 0, Time elapsed: 11.401 sec - in org.apache.hadoop.hbase.mob.mapreduce.TestMobSweepReducer
Running org.apache.hadoop.hbase.mob.mapreduce.TestMobSweepJob
Tests run: 3, Failures: 0, Errors: 0, Skipped: 0, Time elapsed: 2.951 sec - in org.apache.hadoop.hbase.mob.mapreduce.TestMobSweepJob
Running org.apache.hadoop.hbase.mob.compactions.TestPartitionedMobCompactor
Running org.apache.hadoop.hbase.mob.compactions.TestMobCompactor
Tests run: 6, Failures: 0, Errors: 0, Skipped: 0, Time elapsed: 21.71 sec - in org.apache.hadoop.hbase.mob.compactions.TestPartitionedMobCompactor
Tests run: 8, Failures: 0, Errors: 0, Skipped: 0, Time elapsed: 80.859 sec - in org.apache.hadoop.hbase.TestNamespace
Running org.apache.hadoop.hbase.mob.TestDefaultMobStoreFlusher
Running org.apache.hadoop.hbase.mob.TestMobDataBlockEncoding
Tests run: 2, Failures: 0, Errors: 0, Skipped: 0, Time elapsed: 11.152 sec - in org.apache.hadoop.hbase.mob.TestDefaultMobStoreFlusher
Tests run: 11, Failures: 0, Errors: 0, Skipped: 1, Time elapsed: 151.92 sec - in org.apache.hadoop.hbase.util.TestHBaseFsckReplicas
Tests run: 1, Failures: 0, Errors: 0, Skipped: 0, Time elapsed: 23.778 sec - in org.apache.hadoop.hbase.mob.TestMobDataBlockEncoding
Running org.apache.hadoop.hbase.TestInfoServers
Running org.apache.hadoop.hbase.TestMetaTableAccessor
Tests run: 3, Failures: 0, Errors: 0, Skipped: 0, Time elapsed: 9.037 sec - in org.apache.hadoop.hbase.TestInfoServers
Tests run: 14, Failures: 0, Errors: 0, Skipped: 0, Time elapsed: 42.245 sec - in org.apache.hadoop.hbase.TestMetaTableAccessor
Tests run: 5, Failures: 0, Errors: 0, Skipped: 0, Time elapsed: 113.158 sec - in org.apache.hadoop.hbase.mob.compactions.TestMobCompactor
Tests run: 39, Failures: 0, Errors: 0, Skipped: 1, Time elapsed: 518.881 sec - in org.apache.hadoop.hbase.util.TestHBaseFsckOneRS

Results :

Failed tests: 
  TestMasterReplication.testCyclicReplication2:204->wait:386 Waited too much time for replication.
Row:row4. IsDeleteReplication:true

Tests run: 2522, Failures: 1, Errors: 0, Skipped: 54

[INFO] ------------------------------------------------------------------------
[INFO] Reactor Summary:
[INFO] 
[INFO] Apache HBase ...................................... SUCCESS [  2.244 s]
[INFO] Apache HBase - Checkstyle ......................... SUCCESS [  0.554 s]
[INFO] Apache HBase - Resource Bundle .................... SUCCESS [  0.207 s]
[INFO] Apache HBase - Annotations ........................ SUCCESS [  0.216 s]
[INFO] Apache HBase - Protocol ........................... SUCCESS [  2.686 s]
[INFO] Apache HBase - Common ............................. SUCCESS [01:27 min]
[INFO] Apache HBase - Procedure .......................... SUCCESS [01:47 min]
[INFO] Apache HBase - Client ............................. SUCCESS [01:36 min]
[INFO] Apache HBase - Hadoop Compatibility ............... SUCCESS [  7.547 s]
[INFO] Apache HBase - Hadoop Two Compatibility ........... SUCCESS [  7.518 s]
[INFO] Apache HBase - Prefix Tree ........................ SUCCESS [  9.169 s]
[INFO] Apache HBase - Server ............................. FAILURE [  02:07 h]
[INFO] Apache HBase - Testing Util ....................... SKIPPED
[INFO] Apache HBase - Thrift ............................. SKIPPED
[INFO] Apache HBase - Shell .............................. SKIPPED
[INFO] Apache HBase - Integration Tests .................. SKIPPED
[INFO] Apache HBase - Examples ........................... SKIPPED
[INFO] Apache HBase - Rest ............................... SKIPPED
[INFO] Apache HBase - External Block Cache ............... SKIPPED
[INFO] Apache HBase - Assembly ........................... SKIPPED
[INFO] Apache HBase - Shaded ............................. SKIPPED
[INFO] Apache HBase - Shaded - Client .................... SKIPPED
[INFO] Apache HBase - Shaded - Server .................... SKIPPED
[INFO] Apache HBase - Spark .............................. SKIPPED
[INFO] ------------------------------------------------------------------------
[INFO] BUILD FAILURE
[INFO] ------------------------------------------------------------------------
[INFO] Total time: 02:12 h
[INFO] Finished at: 2015-10-24T19:29:57+00:00
[INFO] Final Memory: 58M/566M
[INFO] ------------------------------------------------------------------------
[ERROR] Failed to execute goal org.apache.maven.plugins:maven-surefire-plugin:2.18.1:test
(secondPartTestsExecution) on project hbase-server: There are test failures.
[ERROR] 
[ERROR] Please refer to /x1/jenkins/jenkins-slave/workspace/HBase-TRUNK/hbase-server/target/surefire-reports
for the individual test results.
[ERROR] -> [Help 1]
[ERROR] 
[ERROR] To see the full stack trace of the errors, re-run Maven with the -e switch.
[ERROR] Re-run Maven using the -X switch to enable full debug logging.
[ERROR] 
[ERROR] For more information about the errors and possible solutions, please read the following
articles:
[ERROR] [Help 1] http://cwiki.apache.org/confluence/display/MAVEN/MojoFailureException
[ERROR] 
[ERROR] After correcting the problems, you can resume the build with the command
[ERROR]   mvn <goals> -rf :hbase-server
Build step 'Invoke top-level Maven targets' marked build as failure
Performing Post build task...
Match found for :.* : True
Logical operation result is TRUE
Running script  :   ZOMBIE_TESTS_COUNT=`jps -v | grep surefirebooter | grep '-Dhbase.test'
| wc -l`
  if [[ $ZOMBIE_TESTS_COUNT != 0 ]] ; then
    #It seems sometimes the tests are not dying immediately. Let's give them 30s
    echo "Suspicious java process found - waiting 30s to see if there are just slow to stop"
    sleep 30
    ZOMBIE_TESTS_COUNT=`jps -v | grep surefirebooter | grep '-Dhbase.test' | wc -l`
    if [[ $ZOMBIE_TESTS_COUNT != 0 ]] ; then
      echo "There are $ZOMBIE_TESTS_COUNT zombie tests, they should have been killed by surefire
but survived"
      echo "************ zombies jps listing"
      jps -v
      jps -v | grep surefirebooter | grep '-Dhbase.test'
      echo "************ BEGIN zombies jstack extract"
      # HBase tests have been flagged with an innocuous '-Dhbase.test' just so they can
      # be identified as hbase in a process listing.
      ZB_STACK=`jps -v | grep surefirebooter | grep '-Dhbase.test' | cut -d ' ' -f 1 | xargs
-n 1 jstack | grep ".test" | grep "\.java"`
      jps -v | grep surefirebooter | grep '-Dhbase.test' | cut -d ' ' -f 1 | xargs -n 1 jstack
      echo "************ END  zombies jstack extract"
      JIRA_COMMENT="$JIRA_COMMENT

     {color:red}-1 core zombie tests{color}.  There are ${ZOMBIE_TESTS_COUNT} zombie test(s):
${ZB_STACK}"
      BAD=1
      # Killing these zombies
      echo 'Killing ZOMBIES!!!'
      jps -v
      jps -v | grep surefirebooter | grep '-Dhbase.test' | cut -d ' ' -f 1 | xargs kill -9
    else
      echo "We're ok: there is no zombie test, but some tests took some time to stop"
    fi
[HBase-TRUNK] $ /bin/bash -xe /tmp/hudson3390396437507916250.sh
++ grep -Dhbase.test
++ jps -v
++ wc -l
++ grep surefirebooter
grep: unknown devices method
+ ZOMBIE_TESTS_COUNT=0
/tmp/hudson3390396437507916250.sh: line 30: syntax error: unexpected end of file
POST BUILD TASK : FAILURE
END OF POST BUILD TASK : 0
Archiving artifacts
Recording test results
[FINDBUGS] Collecting findbugs analysis files...
[FINDBUGS] Finding all files that match the pattern **/findbugs.xml,**/findbugsXml.xml
[FINDBUGS] Parsing 28 files in <https://builds.apache.org/job/HBase-TRUNK/ws/>
[FINDBUGS] Successfully parsed file <https://builds.apache.org/job/HBase-TRUNK/6952/artifact/hbase-annotations/target/findbugs.xml>
with 0 unique warnings and 0 duplicates.
[FINDBUGS] Successfully parsed file <https://builds.apache.org/job/HBase-TRUNK/6952/artifact/hbase-annotations/target/findbugsXml.xml>
with 0 unique warnings and 0 duplicates.
[FINDBUGS] Successfully parsed file <https://builds.apache.org/job/HBase-TRUNK/6952/artifact/hbase-client/target/findbugs.xml>
with 0 unique warnings and 0 duplicates.
[FINDBUGS] Successfully parsed file <https://builds.apache.org/job/HBase-TRUNK/6952/artifact/hbase-client/target/findbugsXml.xml>
with 14 unique warnings and 0 duplicates.
[FINDBUGS] Successfully parsed file <https://builds.apache.org/job/HBase-TRUNK/6952/artifact/hbase-common/target/findbugs.xml>
with 14 unique warnings and 0 duplicates.
[FINDBUGS] Successfully parsed file <https://builds.apache.org/job/HBase-TRUNK/6952/artifact/hbase-common/target/findbugsXml.xml>
with 23 unique warnings and 0 duplicates.
[FINDBUGS] Successfully parsed file <https://builds.apache.org/job/HBase-TRUNK/6952/artifact/hbase-examples/target/findbugs.xml>
with 23 unique warnings and 0 duplicates.
[FINDBUGS] Successfully parsed file <https://builds.apache.org/job/HBase-TRUNK/6952/artifact/hbase-examples/target/findbugsXml.xml>
with 23 unique warnings and 0 duplicates.
[FINDBUGS] Successfully parsed file <https://builds.apache.org/job/HBase-TRUNK/6952/artifact/hbase-external-blockcache/target/findbugs.xml>
with 23 unique warnings and 0 duplicates.
[FINDBUGS] Successfully parsed file <https://builds.apache.org/job/HBase-TRUNK/6952/artifact/hbase-external-blockcache/target/findbugsXml.xml>
with 23 unique warnings and 0 duplicates.
[FINDBUGS] Successfully parsed file <https://builds.apache.org/job/HBase-TRUNK/6952/artifact/hbase-hadoop-compat/target/findbugs.xml>
with 23 unique warnings and 0 duplicates.
[FINDBUGS] Successfully parsed file <https://builds.apache.org/job/HBase-TRUNK/6952/artifact/hbase-hadoop-compat/target/findbugsXml.xml>
with 23 unique warnings and 0 duplicates.
[FINDBUGS] Successfully parsed file <https://builds.apache.org/job/HBase-TRUNK/6952/artifact/hbase-hadoop2-compat/target/findbugs.xml>
with 23 unique warnings and 0 duplicates.
[FINDBUGS] Successfully parsed file <https://builds.apache.org/job/HBase-TRUNK/6952/artifact/hbase-hadoop2-compat/target/findbugsXml.xml>
with 23 unique warnings and 0 duplicates.
[FINDBUGS] Successfully parsed file <https://builds.apache.org/job/HBase-TRUNK/6952/artifact/hbase-prefix-tree/target/findbugs.xml>
with 23 unique warnings and 0 duplicates.
[FINDBUGS] Successfully parsed file <https://builds.apache.org/job/HBase-TRUNK/6952/artifact/hbase-prefix-tree/target/findbugsXml.xml>
with 24 unique warnings and 0 duplicates.
[FINDBUGS] Successfully parsed file <https://builds.apache.org/job/HBase-TRUNK/6952/artifact/hbase-procedure/target/findbugs.xml>
with 24 unique warnings and 0 duplicates.
[FINDBUGS] Successfully parsed file <https://builds.apache.org/job/HBase-TRUNK/6952/artifact/hbase-procedure/target/findbugsXml.xml>
with 25 unique warnings and 0 duplicates.
[FINDBUGS] Successfully parsed file <https://builds.apache.org/job/HBase-TRUNK/6952/artifact/hbase-protocol/target/findbugs.xml>
with 25 unique warnings and 0 duplicates.
[FINDBUGS] Successfully parsed file <https://builds.apache.org/job/HBase-TRUNK/6952/artifact/hbase-protocol/target/findbugsXml.xml>
with 25 unique warnings and 0 duplicates.
[FINDBUGS] Successfully parsed file <https://builds.apache.org/job/HBase-TRUNK/6952/artifact/hbase-rest/target/findbugs.xml>
with 25 unique warnings and 0 duplicates.
[FINDBUGS] Successfully parsed file <https://builds.apache.org/job/HBase-TRUNK/6952/artifact/hbase-rest/target/findbugsXml.xml>
with 27 unique warnings and 0 duplicates.
[FINDBUGS] Successfully parsed file <https://builds.apache.org/job/HBase-TRUNK/6952/artifact/hbase-server/target/findbugs.xml>
with 27 unique warnings and 0 duplicates.
[FINDBUGS] Successfully parsed file <https://builds.apache.org/job/HBase-TRUNK/6952/artifact/hbase-server/target/findbugsXml.xml>
with 104 unique warnings and 1 duplicate.
[FINDBUGS] Successfully parsed file <https://builds.apache.org/job/HBase-TRUNK/6952/artifact/hbase-spark/target/findbugs.xml>
with 104 unique warnings and 0 duplicates.
[FINDBUGS] Successfully parsed file <https://builds.apache.org/job/HBase-TRUNK/6952/artifact/hbase-spark/target/findbugsXml.xml>
with 141 unique warnings and 0 duplicates.
[FINDBUGS] Successfully parsed file <https://builds.apache.org/job/HBase-TRUNK/6952/artifact/hbase-thrift/target/findbugs.xml>
with 141 unique warnings and 0 duplicates.
[FINDBUGS] Successfully parsed file <https://builds.apache.org/job/HBase-TRUNK/6952/artifact/hbase-thrift/target/findbugsXml.xml>
with 141 unique warnings and 0 duplicates.
[FINDBUGS] Computing warning deltas based on reference build #6945
[CHECKSTYLE] Collecting checkstyle analysis files...
[CHECKSTYLE] Finding all files that match the pattern **/checkstyle-result.xml
[CHECKSTYLE] Parsing 24 files in <https://builds.apache.org/job/HBase-TRUNK/ws/>
[CHECKSTYLE] Successfully parsed file <https://builds.apache.org/job/HBase-TRUNK/6952/artifact/hbase-annotations/target/checkstyle-result.xml>
with 0 unique warnings and 0 duplicates.
[CHECKSTYLE] Successfully parsed file <https://builds.apache.org/job/HBase-TRUNK/6952/artifact/hbase-assembly/target/checkstyle-result.xml>
with 0 unique warnings and 0 duplicates.
[CHECKSTYLE] Successfully parsed file <https://builds.apache.org/job/HBase-TRUNK/6952/artifact/hbase-checkstyle/target/checkstyle-result.xml>
with 0 unique warnings and 0 duplicates.
[CHECKSTYLE] Successfully parsed file <https://builds.apache.org/job/HBase-TRUNK/6952/artifact/hbase-client/target/checkstyle-result.xml>
with 198 unique warnings and 0 duplicates.
[CHECKSTYLE] Successfully parsed file <https://builds.apache.org/job/HBase-TRUNK/6952/artifact/hbase-common/target/checkstyle-result.xml>
with 297 unique warnings and 0 duplicates.
[CHECKSTYLE] Successfully parsed file <https://builds.apache.org/job/HBase-TRUNK/6952/artifact/hbase-examples/target/checkstyle-result.xml>
with 325 unique warnings and 0 duplicates.
[CHECKSTYLE] Successfully parsed file <https://builds.apache.org/job/HBase-TRUNK/6952/artifact/hbase-external-blockcache/target/checkstyle-result.xml>
with 325 unique warnings and 0 duplicates.
[CHECKSTYLE] Successfully parsed file <https://builds.apache.org/job/HBase-TRUNK/6952/artifact/hbase-hadoop-compat/target/checkstyle-result.xml>
with 327 unique warnings and 0 duplicates.
[CHECKSTYLE] Successfully parsed file <https://builds.apache.org/job/HBase-TRUNK/6952/artifact/hbase-hadoop2-compat/target/checkstyle-result.xml>
with 358 unique warnings and 0 duplicates.
[CHECKSTYLE] Successfully parsed file <https://builds.apache.org/job/HBase-TRUNK/6952/artifact/hbase-it/target/checkstyle-result.xml>
with 358 unique warnings and 0 duplicates.
[CHECKSTYLE] Successfully parsed file <https://builds.apache.org/job/HBase-TRUNK/6952/artifact/hbase-prefix-tree/target/checkstyle-result.xml>
with 375 unique warnings and 0 duplicates.
[CHECKSTYLE] Successfully parsed file <https://builds.apache.org/job/HBase-TRUNK/6952/artifact/hbase-procedure/target/checkstyle-result.xml>
with 375 unique warnings and 0 duplicates.
[CHECKSTYLE] Successfully parsed file <https://builds.apache.org/job/HBase-TRUNK/6952/artifact/hbase-protocol/target/checkstyle-result.xml>
with 377 unique warnings and 0 duplicates.
[CHECKSTYLE] Successfully parsed file <https://builds.apache.org/job/HBase-TRUNK/6952/artifact/hbase-resource-bundle/target/checkstyle-result.xml>
with 377 unique warnings and 0 duplicates.
[CHECKSTYLE] Successfully parsed file <https://builds.apache.org/job/HBase-TRUNK/6952/artifact/hbase-rest/target/checkstyle-result.xml>
with 419 unique warnings and 0 duplicates.
[CHECKSTYLE] Successfully parsed file <https://builds.apache.org/job/HBase-TRUNK/6952/artifact/hbase-server/target/checkstyle-result.xml>
with 1710 unique warnings and 0 duplicates.
[CHECKSTYLE] Successfully parsed file <https://builds.apache.org/job/HBase-TRUNK/6952/artifact/hbase-shaded/hbase-shaded-client/target/checkstyle-result.xml>
with 1710 unique warnings and 0 duplicates.
[CHECKSTYLE] Successfully parsed file <https://builds.apache.org/job/HBase-TRUNK/6952/artifact/hbase-shaded/hbase-shaded-server/target/checkstyle-result.xml>
with 1710 unique warnings and 0 duplicates.
[CHECKSTYLE] Successfully parsed file <https://builds.apache.org/job/HBase-TRUNK/6952/artifact/hbase-shaded/target/checkstyle-result.xml>
with 1710 unique warnings and 0 duplicates.
[CHECKSTYLE] Successfully parsed file <https://builds.apache.org/job/HBase-TRUNK/6952/artifact/hbase-shell/target/checkstyle-result.xml>
with 1710 unique warnings and 0 duplicates.
[CHECKSTYLE] Successfully parsed file <https://builds.apache.org/job/HBase-TRUNK/6952/artifact/hbase-spark/target/checkstyle-result.xml>
with 1710 unique warnings and 0 duplicates.
[CHECKSTYLE] Successfully parsed file <https://builds.apache.org/job/HBase-TRUNK/6952/artifact/hbase-testing-util/target/checkstyle-result.xml>
with 1710 unique warnings and 0 duplicates.
[CHECKSTYLE] Successfully parsed file <https://builds.apache.org/job/HBase-TRUNK/6952/artifact/hbase-thrift/target/checkstyle-result.xml>
with 1731 unique warnings and 0 duplicates.
[CHECKSTYLE] Successfully parsed file <https://builds.apache.org/job/HBase-TRUNK/6952/artifact/target/checkstyle-result.xml>
with 1731 unique warnings and 0 duplicates.
[CHECKSTYLE] Computing warning deltas based on reference build #6945
Updating HBASE-14683
Updating HBASE-14684

Mime
View raw message