hbase-builds mailing list archives

Site index · List index
Message view « Date » · « Thread »
Top « Date » · « Thread »
From Apache Jenkins Server <jenk...@builds.apache.org>
Subject Build failed in Jenkins: HBase-TRUNK #6923
Date Sat, 17 Oct 2015 04:31:15 GMT
See <https://builds.apache.org/job/HBase-TRUNK/6923/changes>

Changes:

[stack] HBASE-14634 Disable flakey

------------------------------------------
[...truncated 3182 lines...]
Tests run: 2, Failures: 0, Errors: 0, Skipped: 0, Time elapsed: 0.147 sec - in org.apache.hadoop.hbase.types.TestStructNullExtension
Running org.apache.hadoop.hbase.types.TestOrderedBlobVar
Tests run: 1, Failures: 0, Errors: 0, Skipped: 0, Time elapsed: 0.06 sec - in org.apache.hadoop.hbase.types.TestOrderedBlobVar
Running org.apache.hadoop.hbase.types.TestRawString
Tests run: 1, Failures: 0, Errors: 0, Skipped: 0, Time elapsed: 0.11 sec - in org.apache.hadoop.hbase.types.TestRawString
Running org.apache.hadoop.hbase.types.TestStruct
Tests run: 2, Failures: 0, Errors: 0, Skipped: 0, Time elapsed: 0.093 sec - in org.apache.hadoop.hbase.types.TestStruct
Running org.apache.hadoop.hbase.types.TestTerminatedWrapper
Tests run: 8, Failures: 0, Errors: 0, Skipped: 0, Time elapsed: 0.289 sec - in org.apache.hadoop.hbase.types.TestTerminatedWrapper
Running org.apache.hadoop.hbase.types.TestOrderedString
Tests run: 1, Failures: 0, Errors: 0, Skipped: 0, Time elapsed: 0.1 sec - in org.apache.hadoop.hbase.types.TestOrderedString
Running org.apache.hadoop.hbase.types.TestOrderedBlob
Tests run: 1, Failures: 0, Errors: 0, Skipped: 0, Time elapsed: 0.059 sec - in org.apache.hadoop.hbase.types.TestOrderedBlob
Running org.apache.hadoop.hbase.TestOffheapKeyValue
Tests run: 3, Failures: 0, Errors: 0, Skipped: 0, Time elapsed: 0.14 sec - in org.apache.hadoop.hbase.TestOffheapKeyValue
Running org.apache.hadoop.hbase.TestTimeout
Tests run: 2, Failures: 0, Errors: 0, Skipped: 1, Time elapsed: 0.191 sec - in org.apache.hadoop.hbase.TestTimeout

Results :

Tests run: 229, Failures: 0, Errors: 0, Skipped: 1

[INFO] 
[INFO] --- maven-surefire-plugin:2.18.1:test (secondPartTestsExecution) @ hbase-common ---
[INFO] Tests are skipped.
[INFO] 
[INFO] --- maven-source-plugin:2.2.1:jar-no-fork (attach-sources) @ hbase-common ---
[INFO] No sources in project. Archive not created.
[INFO] 
[INFO] --- maven-jar-plugin:2.4:test-jar (default) @ hbase-common ---
[INFO] Building jar: <https://builds.apache.org/job/HBase-TRUNK/ws/hbase-common/target/hbase-common-2.0.0-SNAPSHOT-tests.jar>
[INFO] 
[INFO] --- maven-jar-plugin:2.4:jar (default-jar) @ hbase-common ---
[INFO] Building jar: <https://builds.apache.org/job/HBase-TRUNK/ws/hbase-common/target/hbase-common-2.0.0-SNAPSHOT.jar>
[INFO] 
[INFO] --- maven-install-plugin:2.3.1:install (default-install) @ hbase-common ---
[INFO] Installing <https://builds.apache.org/job/HBase-TRUNK/ws/hbase-common/target/hbase-common-2.0.0-SNAPSHOT.jar>
to /home/jenkins/.m2/repository/org/apache/hbase/hbase-common/2.0.0-SNAPSHOT/hbase-common-2.0.0-SNAPSHOT.jar
[INFO] Installing <https://builds.apache.org/job/HBase-TRUNK/ws/hbase-common/pom.xml>
to /home/jenkins/.m2/repository/org/apache/hbase/hbase-common/2.0.0-SNAPSHOT/hbase-common-2.0.0-SNAPSHOT.pom
[INFO] Installing <https://builds.apache.org/job/HBase-TRUNK/ws/hbase-common/target/hbase-common-2.0.0-SNAPSHOT-tests.jar>
to /home/jenkins/.m2/repository/org/apache/hbase/hbase-common/2.0.0-SNAPSHOT/hbase-common-2.0.0-SNAPSHOT-tests.jar
[INFO]                                                                         
[INFO] ------------------------------------------------------------------------
[INFO] Building Apache HBase - Procedure 2.0.0-SNAPSHOT
[INFO] ------------------------------------------------------------------------
[INFO] 
[INFO] --- maven-enforcer-plugin:1.0.1:enforce (enforce) @ hbase-procedure ---
[INFO] 
[INFO] --- buildnumber-maven-plugin:1.3:create-timestamp (default) @ hbase-procedure ---
[INFO] 
[INFO] --- maven-remote-resources-plugin:1.5:process (default) @ hbase-procedure ---
[INFO] 
[INFO] --- maven-resources-plugin:2.6:resources (default-resources) @ hbase-procedure ---
[INFO] Using 'UTF-8' encoding to copy filtered resources.
[INFO] skip non existing resourceDirectory <https://builds.apache.org/job/HBase-TRUNK/ws/hbase-procedure/src/main/resources>
[INFO] Copying 3 resources
[INFO] 
[INFO] --- maven-compiler-plugin:3.2:compile (default-compile) @ hbase-procedure ---
[INFO] Nothing to compile - all classes are up to date
[INFO] 
[INFO] --- maven-resources-plugin:2.6:testResources (default-testResources) @ hbase-procedure
---
[INFO] Using 'UTF-8' encoding to copy filtered resources.
[INFO] skip non existing resourceDirectory <https://builds.apache.org/job/HBase-TRUNK/ws/hbase-procedure/src/test/resources>
[INFO] Copying 3 resources
[INFO] 
[INFO] --- maven-compiler-plugin:3.2:testCompile (default-testCompile) @ hbase-procedure ---
[INFO] Nothing to compile - all classes are up to date
[INFO] 
[INFO] --- maven-surefire-plugin:2.18.1:test (default-test) @ hbase-procedure ---
[INFO] Surefire report directory: <https://builds.apache.org/job/HBase-TRUNK/ws/hbase-procedure/target/surefire-reports>
[INFO] Using configured provider org.apache.maven.surefire.junitcore.JUnitCoreProvider
[INFO] parallel='none', perCoreThreadCount=true, threadCount=0, useUnlimitedThreads=false,
threadCountSuites=0, threadCountClasses=0, threadCountMethods=0, parallelOptimized=true

-------------------------------------------------------
 T E S T S
-------------------------------------------------------
Running org.apache.hadoop.hbase.procedure2.TestYieldProcedures
Tests run: 2, Failures: 0, Errors: 0, Skipped: 0, Time elapsed: 5.901 sec - in org.apache.hadoop.hbase.procedure2.TestYieldProcedures
Running org.apache.hadoop.hbase.procedure2.TestProcedureToString
Tests run: 2, Failures: 0, Errors: 0, Skipped: 0, Time elapsed: 0.015 sec - in org.apache.hadoop.hbase.procedure2.TestProcedureToString
Running org.apache.hadoop.hbase.procedure2.store.wal.TestWALProcedureStore
Tests run: 7, Failures: 0, Errors: 0, Skipped: 0, Time elapsed: 1.324 sec - in org.apache.hadoop.hbase.procedure2.store.wal.TestWALProcedureStore
Running org.apache.hadoop.hbase.procedure2.store.TestProcedureStoreTracker
Tests run: 6, Failures: 0, Errors: 0, Skipped: 0, Time elapsed: 19.918 sec - in org.apache.hadoop.hbase.procedure2.store.TestProcedureStoreTracker
Running org.apache.hadoop.hbase.procedure2.TestProcedureRecovery
Tests run: 8, Failures: 0, Errors: 0, Skipped: 0, Time elapsed: 11.313 sec - in org.apache.hadoop.hbase.procedure2.TestProcedureRecovery
Running org.apache.hadoop.hbase.procedure2.TestProcedureExecution
Tests run: 6, Failures: 0, Errors: 0, Skipped: 0, Time elapsed: 7.576 sec - in org.apache.hadoop.hbase.procedure2.TestProcedureExecution
Running org.apache.hadoop.hbase.procedure2.TestProcedureReplayOrder
Killed
Running org.apache.hadoop.hbase.procedure2.util.TestTimeoutBlockingQueue
Tests run: 2, Failures: 0, Errors: 0, Skipped: 0, Time elapsed: 26.778 sec - in org.apache.hadoop.hbase.procedure2.util.TestTimeoutBlockingQueue
Running org.apache.hadoop.hbase.procedure2.TestProcedureFairRunQueues
Tests run: 4, Failures: 0, Errors: 0, Skipped: 0, Time elapsed: 0.009 sec - in org.apache.hadoop.hbase.procedure2.TestProcedureFairRunQueues

Results :

Tests run: 37, Failures: 0, Errors: 0, Skipped: 0

[INFO] ------------------------------------------------------------------------
[INFO] Reactor Summary:
[INFO] 
[INFO] Apache HBase ...................................... SUCCESS [  2.530 s]
[INFO] Apache HBase - Checkstyle ......................... SUCCESS [  0.641 s]
[INFO] Apache HBase - Resource Bundle .................... SUCCESS [  0.202 s]
[INFO] Apache HBase - Annotations ........................ SUCCESS [  0.160 s]
[INFO] Apache HBase - Protocol ........................... SUCCESS [  2.797 s]
[INFO] Apache HBase - Common ............................. SUCCESS [01:24 min]
[INFO] Apache HBase - Procedure .......................... FAILURE [01:43 min]
[INFO] Apache HBase - Client ............................. SKIPPED
[INFO] Apache HBase - Hadoop Compatibility ............... SKIPPED
[INFO] Apache HBase - Hadoop Two Compatibility ........... SKIPPED
[INFO] Apache HBase - Prefix Tree ........................ SKIPPED
[INFO] Apache HBase - Server ............................. SKIPPED
[INFO] Apache HBase - Testing Util ....................... SKIPPED
[INFO] Apache HBase - Thrift ............................. SKIPPED
[INFO] Apache HBase - Shell .............................. SKIPPED
[INFO] Apache HBase - Integration Tests .................. SKIPPED
[INFO] Apache HBase - Examples ........................... SKIPPED
[INFO] Apache HBase - Rest ............................... SKIPPED
[INFO] Apache HBase - External Block Cache ............... SKIPPED
[INFO] Apache HBase - Assembly ........................... SKIPPED
[INFO] Apache HBase - Shaded ............................. SKIPPED
[INFO] Apache HBase - Shaded - Client .................... SKIPPED
[INFO] Apache HBase - Shaded - Server .................... SKIPPED
[INFO] Apache HBase - Spark .............................. SKIPPED
[INFO] ------------------------------------------------------------------------
[INFO] BUILD FAILURE
[INFO] ------------------------------------------------------------------------
[INFO] Total time: 03:16 min
[INFO] Finished at: 2015-10-17T04:31:36+00:00
[INFO] Final Memory: 65M/2070M
[INFO] ------------------------------------------------------------------------
[ERROR] Failed to execute goal org.apache.maven.plugins:maven-surefire-plugin:2.18.1:test
(default-test) on project hbase-procedure: ExecutionException: java.lang.RuntimeException:
The forked VM terminated without properly saying goodbye. VM crash or System.exit called?
[ERROR] Command was /bin/sh -c cd <https://builds.apache.org/job/HBase-TRUNK/ws/hbase-procedure>
&& /home/jenkins/jenkins-slave/tools/hudson.model.JDK/jdk-1.7u51/jre/bin/java -enableassertions
-Dhbase.test -Xmx2800m -XX:MaxPermSize=256m -Djava.security.egd=file:/dev/./urandom -Djava.net.preferIPv4Stack=true
-Djava.awt.headless=true -jar <https://builds.apache.org/job/HBase-TRUNK/ws/hbase-procedure/target/surefire/surefirebooter9109275919984670165.jar>
<https://builds.apache.org/job/HBase-TRUNK/ws/hbase-procedure/target/surefire/surefire5571594833291076871tmp>
<https://builds.apache.org/job/HBase-TRUNK/ws/hbase-procedure/target/surefire/surefire_598742389938952084180tmp>
[ERROR] -> [Help 1]
[ERROR] 
[ERROR] To see the full stack trace of the errors, re-run Maven with the -e switch.
[ERROR] Re-run Maven using the -X switch to enable full debug logging.
[ERROR] 
[ERROR] For more information about the errors and possible solutions, please read the following
articles:
[ERROR] [Help 1] http://cwiki.apache.org/confluence/display/MAVEN/MojoFailureException
[ERROR] 
[ERROR] After correcting the problems, you can resume the build with the command
[ERROR]   mvn <goals> -rf :hbase-procedure
Build step 'Invoke top-level Maven targets' marked build as failure
Performing Post build task...
Match found for :.* : True
Logical operation result is TRUE
Running script  :   ZOMBIE_TESTS_COUNT=`jps -v | grep surefirebooter | grep '-Dhbase.test'
| wc -l`
  if [[ $ZOMBIE_TESTS_COUNT != 0 ]] ; then
    #It seems sometimes the tests are not dying immediately. Let's give them 30s
    echo "Suspicious java process found - waiting 30s to see if there are just slow to stop"
    sleep 30
    ZOMBIE_TESTS_COUNT=`jps -v | grep surefirebooter | grep '-Dhbase.test' | wc -l`
    if [[ $ZOMBIE_TESTS_COUNT != 0 ]] ; then
      echo "There are $ZOMBIE_TESTS_COUNT zombie tests, they should have been killed by surefire
but survived"
      echo "************ zombies jps listing"
      jps -v
      jps -v | grep surefirebooter | grep '-Dhbase.test'
      echo "************ BEGIN zombies jstack extract"
      # HBase tests have been flagged with an innocuous '-Dhbase.test' just so they can
      # be identified as hbase in a process listing.
      ZB_STACK=`jps -v | grep surefirebooter | grep '-Dhbase.test' | cut -d ' ' -f 1 | xargs
-n 1 jstack | grep ".test" | grep "\.java"`
      jps -v | grep surefirebooter | grep '-Dhbase.test' | cut -d ' ' -f 1 | xargs -n 1 jstack
      echo "************ END  zombies jstack extract"
      JIRA_COMMENT="$JIRA_COMMENT

     {color:red}-1 core zombie tests{color}.  There are ${ZOMBIE_TESTS_COUNT} zombie test(s):
${ZB_STACK}"
      BAD=1
      # Killing these zombies
      echo 'Killing ZOMBIES!!!'
      jps -v
      jps -v | grep surefirebooter | grep '-Dhbase.test' | cut -d ' ' -f 1 | xargs kill -9
    else
      echo "We're ok: there is no zombie test, but some tests took some time to stop"
    fi
[HBase-TRUNK] $ /bin/bash -xe /tmp/hudson1997690253586574908.sh
++ jps -v
++ grep surefirebooter
++ grep -Dhbase.test
++ wc -l
grep: unknown devices method
+ ZOMBIE_TESTS_COUNT=0
/tmp/hudson1997690253586574908.sh: line 30: syntax error: unexpected end of file
POST BUILD TASK : FAILURE
END OF POST BUILD TASK : 0
Archiving artifacts
Compressed 5.95 MB of artifacts by 41.5% relative to #6920
Recording test results
[FINDBUGS] Collecting findbugs analysis files...
[FINDBUGS] Finding all files that match the pattern **/findbugs.xml,**/findbugsXml.xml
[FINDBUGS] Parsing 28 files in <https://builds.apache.org/job/HBase-TRUNK/ws/>
[FINDBUGS] Successfully parsed file <https://builds.apache.org/job/HBase-TRUNK/6923/artifact/hbase-annotations/target/findbugs.xml>
with 0 unique warnings and 0 duplicates.
[FINDBUGS] Successfully parsed file <https://builds.apache.org/job/HBase-TRUNK/6923/artifact/hbase-annotations/target/findbugsXml.xml>
with 0 unique warnings and 0 duplicates.
[FINDBUGS] Successfully parsed file <https://builds.apache.org/job/HBase-TRUNK/6923/artifact/hbase-client/target/findbugs.xml>
with 0 unique warnings and 0 duplicates.
[FINDBUGS] Successfully parsed file <https://builds.apache.org/job/HBase-TRUNK/6923/artifact/hbase-client/target/findbugsXml.xml>
with 13 unique warnings and 0 duplicates.
[FINDBUGS] Successfully parsed file <https://builds.apache.org/job/HBase-TRUNK/6923/artifact/hbase-common/target/findbugs.xml>
with 13 unique warnings and 0 duplicates.
[FINDBUGS] Successfully parsed file <https://builds.apache.org/job/HBase-TRUNK/6923/artifact/hbase-common/target/findbugsXml.xml>
with 22 unique warnings and 0 duplicates.
[FINDBUGS] Successfully parsed file <https://builds.apache.org/job/HBase-TRUNK/6923/artifact/hbase-examples/target/findbugs.xml>
with 22 unique warnings and 0 duplicates.
[FINDBUGS] Successfully parsed file <https://builds.apache.org/job/HBase-TRUNK/6923/artifact/hbase-examples/target/findbugsXml.xml>
with 22 unique warnings and 0 duplicates.
[FINDBUGS] Successfully parsed file <https://builds.apache.org/job/HBase-TRUNK/6923/artifact/hbase-external-blockcache/target/findbugs.xml>
with 22 unique warnings and 0 duplicates.
[FINDBUGS] Successfully parsed file <https://builds.apache.org/job/HBase-TRUNK/6923/artifact/hbase-external-blockcache/target/findbugsXml.xml>
with 22 unique warnings and 0 duplicates.
[FINDBUGS] Successfully parsed file <https://builds.apache.org/job/HBase-TRUNK/6923/artifact/hbase-hadoop-compat/target/findbugs.xml>
with 22 unique warnings and 0 duplicates.
[FINDBUGS] Successfully parsed file <https://builds.apache.org/job/HBase-TRUNK/6923/artifact/hbase-hadoop-compat/target/findbugsXml.xml>
with 22 unique warnings and 0 duplicates.
[FINDBUGS] Successfully parsed file <https://builds.apache.org/job/HBase-TRUNK/6923/artifact/hbase-hadoop2-compat/target/findbugs.xml>
with 22 unique warnings and 0 duplicates.
[FINDBUGS] Successfully parsed file <https://builds.apache.org/job/HBase-TRUNK/6923/artifact/hbase-hadoop2-compat/target/findbugsXml.xml>
with 22 unique warnings and 0 duplicates.
[FINDBUGS] Successfully parsed file <https://builds.apache.org/job/HBase-TRUNK/6923/artifact/hbase-prefix-tree/target/findbugs.xml>
with 22 unique warnings and 0 duplicates.
[FINDBUGS] Successfully parsed file <https://builds.apache.org/job/HBase-TRUNK/6923/artifact/hbase-prefix-tree/target/findbugsXml.xml>
with 23 unique warnings and 0 duplicates.
[FINDBUGS] Successfully parsed file <https://builds.apache.org/job/HBase-TRUNK/6923/artifact/hbase-procedure/target/findbugs.xml>
with 23 unique warnings and 0 duplicates.
[FINDBUGS] Successfully parsed file <https://builds.apache.org/job/HBase-TRUNK/6923/artifact/hbase-procedure/target/findbugsXml.xml>
with 24 unique warnings and 0 duplicates.
[FINDBUGS] Successfully parsed file <https://builds.apache.org/job/HBase-TRUNK/6923/artifact/hbase-protocol/target/findbugs.xml>
with 24 unique warnings and 0 duplicates.
[FINDBUGS] Successfully parsed file <https://builds.apache.org/job/HBase-TRUNK/6923/artifact/hbase-protocol/target/findbugsXml.xml>
with 24 unique warnings and 0 duplicates.
[FINDBUGS] Successfully parsed file <https://builds.apache.org/job/HBase-TRUNK/6923/artifact/hbase-rest/target/findbugs.xml>
with 24 unique warnings and 0 duplicates.
[FINDBUGS] Successfully parsed file <https://builds.apache.org/job/HBase-TRUNK/6923/artifact/hbase-rest/target/findbugsXml.xml>
with 26 unique warnings and 0 duplicates.
[FINDBUGS] Successfully parsed file <https://builds.apache.org/job/HBase-TRUNK/6923/artifact/hbase-server/target/findbugs.xml>
with 26 unique warnings and 0 duplicates.
[FINDBUGS] Successfully parsed file <https://builds.apache.org/job/HBase-TRUNK/6923/artifact/hbase-server/target/findbugsXml.xml>
with 102 unique warnings and 1 duplicate.
[FINDBUGS] Successfully parsed file <https://builds.apache.org/job/HBase-TRUNK/6923/artifact/hbase-spark/target/findbugs.xml>
with 102 unique warnings and 0 duplicates.
[FINDBUGS] Successfully parsed file <https://builds.apache.org/job/HBase-TRUNK/6923/artifact/hbase-spark/target/findbugsXml.xml>
with 139 unique warnings and 0 duplicates.
[FINDBUGS] Successfully parsed file <https://builds.apache.org/job/HBase-TRUNK/6923/artifact/hbase-thrift/target/findbugs.xml>
with 139 unique warnings and 0 duplicates.
[FINDBUGS] Successfully parsed file <https://builds.apache.org/job/HBase-TRUNK/6923/artifact/hbase-thrift/target/findbugsXml.xml>
with 139 unique warnings and 0 duplicates.
[FINDBUGS] Computing warning deltas based on reference build #6920
[CHECKSTYLE] Collecting checkstyle analysis files...
[CHECKSTYLE] Finding all files that match the pattern **/checkstyle-result.xml
[CHECKSTYLE] Parsing 24 files in <https://builds.apache.org/job/HBase-TRUNK/ws/>
[CHECKSTYLE] Successfully parsed file <https://builds.apache.org/job/HBase-TRUNK/6923/artifact/hbase-annotations/target/checkstyle-result.xml>
with 0 unique warnings and 0 duplicates.
[CHECKSTYLE] Successfully parsed file <https://builds.apache.org/job/HBase-TRUNK/6923/artifact/hbase-assembly/target/checkstyle-result.xml>
with 0 unique warnings and 0 duplicates.
[CHECKSTYLE] Successfully parsed file <https://builds.apache.org/job/HBase-TRUNK/6923/artifact/hbase-checkstyle/target/checkstyle-result.xml>
with 0 unique warnings and 0 duplicates.
[CHECKSTYLE] Successfully parsed file <https://builds.apache.org/job/HBase-TRUNK/6923/artifact/hbase-client/target/checkstyle-result.xml>
with 203 unique warnings and 0 duplicates.
[CHECKSTYLE] Successfully parsed file <https://builds.apache.org/job/HBase-TRUNK/6923/artifact/hbase-common/target/checkstyle-result.xml>
with 302 unique warnings and 0 duplicates.
[CHECKSTYLE] Successfully parsed file <https://builds.apache.org/job/HBase-TRUNK/6923/artifact/hbase-examples/target/checkstyle-result.xml>
with 330 unique warnings and 0 duplicates.
[CHECKSTYLE] Successfully parsed file <https://builds.apache.org/job/HBase-TRUNK/6923/artifact/hbase-external-blockcache/target/checkstyle-result.xml>
with 330 unique warnings and 0 duplicates.
[CHECKSTYLE] Successfully parsed file <https://builds.apache.org/job/HBase-TRUNK/6923/artifact/hbase-hadoop-compat/target/checkstyle-result.xml>
with 332 unique warnings and 0 duplicates.
[CHECKSTYLE] Successfully parsed file <https://builds.apache.org/job/HBase-TRUNK/6923/artifact/hbase-hadoop2-compat/target/checkstyle-result.xml>
with 363 unique warnings and 0 duplicates.
[CHECKSTYLE] Successfully parsed file <https://builds.apache.org/job/HBase-TRUNK/6923/artifact/hbase-it/target/checkstyle-result.xml>
with 363 unique warnings and 0 duplicates.
[CHECKSTYLE] Successfully parsed file <https://builds.apache.org/job/HBase-TRUNK/6923/artifact/hbase-prefix-tree/target/checkstyle-result.xml>
with 379 unique warnings and 0 duplicates.
[CHECKSTYLE] Successfully parsed file <https://builds.apache.org/job/HBase-TRUNK/6923/artifact/hbase-procedure/target/checkstyle-result.xml>
with 379 unique warnings and 0 duplicates.
[CHECKSTYLE] Successfully parsed file <https://builds.apache.org/job/HBase-TRUNK/6923/artifact/hbase-protocol/target/checkstyle-result.xml>
with 381 unique warnings and 0 duplicates.
[CHECKSTYLE] Successfully parsed file <https://builds.apache.org/job/HBase-TRUNK/6923/artifact/hbase-resource-bundle/target/checkstyle-result.xml>
with 381 unique warnings and 0 duplicates.
[CHECKSTYLE] Successfully parsed file <https://builds.apache.org/job/HBase-TRUNK/6923/artifact/hbase-rest/target/checkstyle-result.xml>
with 423 unique warnings and 0 duplicates.
[CHECKSTYLE] Successfully parsed file <https://builds.apache.org/job/HBase-TRUNK/6923/artifact/hbase-server/target/checkstyle-result.xml>
with 1724 unique warnings and 0 duplicates.
[CHECKSTYLE] Successfully parsed file <https://builds.apache.org/job/HBase-TRUNK/6923/artifact/hbase-shaded/hbase-shaded-client/target/checkstyle-result.xml>
with 1724 unique warnings and 0 duplicates.
[CHECKSTYLE] Successfully parsed file <https://builds.apache.org/job/HBase-TRUNK/6923/artifact/hbase-shaded/hbase-shaded-server/target/checkstyle-result.xml>
with 1724 unique warnings and 0 duplicates.
[CHECKSTYLE] Successfully parsed file <https://builds.apache.org/job/HBase-TRUNK/6923/artifact/hbase-shaded/target/checkstyle-result.xml>
with 1724 unique warnings and 0 duplicates.
[CHECKSTYLE] Successfully parsed file <https://builds.apache.org/job/HBase-TRUNK/6923/artifact/hbase-shell/target/checkstyle-result.xml>
with 1724 unique warnings and 0 duplicates.
[CHECKSTYLE] Successfully parsed file <https://builds.apache.org/job/HBase-TRUNK/6923/artifact/hbase-spark/target/checkstyle-result.xml>
with 1724 unique warnings and 0 duplicates.
[CHECKSTYLE] Successfully parsed file <https://builds.apache.org/job/HBase-TRUNK/6923/artifact/hbase-testing-util/target/checkstyle-result.xml>
with 1724 unique warnings and 0 duplicates.
[CHECKSTYLE] Successfully parsed file <https://builds.apache.org/job/HBase-TRUNK/6923/artifact/hbase-thrift/target/checkstyle-result.xml>
with 1746 unique warnings and 0 duplicates.
[CHECKSTYLE] Successfully parsed file <https://builds.apache.org/job/HBase-TRUNK/6923/artifact/target/checkstyle-result.xml>
with 1746 unique warnings and 0 duplicates.
[CHECKSTYLE] Computing warning deltas based on reference build #6920
Updating HBASE-14634

Mime
View raw message