hbase-builds mailing list archives

Site index · List index
Message view « Date » · « Thread »
Top « Date » · « Thread »
From Apache Jenkins Server <jenk...@builds.apache.org>
Subject Build failed in Jenkins: HBase-1.1 #724
Date Tue, 27 Oct 2015 00:45:35 GMT
See <https://builds.apache.org/job/HBase-1.1/724/changes>

Changes:

[apurtell] HBASE-14283 Reverse scan doesn’t work with HFile inline index/bloom

------------------------------------------
[...truncated 167 lines...]
[INFO] --- maven-jar-plugin:2.4:jar (default-jar) @ hbase-resource-bundle ---
[INFO] Building jar: <https://builds.apache.org/job/HBase-1.1/ws/hbase-resource-bundle/target/hbase-resource-bundle-1.1.3-SNAPSHOT.jar>
[INFO] 
[INFO] --- maven-install-plugin:2.3.1:install (default-install) @ hbase-resource-bundle ---
[INFO] Installing <https://builds.apache.org/job/HBase-1.1/ws/hbase-resource-bundle/target/hbase-resource-bundle-1.1.3-SNAPSHOT.jar>
to /home/jenkins/.m2/repository/org/apache/hbase/hbase-resource-bundle/1.1.3-SNAPSHOT/hbase-resource-bundle-1.1.3-SNAPSHOT.jar
[INFO] Installing <https://builds.apache.org/job/HBase-1.1/ws/hbase-resource-bundle/pom.xml>
to /home/jenkins/.m2/repository/org/apache/hbase/hbase-resource-bundle/1.1.3-SNAPSHOT/hbase-resource-bundle-1.1.3-SNAPSHOT.pom
[INFO]                                                                         
[INFO] ------------------------------------------------------------------------
[INFO] Building Apache HBase - Annotations 1.1.3-SNAPSHOT
[INFO] ------------------------------------------------------------------------
[INFO] 
[INFO] --- maven-enforcer-plugin:1.0.1:enforce (enforce) @ hbase-annotations ---
[INFO] 
[INFO] --- buildnumber-maven-plugin:1.3:create-timestamp (default) @ hbase-annotations ---
[INFO] 
[INFO] --- maven-remote-resources-plugin:1.5:process (default) @ hbase-annotations ---
[INFO] 
[INFO] --- maven-resources-plugin:2.6:resources (default-resources) @ hbase-annotations ---
[INFO] Using 'UTF-8' encoding to copy filtered resources.
[INFO] skip non existing resourceDirectory <https://builds.apache.org/job/HBase-1.1/ws/hbase-annotations/src/main/resources>
[INFO] Copying 3 resources
[INFO] 
[INFO] --- maven-compiler-plugin:2.5.1:compile (default-compile) @ hbase-annotations ---
[INFO] Compiling 6 source files to <https://builds.apache.org/job/HBase-1.1/ws/hbase-annotations/target/classes>
[INFO] 
[INFO] --- maven-resources-plugin:2.6:testResources (default-testResources) @ hbase-annotations
---
[INFO] Using 'UTF-8' encoding to copy filtered resources.
[INFO] skip non existing resourceDirectory <https://builds.apache.org/job/HBase-1.1/ws/hbase-annotations/src/test/resources>
[INFO] Copying 3 resources
[INFO] 
[INFO] --- maven-compiler-plugin:2.5.1:testCompile (default-testCompile) @ hbase-annotations
---
[INFO] Compiling 5 source files to <https://builds.apache.org/job/HBase-1.1/ws/hbase-annotations/target/test-classes>
[INFO] 
[INFO] --- maven-surefire-plugin:2.18.1:test (default-test) @ hbase-annotations ---
[INFO] 
[INFO] --- maven-surefire-plugin:2.18.1:test (secondPartTestsExecution) @ hbase-annotations
---
[INFO] 
[INFO] --- maven-jar-plugin:2.4:test-jar (default) @ hbase-annotations ---
[INFO] Building jar: <https://builds.apache.org/job/HBase-1.1/ws/hbase-annotations/target/hbase-annotations-1.1.3-SNAPSHOT-tests.jar>
[INFO] 
[INFO] --- maven-jar-plugin:2.4:jar (default-jar) @ hbase-annotations ---
[INFO] Building jar: <https://builds.apache.org/job/HBase-1.1/ws/hbase-annotations/target/hbase-annotations-1.1.3-SNAPSHOT.jar>
[INFO] 
[INFO] --- maven-install-plugin:2.3.1:install (default-install) @ hbase-annotations ---
[INFO] Installing <https://builds.apache.org/job/HBase-1.1/ws/hbase-annotations/target/hbase-annotations-1.1.3-SNAPSHOT.jar>
to /home/jenkins/.m2/repository/org/apache/hbase/hbase-annotations/1.1.3-SNAPSHOT/hbase-annotations-1.1.3-SNAPSHOT.jar
[INFO] Installing <https://builds.apache.org/job/HBase-1.1/ws/hbase-annotations/pom.xml>
to /home/jenkins/.m2/repository/org/apache/hbase/hbase-annotations/1.1.3-SNAPSHOT/hbase-annotations-1.1.3-SNAPSHOT.pom
[INFO] Installing <https://builds.apache.org/job/HBase-1.1/ws/hbase-annotations/target/hbase-annotations-1.1.3-SNAPSHOT-tests.jar>
to /home/jenkins/.m2/repository/org/apache/hbase/hbase-annotations/1.1.3-SNAPSHOT/hbase-annotations-1.1.3-SNAPSHOT-tests.jar
[INFO]                                                                         
[INFO] ------------------------------------------------------------------------
[INFO] Building Apache HBase - Protocol 1.1.3-SNAPSHOT
[INFO] ------------------------------------------------------------------------
[INFO] 
[INFO] --- maven-enforcer-plugin:1.0.1:enforce (enforce) @ hbase-protocol ---
[INFO] 
[INFO] --- buildnumber-maven-plugin:1.3:create-timestamp (default) @ hbase-protocol ---
[INFO] 
[INFO] --- maven-remote-resources-plugin:1.5:process (default) @ hbase-protocol ---
[INFO] 
[INFO] --- maven-resources-plugin:2.6:resources (default-resources) @ hbase-protocol ---
[INFO] Using 'UTF-8' encoding to copy filtered resources.
[INFO] skip non existing resourceDirectory <https://builds.apache.org/job/HBase-1.1/ws/hbase-protocol/src/main/resources>
[INFO] Copying 3 resources
[INFO] 
[INFO] --- maven-compiler-plugin:2.5.1:compile (default-compile) @ hbase-protocol ---
[INFO] Compiling 33 source files to <https://builds.apache.org/job/HBase-1.1/ws/hbase-protocol/target/classes>
[INFO] 
[INFO] --- maven-resources-plugin:2.6:testResources (default-testResources) @ hbase-protocol
---
[INFO] Using 'UTF-8' encoding to copy filtered resources.
[INFO] skip non existing resourceDirectory <https://builds.apache.org/job/HBase-1.1/ws/hbase-protocol/src/test/resources>
[INFO] Copying 3 resources
[INFO] 
[INFO] --- maven-compiler-plugin:2.5.1:testCompile (default-testCompile) @ hbase-protocol
---
[INFO] No sources to compile
[INFO] 
[INFO] --- maven-surefire-plugin:2.18.1:test (default-test) @ hbase-protocol ---
[INFO] 
[INFO] --- maven-surefire-plugin:2.18.1:test (secondPartTestsExecution) @ hbase-protocol ---
[INFO] Tests are skipped.
[INFO] 
[INFO] --- maven-source-plugin:2.2.1:jar-no-fork (attach-sources) @ hbase-protocol ---
[INFO] Building jar: <https://builds.apache.org/job/HBase-1.1/ws/hbase-protocol/target/hbase-protocol-1.1.3-SNAPSHOT-sources.jar>
[INFO] 
[INFO] --- maven-jar-plugin:2.4:test-jar (default) @ hbase-protocol ---
[INFO] Building jar: <https://builds.apache.org/job/HBase-1.1/ws/hbase-protocol/target/hbase-protocol-1.1.3-SNAPSHOT-tests.jar>
[INFO] 
[INFO] --- maven-jar-plugin:2.4:jar (default-jar) @ hbase-protocol ---
[INFO] Building jar: <https://builds.apache.org/job/HBase-1.1/ws/hbase-protocol/target/hbase-protocol-1.1.3-SNAPSHOT.jar>
[INFO] 
[INFO] --- maven-install-plugin:2.3.1:install (default-install) @ hbase-protocol ---
[INFO] Installing <https://builds.apache.org/job/HBase-1.1/ws/hbase-protocol/target/hbase-protocol-1.1.3-SNAPSHOT.jar>
to /home/jenkins/.m2/repository/org/apache/hbase/hbase-protocol/1.1.3-SNAPSHOT/hbase-protocol-1.1.3-SNAPSHOT.jar
[INFO] Installing <https://builds.apache.org/job/HBase-1.1/ws/hbase-protocol/pom.xml>
to /home/jenkins/.m2/repository/org/apache/hbase/hbase-protocol/1.1.3-SNAPSHOT/hbase-protocol-1.1.3-SNAPSHOT.pom
[INFO] Installing <https://builds.apache.org/job/HBase-1.1/ws/hbase-protocol/target/hbase-protocol-1.1.3-SNAPSHOT-sources.jar>
to /home/jenkins/.m2/repository/org/apache/hbase/hbase-protocol/1.1.3-SNAPSHOT/hbase-protocol-1.1.3-SNAPSHOT-sources.jar
[INFO] Installing <https://builds.apache.org/job/HBase-1.1/ws/hbase-protocol/target/hbase-protocol-1.1.3-SNAPSHOT-tests.jar>
to /home/jenkins/.m2/repository/org/apache/hbase/hbase-protocol/1.1.3-SNAPSHOT/hbase-protocol-1.1.3-SNAPSHOT-tests.jar
[INFO]                                                                         
[INFO] ------------------------------------------------------------------------
[INFO] Building Apache HBase - Common 1.1.3-SNAPSHOT
[INFO] ------------------------------------------------------------------------
[INFO] 
[INFO] --- maven-enforcer-plugin:1.0.1:enforce (enforce) @ hbase-common ---
[INFO] 
[INFO] --- buildnumber-maven-plugin:1.3:create-timestamp (default) @ hbase-common ---
[INFO] 
[INFO] --- maven-antrun-plugin:1.6:run (generate) @ hbase-common ---
[INFO] Executing tasks

main:
     [exec] ~/jenkins-slave/workspace/HBase-1.1/hbase-common ~/jenkins-slave/workspace/HBase-1.1/hbase-common
     [exec] ~/jenkins-slave/workspace/HBase-1.1/hbase-common
[INFO] Executed tasks
[INFO] 
[INFO] --- build-helper-maven-plugin:1.9.1:add-source (versionInfo-source) @ hbase-common
---
[INFO] Source directory: <https://builds.apache.org/job/HBase-1.1/ws/hbase-common/target/generated-sources/java>
added.
[INFO] 
[INFO] --- maven-remote-resources-plugin:1.5:process (default) @ hbase-common ---
[INFO] 
[INFO] --- maven-resources-plugin:2.6:resources (default-resources) @ hbase-common ---
[INFO] Using 'UTF-8' encoding to copy filtered resources.
[INFO] Copying 1 resource
[INFO] Copying 3 resources
[INFO] 
[INFO] --- maven-antrun-plugin:1.6:run (default) @ hbase-common ---
[INFO] Executing tasks

main:
    [mkdir] Created dir: <https://builds.apache.org/job/HBase-1.1/ws/hbase-common/target/nativelib>
     [exec] tar: hadoop-snappy-nativelibs.tar: Cannot open: No such file or directory
     [exec] tar: Error is not recoverable: exiting now
     [exec] Result: 2
[INFO] Executed tasks
[INFO] 
[INFO] --- maven-compiler-plugin:2.5.1:compile (default-compile) @ hbase-common ---
[INFO] Compiling 186 source files to <https://builds.apache.org/job/HBase-1.1/ws/hbase-common/target/classes>
[INFO] -------------------------------------------------------------
[ERROR] COMPILATION ERROR : 
[INFO] -------------------------------------------------------------
[ERROR] <https://builds.apache.org/job/HBase-1.1/ws/hbase-common/src/main/java/org/apache/hadoop/hbase/util/UnsafeAccess.java>:[30,15]
Unsafe is internal proprietary API and may be removed in a future release
[ERROR] <https://builds.apache.org/job/HBase-1.1/ws/hbase-common/src/main/java/org/apache/hadoop/hbase/io/encoding/DataBlockEncoding.java>:[46,3]
Unsafe is internal proprietary API and may be removed in a future release
[ERROR] <https://builds.apache.org/job/HBase-1.1/ws/hbase-common/src/main/java/org/apache/hadoop/hbase/util/Bytes.java>:[1317,19]
Unsafe is internal proprietary API and may be removed in a future release
[ERROR] <https://builds.apache.org/job/HBase-1.1/ws/hbase-common/src/main/java/org/apache/hadoop/hbase/util/Bytes.java>:[1323,21]
Unsafe is internal proprietary API and may be removed in a future release
[ERROR] <https://builds.apache.org/job/HBase-1.1/ws/hbase-common/src/main/java/org/apache/hadoop/hbase/util/Bytes.java>:[1328,28]
Unsafe is internal proprietary API and may be removed in a future release
[ERROR] <https://builds.apache.org/job/HBase-1.1/ws/hbase-common/src/main/java/org/apache/hadoop/hbase/CellUtil.java>:[913,11]
error: cannot find symbol
[ERROR]   symbol:   method matchingTimestamp(Cell,Cell)
  location: class CellUtil
<https://builds.apache.org/job/HBase-1.1/ws/hbase-common/src/main/java/org/apache/hadoop/hbase/util/UnsafeAccess.java>:[38,22]
Unsafe is internal proprietary API and may be removed in a future release
[ERROR] <https://builds.apache.org/job/HBase-1.1/ws/hbase-common/src/main/java/org/apache/hadoop/hbase/util/UnsafeAccess.java>:[44,17]
Unsafe is internal proprietary API and may be removed in a future release
[ERROR] <https://builds.apache.org/job/HBase-1.1/ws/hbase-common/src/main/java/org/apache/hadoop/hbase/util/UnsafeAccess.java>:[48,20]
Unsafe is internal proprietary API and may be removed in a future release
[INFO] 9 errors 
[INFO] -------------------------------------------------------------
[INFO] ------------------------------------------------------------------------
[INFO] Reactor Summary:
[INFO] 
[INFO] Apache HBase ...................................... SUCCESS [4.982s]
[INFO] Apache HBase - Checkstyle ......................... SUCCESS [0.911s]
[INFO] Apache HBase - Resource Bundle .................... SUCCESS [0.265s]
[INFO] Apache HBase - Annotations ........................ SUCCESS [1.070s]
[INFO] Apache HBase - Protocol ........................... SUCCESS [12.188s]
[INFO] Apache HBase - Common ............................. FAILURE [10.036s]
[INFO] Apache HBase - Procedure .......................... SKIPPED
[INFO] Apache HBase - Client ............................. SKIPPED
[INFO] Apache HBase - Hadoop Compatibility ............... SKIPPED
[INFO] Apache HBase - Hadoop Two Compatibility ........... SKIPPED
[INFO] Apache HBase - Prefix Tree ........................ SKIPPED
[INFO] Apache HBase - Server ............................. SKIPPED
[INFO] Apache HBase - Testing Util ....................... SKIPPED
[INFO] Apache HBase - Thrift ............................. SKIPPED
[INFO] Apache HBase - Rest ............................... SKIPPED
[INFO] Apache HBase - Shell .............................. SKIPPED
[INFO] Apache HBase - Integration Tests .................. SKIPPED
[INFO] Apache HBase - Examples ........................... SKIPPED
[INFO] Apache HBase - Assembly ........................... SKIPPED
[INFO] Apache HBase - Shaded ............................. SKIPPED
[INFO] Apache HBase - Shaded - Client .................... SKIPPED
[INFO] Apache HBase - Shaded - Server .................... SKIPPED
[INFO] ------------------------------------------------------------------------
[INFO] BUILD FAILURE
[INFO] ------------------------------------------------------------------------
[INFO] Total time: 32.264s
[INFO] Finished at: Tue Oct 27 00:46:28 UTC 2015
[INFO] Final Memory: 80M/2110M
[INFO] ------------------------------------------------------------------------
[ERROR] Failed to execute goal org.apache.maven.plugins:maven-compiler-plugin:2.5.1:compile
(default-compile) on project hbase-common: Compilation failure: Compilation failure:
[ERROR] <https://builds.apache.org/job/HBase-1.1/ws/hbase-common/src/main/java/org/apache/hadoop/hbase/util/UnsafeAccess.java>:[30,15]
Unsafe is internal proprietary API and may be removed in a future release
[ERROR] <https://builds.apache.org/job/HBase-1.1/ws/hbase-common/src/main/java/org/apache/hadoop/hbase/io/encoding/DataBlockEncoding.java>:[46,3]
Unsafe is internal proprietary API and may be removed in a future release
[ERROR] <https://builds.apache.org/job/HBase-1.1/ws/hbase-common/src/main/java/org/apache/hadoop/hbase/util/Bytes.java>:[1317,19]
Unsafe is internal proprietary API and may be removed in a future release
[ERROR] <https://builds.apache.org/job/HBase-1.1/ws/hbase-common/src/main/java/org/apache/hadoop/hbase/util/Bytes.java>:[1323,21]
Unsafe is internal proprietary API and may be removed in a future release
[ERROR] <https://builds.apache.org/job/HBase-1.1/ws/hbase-common/src/main/java/org/apache/hadoop/hbase/util/Bytes.java>:[1328,28]
Unsafe is internal proprietary API and may be removed in a future release
[ERROR] <https://builds.apache.org/job/HBase-1.1/ws/hbase-common/src/main/java/org/apache/hadoop/hbase/CellUtil.java>:[913,11]
error: cannot find symbol
[ERROR] symbol:   method matchingTimestamp(Cell,Cell)
[ERROR] location: class CellUtil
[ERROR] <https://builds.apache.org/job/HBase-1.1/ws/hbase-common/src/main/java/org/apache/hadoop/hbase/util/UnsafeAccess.java>:[38,22]
Unsafe is internal proprietary API and may be removed in a future release
[ERROR] <https://builds.apache.org/job/HBase-1.1/ws/hbase-common/src/main/java/org/apache/hadoop/hbase/util/UnsafeAccess.java>:[44,17]
Unsafe is internal proprietary API and may be removed in a future release
[ERROR] <https://builds.apache.org/job/HBase-1.1/ws/hbase-common/src/main/java/org/apache/hadoop/hbase/util/UnsafeAccess.java>:[48,20]
Unsafe is internal proprietary API and may be removed in a future release
[ERROR] -> [Help 1]
[ERROR] 
[ERROR] To see the full stack trace of the errors, re-run Maven with the -e switch.
[ERROR] Re-run Maven using the -X switch to enable full debug logging.
[ERROR] 
[ERROR] For more information about the errors and possible solutions, please read the following
articles:
[ERROR] [Help 1] http://cwiki.apache.org/confluence/display/MAVEN/MojoFailureException
[ERROR] 
[ERROR] After correcting the problems, you can resume the build with the command
[ERROR]   mvn <goals> -rf :hbase-common
Build step 'Invoke top-level Maven targets' marked build as failure
Performing Post build task...
Match found for :.* : True
Logical operation result is TRUE
Running script  :   ZOMBIE_TESTS_COUNT=`jps -v | grep surefirebooter | grep '-Dhbase.test'
| wc -l`
  if [[ $ZOMBIE_TESTS_COUNT != 0 ]] ; then
    #It seems sometimes the tests are not dying immediately. Let's give them 30s
    echo "Suspicious java process found - waiting 30s to see if there are just slow to stop"
    sleep 30
    ZOMBIE_TESTS_COUNT=`jps -v | grep surefirebooter | grep '-Dhbase.test' | wc -l`
    if [[ $ZOMBIE_TESTS_COUNT != 0 ]] ; then
      echo "There are $ZOMBIE_TESTS_COUNT zombie tests, they should have been killed by surefire
but survived"
      echo "************ zombies jps listing"
      jps -v
      jps -v | grep surefirebooter | grep '-Dhbase.test'
      echo "************ BEGIN zombies jstack extract"
      # HBase tests have been flagged with an innocuous '-Dhbase.test' just so they can
      # be identified as hbase in a process listing.
      ZB_STACK=`jps -v | grep surefirebooter | grep '-Dhbase.test' | cut -d ' ' -f 1 | xargs
-n 1 jstack | grep ".test" | grep "\.java"`
      jps -v | grep surefirebooter | grep '-Dhbase.test' | cut -d ' ' -f 1 | xargs -n 1 jstack
      echo "************ END  zombies jstack extract"
      JIRA_COMMENT="$JIRA_COMMENT

     {color:red}-1 core zombie tests{color}.  There are ${ZOMBIE_TESTS_COUNT} zombie test(s):
${ZB_STACK}"
      BAD=1
      # Killing these zombies
      echo 'Killing ZOMBIES!!!'
      jps -v
      jps -v | grep surefirebooter | grep '-Dhbase.test' | cut -d ' ' -f 1 | xargs kill -9
    else
      echo "We're ok: there is no zombie test, but some tests took some time to stop"
    fi
[HBase-1.1] $ /bin/bash -xe /tmp/hudson233899751634203763.sh
++ jps -v
++ grep surefirebooter
++ grep -Dhbase.test
++ wc -l
grep: unknown devices method
+ ZOMBIE_TESTS_COUNT=0
/tmp/hudson233899751634203763.sh: line 30: syntax error: unexpected end of file
POST BUILD TASK : FAILURE
END OF POST BUILD TASK : 0
Archiving artifacts
Compressed 220.22 KB of artifacts by 87.2% relative to #720
Recording test results
ERROR: Publisher 'Publish JUnit test result report' failed: No test report files were found.
Configuration error?
Updating HBASE-14283

Mime
View raw message