hbase-builds mailing list archives

Site index · List index
Message view « Date » · « Thread »
Top « Date » · « Thread »
From Apache Jenkins Server <jenk...@builds.apache.org>
Subject Build failed in Jenkins: HBase-1.0 #1084
Date Fri, 16 Oct 2015 12:05:02 GMT
See <https://builds.apache.org/job/HBase-1.0/1084/changes>

Changes:

[tedyu] HBASE-14605 Split fails due to 'No valid credentials' error when

------------------------------------------
[...truncated 2412 lines...]
[INFO] 
[INFO] --- maven-resources-plugin:2.6:testResources (default-testResources) @ hbase-it ---
[INFO] Using 'UTF-8' encoding to copy filtered resources.
[INFO] Copying 14 resources
[INFO] Copying 3 resources
[INFO] 
[INFO] --- maven-compiler-plugin:2.5.1:testCompile (default-testCompile) @ hbase-it ---
[INFO] Compiling 81 source files to <https://builds.apache.org/job/HBase-1.0/ws/hbase-it/target/test-classes>
[INFO] 
[INFO] --- maven-surefire-plugin:2.18:test (default-test) @ hbase-it ---
[INFO] 
[INFO] --- maven-surefire-plugin:2.18:test (secondPartTestsExecution) @ hbase-it ---
[INFO] 
[INFO] --- maven-jar-plugin:2.4:test-jar (default) @ hbase-it ---
[INFO] Building jar: <https://builds.apache.org/job/HBase-1.0/ws/hbase-it/target/hbase-it-1.0.3-SNAPSHOT-tests.jar>
[INFO] 
[INFO] --- maven-jar-plugin:2.4:jar (default-jar) @ hbase-it ---
[INFO] Building jar: <https://builds.apache.org/job/HBase-1.0/ws/hbase-it/target/hbase-it-1.0.3-SNAPSHOT.jar>
[INFO] 
[INFO] --- maven-failsafe-plugin:2.18:integration-test (integration-test) @ hbase-it ---
[WARNING] The parameter forkMode is deprecated since version 2.14. Use forkCount and reuseForks
instead.
[WARNING] File encoding has not been set, using platform encoding ISO-8859-1, i.e. build is
platform dependent!
[INFO] 
[INFO] --- maven-failsafe-plugin:2.18:verify (verify) @ hbase-it ---
[INFO] Failsafe report directory: <https://builds.apache.org/job/HBase-1.0/ws/hbase-it/target/failsafe-reports>
[WARNING] File encoding has not been set, using platform encoding ISO-8859-1, i.e. build is
platform dependent!
[INFO] 
[INFO] --- maven-install-plugin:2.3.1:install (default-install) @ hbase-it ---
[INFO] Installing <https://builds.apache.org/job/HBase-1.0/ws/hbase-it/target/hbase-it-1.0.3-SNAPSHOT.jar>
to /home/jenkins/.m2/repository/org/apache/hbase/hbase-it/1.0.3-SNAPSHOT/hbase-it-1.0.3-SNAPSHOT.jar
[INFO] Installing <https://builds.apache.org/job/HBase-1.0/ws/hbase-it/pom.xml> to /home/jenkins/.m2/repository/org/apache/hbase/hbase-it/1.0.3-SNAPSHOT/hbase-it-1.0.3-SNAPSHOT.pom
[INFO] Installing <https://builds.apache.org/job/HBase-1.0/ws/hbase-it/target/hbase-it-1.0.3-SNAPSHOT-tests.jar>
to /home/jenkins/.m2/repository/org/apache/hbase/hbase-it/1.0.3-SNAPSHOT/hbase-it-1.0.3-SNAPSHOT-tests.jar
[INFO]                                                                         
[INFO] ------------------------------------------------------------------------
[INFO] Building Apache HBase - Examples 1.0.3-SNAPSHOT
[INFO] ------------------------------------------------------------------------
[INFO] 
[INFO] --- maven-enforcer-plugin:1.0.1:enforce (enforce) @ hbase-examples ---
[INFO] 
[INFO] --- buildnumber-maven-plugin:1.3:create-timestamp (default) @ hbase-examples ---
[INFO] 
[INFO] --- maven-remote-resources-plugin:1.5:process (default) @ hbase-examples ---
[INFO] 
[INFO] --- maven-resources-plugin:2.6:resources (default-resources) @ hbase-examples ---
[INFO] Using 'UTF-8' encoding to copy filtered resources.
[INFO] skip non existing resourceDirectory <https://builds.apache.org/job/HBase-1.0/ws/hbase-examples/src/main/resources>
[INFO] Copying 3 resources
[INFO] 
[INFO] --- maven-compiler-plugin:2.5.1:compile (default-compile) @ hbase-examples ---
[INFO] Compiling 12 source files to <https://builds.apache.org/job/HBase-1.0/ws/hbase-examples/target/classes>
[INFO] 
[INFO] --- maven-dependency-plugin:2.1:build-classpath (create-mrapp-generated-classpath)
@ hbase-examples ---
[INFO] Wrote classpath file '<https://builds.apache.org/job/HBase-1.0/ws/hbase-examples/target/test-classes/mrapp-generated-classpath'.>
[INFO] 
[INFO] --- maven-resources-plugin:2.6:testResources (default-testResources) @ hbase-examples
---
[INFO] Using 'UTF-8' encoding to copy filtered resources.
[INFO] skip non existing resourceDirectory <https://builds.apache.org/job/HBase-1.0/ws/hbase-examples/src/test/resources>
[INFO] Copying 3 resources
[INFO] 
[INFO] --- maven-compiler-plugin:2.5.1:testCompile (default-testCompile) @ hbase-examples
---
[INFO] Compiling 5 source files to <https://builds.apache.org/job/HBase-1.0/ws/hbase-examples/target/test-classes>
[INFO] 
[INFO] --- maven-surefire-plugin:2.18:test (default-test) @ hbase-examples ---
[INFO] Surefire report directory: <https://builds.apache.org/job/HBase-1.0/ws/hbase-examples/target/surefire-reports>
[INFO] Using configured provider org.apache.maven.surefire.junitcore.JUnitCoreProvider
[INFO] parallel='none', perCoreThreadCount=true, threadCount=0, useUnlimitedThreads=false,
threadCountSuites=0, threadCountClasses=0, threadCountMethods=0, parallelOptimized=true

-------------------------------------------------------
 T E S T S
-------------------------------------------------------

Results :




Tests run: 0, Failures: 0, Errors: 0, Skipped: 0

[INFO] 
[INFO] --- maven-surefire-plugin:2.18:test (secondPartTestsExecution) @ hbase-examples ---
[INFO] Surefire report directory: <https://builds.apache.org/job/HBase-1.0/ws/hbase-examples/target/surefire-reports>
[INFO] Using configured provider org.apache.maven.surefire.junitcore.JUnitCoreProvider
[INFO] parallel='none', perCoreThreadCount=true, threadCount=0, useUnlimitedThreads=false,
threadCountSuites=0, threadCountClasses=0, threadCountMethods=0, parallelOptimized=true

-------------------------------------------------------
 T E S T S
-------------------------------------------------------
Running org.apache.hadoop.hbase.mapreduce.TestMapReduceExamples
Tests run: 4, Failures: 0, Errors: 0, Skipped: 0, Time elapsed: 1.166 sec - in org.apache.hadoop.hbase.mapreduce.TestMapReduceExamples

Results :




Tests run: 4, Failures: 0, Errors: 0, Skipped: 0

[INFO] 
[INFO] --- maven-source-plugin:2.2.1:jar-no-fork (attach-sources) @ hbase-examples ---
[INFO] Building jar: <https://builds.apache.org/job/HBase-1.0/ws/hbase-examples/target/hbase-examples-1.0.3-SNAPSHOT-sources.jar>
[INFO] 
[INFO] --- maven-jar-plugin:2.4:test-jar (default) @ hbase-examples ---
[INFO] Building jar: <https://builds.apache.org/job/HBase-1.0/ws/hbase-examples/target/hbase-examples-1.0.3-SNAPSHOT-tests.jar>
[INFO] 
[INFO] --- maven-jar-plugin:2.4:jar (default-jar) @ hbase-examples ---
[INFO] Building jar: <https://builds.apache.org/job/HBase-1.0/ws/hbase-examples/target/hbase-examples-1.0.3-SNAPSHOT.jar>
[INFO] 
[INFO] --- maven-install-plugin:2.3.1:install (default-install) @ hbase-examples ---
[INFO] Installing <https://builds.apache.org/job/HBase-1.0/ws/hbase-examples/target/hbase-examples-1.0.3-SNAPSHOT.jar>
to /home/jenkins/.m2/repository/org/apache/hbase/hbase-examples/1.0.3-SNAPSHOT/hbase-examples-1.0.3-SNAPSHOT.jar
[INFO] Installing <https://builds.apache.org/job/HBase-1.0/ws/hbase-examples/pom.xml>
to /home/jenkins/.m2/repository/org/apache/hbase/hbase-examples/1.0.3-SNAPSHOT/hbase-examples-1.0.3-SNAPSHOT.pom
[INFO] Installing <https://builds.apache.org/job/HBase-1.0/ws/hbase-examples/target/hbase-examples-1.0.3-SNAPSHOT-sources.jar>
to /home/jenkins/.m2/repository/org/apache/hbase/hbase-examples/1.0.3-SNAPSHOT/hbase-examples-1.0.3-SNAPSHOT-sources.jar
[INFO] Installing <https://builds.apache.org/job/HBase-1.0/ws/hbase-examples/target/hbase-examples-1.0.3-SNAPSHOT-tests.jar>
to /home/jenkins/.m2/repository/org/apache/hbase/hbase-examples/1.0.3-SNAPSHOT/hbase-examples-1.0.3-SNAPSHOT-tests.jar
[INFO]                                                                         
[INFO] ------------------------------------------------------------------------
[INFO] Building Apache HBase - Assembly 1.0.3-SNAPSHOT
[INFO] ------------------------------------------------------------------------
[INFO] 
[INFO] --- maven-enforcer-plugin:1.0.1:enforce (enforce) @ hbase-assembly ---
[INFO] 
[INFO] --- buildnumber-maven-plugin:1.3:create-timestamp (default) @ hbase-assembly ---
[INFO] 
[INFO] --- maven-remote-resources-plugin:1.5:process (default) @ hbase-assembly ---
[ERROR] Error invoking method 'get(java.lang.Integer)' in java.util.ArrayList at META-INF/LICENSE.vm[line
1619, column 22]
java.lang.reflect.InvocationTargetException
	at sun.reflect.GeneratedMethodAccessor132.invoke(Unknown Source)
	at sun.reflect.DelegatingMethodAccessorImpl.invoke(DelegatingMethodAccessorImpl.java:43)
	at java.lang.reflect.Method.invoke(Method.java:606)
	at org.apache.velocity.util.introspection.UberspectImpl$VelMethodImpl.doInvoke(UberspectImpl.java:395)
	at org.apache.velocity.util.introspection.UberspectImpl$VelMethodImpl.invoke(UberspectImpl.java:384)
	at org.apache.velocity.runtime.parser.node.ASTIndex.execute(ASTIndex.java:149)
	at org.apache.velocity.runtime.parser.node.ASTReference.execute(ASTReference.java:280)
	at org.apache.velocity.runtime.parser.node.ASTReference.evaluate(ASTReference.java:530)
	at org.apache.velocity.runtime.parser.node.ASTExpression.evaluate(ASTExpression.java:62)
	at org.apache.velocity.runtime.parser.node.ASTNotNode.evaluate(ASTNotNode.java:63)
	at org.apache.velocity.runtime.parser.node.ASTExpression.evaluate(ASTExpression.java:62)
	at org.apache.velocity.runtime.parser.node.ASTIfStatement.render(ASTIfStatement.java:85)
	at org.apache.velocity.runtime.parser.node.ASTBlock.render(ASTBlock.java:72)
	at org.apache.velocity.runtime.directive.Foreach.render(Foreach.java:420)
	at org.apache.velocity.runtime.parser.node.ASTDirective.render(ASTDirective.java:207)
	at org.apache.velocity.runtime.parser.node.ASTBlock.render(ASTBlock.java:72)
	at org.apache.velocity.runtime.parser.node.ASTIfStatement.render(ASTIfStatement.java:87)
	at org.apache.velocity.runtime.parser.node.SimpleNode.render(SimpleNode.java:342)
	at org.apache.velocity.Template.merge(Template.java:356)
	at org.apache.velocity.Template.merge(Template.java:260)
	at org.apache.velocity.app.VelocityEngine.mergeTemplate(VelocityEngine.java:354)
	at org.apache.maven.plugin.resources.remote.ProcessRemoteResourcesMojo.processResourceBundles(ProcessRemoteResourcesMojo.java:1164)
	at org.apache.maven.plugin.resources.remote.ProcessRemoteResourcesMojo.execute(ProcessRemoteResourcesMojo.java:520)
	at org.apache.maven.plugin.DefaultBuildPluginManager.executeMojo(DefaultBuildPluginManager.java:101)
	at org.apache.maven.lifecycle.internal.MojoExecutor.execute(MojoExecutor.java:209)
	at org.apache.maven.lifecycle.internal.MojoExecutor.execute(MojoExecutor.java:153)
	at org.apache.maven.lifecycle.internal.MojoExecutor.execute(MojoExecutor.java:145)
	at org.apache.maven.lifecycle.internal.LifecycleModuleBuilder.buildProject(LifecycleModuleBuilder.java:84)
	at org.apache.maven.lifecycle.internal.LifecycleModuleBuilder.buildProject(LifecycleModuleBuilder.java:59)
	at org.apache.maven.lifecycle.internal.LifecycleStarter.singleThreadedBuild(LifecycleStarter.java:183)
	at org.apache.maven.lifecycle.internal.LifecycleStarter.execute(LifecycleStarter.java:161)
	at org.apache.maven.DefaultMaven.doExecute(DefaultMaven.java:319)
	at org.apache.maven.DefaultMaven.execute(DefaultMaven.java:156)
	at org.apache.maven.cli.MavenCli.execute(MavenCli.java:537)
	at org.apache.maven.cli.MavenCli.doMain(MavenCli.java:196)
	at org.apache.maven.cli.MavenCli.main(MavenCli.java:141)
	at sun.reflect.NativeMethodAccessorImpl.invoke0(Native Method)
	at sun.reflect.NativeMethodAccessorImpl.invoke(NativeMethodAccessorImpl.java:57)
	at sun.reflect.DelegatingMethodAccessorImpl.invoke(DelegatingMethodAccessorImpl.java:43)
	at java.lang.reflect.Method.invoke(Method.java:606)
	at org.codehaus.plexus.classworlds.launcher.Launcher.launchEnhanced(Launcher.java:290)
	at org.codehaus.plexus.classworlds.launcher.Launcher.launch(Launcher.java:230)
	at org.codehaus.plexus.classworlds.launcher.Launcher.mainWithExitCode(Launcher.java:409)
	at org.codehaus.plexus.classworlds.launcher.Launcher.main(Launcher.java:352)
Caused by: java.lang.IndexOutOfBoundsException: Index: 0, Size: 0
	at java.util.ArrayList.rangeCheck(ArrayList.java:604)
	at java.util.ArrayList.get(ArrayList.java:382)
	... 44 more
[INFO] ------------------------------------------------------------------------
[INFO] Reactor Summary:
[INFO] 
[INFO] Apache HBase ...................................... SUCCESS [3.717s]
[INFO] Apache HBase - Checkstyle ......................... SUCCESS [1.004s]
[INFO] Apache HBase - Resource Bundle .................... SUCCESS [0.286s]
[INFO] Apache HBase - Annotations ........................ SUCCESS [1.084s]
[INFO] Apache HBase - Common ............................. SUCCESS [57.920s]
[INFO] Apache HBase - Protocol ........................... SUCCESS [9.711s]
[INFO] Apache HBase - Client ............................. SUCCESS [1:20.138s]
[INFO] Apache HBase - Hadoop Compatibility ............... SUCCESS [7.294s]
[INFO] Apache HBase - Hadoop Two Compatibility ........... SUCCESS [6.604s]
[INFO] Apache HBase - Prefix Tree ........................ SUCCESS [8.738s]
[INFO] Apache HBase - Server ............................. SUCCESS [1:08:58.094s]
[INFO] Apache HBase - Testing Util ....................... SUCCESS [1.028s]
[INFO] Apache HBase - Thrift ............................. SUCCESS [2:55.803s]
[INFO] Apache HBase - Rest ............................... SUCCESS [4:59.820s]
[INFO] Apache HBase - Shell .............................. SUCCESS [2:41.551s]
[INFO] Apache HBase - Integration Tests .................. SUCCESS [2.409s]
[INFO] Apache HBase - Examples ........................... SUCCESS [4.059s]
[INFO] Apache HBase - Assembly ........................... FAILURE [1.153s]
[INFO] ------------------------------------------------------------------------
[INFO] BUILD FAILURE
[INFO] ------------------------------------------------------------------------
[INFO] Total time: 1:22:42.173s
[INFO] Finished at: Fri Oct 16 12:03:56 UTC 2015
[INFO] Final Memory: 71M/435M
[INFO] ------------------------------------------------------------------------
[ERROR] Failed to execute goal org.apache.maven.plugins:maven-remote-resources-plugin:1.5:process
(default) on project hbase-assembly: Error rendering velocity resource. Error invoking method
'get(java.lang.Integer)' in java.util.ArrayList at META-INF/LICENSE.vm[line 1619, column 22]:
InvocationTargetException: Index: 0, Size: 0 -> [Help 1]
[ERROR] 
[ERROR] To see the full stack trace of the errors, re-run Maven with the -e switch.
[ERROR] Re-run Maven using the -X switch to enable full debug logging.
[ERROR] 
[ERROR] For more information about the errors and possible solutions, please read the following
articles:
[ERROR] [Help 1] http://cwiki.apache.org/confluence/display/MAVEN/MojoExecutionException
[ERROR] 
[ERROR] After correcting the problems, you can resume the build with the command
[ERROR]   mvn <goals> -rf :hbase-assembly
Build step 'Invoke top-level Maven targets' marked build as failure
Performing Post build task...
Match found for :.* : True
Logical operation result is TRUE
Running script  :   ZOMBIE_TESTS_COUNT=`jps | grep surefirebooter | wc -l`
  if [[ $ZOMBIE_TESTS_COUNT != 0 ]] ; then
    #It seems sometimes the tests are not dying immediately. Let's give them 10s
    echo "Suspicious java process found - waiting 10s to see if there are just slow to stop"
    sleep 10   
    ZOMBIE_TESTS_COUNT=`jps | grep surefirebooter | wc -l`
    if [[ $ZOMBIE_TESTS_COUNT != 0 ]] ; then
      echo "There are $ZOMBIE_TESTS_COUNT zombie tests, they should have been killed by surefire
but survived"
      echo "************ BEGIN zombies jstack extract"
      ZB_STACK=`jps | grep surefirebooter | cut -d ' ' -f 1 | xargs -n 1 jstack | grep ".test"
| grep "\.java"`
      jps | grep surefirebooter | cut -d ' ' -f 1 | xargs -n 1 jstack
      echo "************ END  zombies jstack extract"
      JIRA_COMMENT="$JIRA_COMMENT

     {color:red}-1 core zombie tests{color}.  There are ${ZOMBIE_TESTS_COUNT} zombie test(s):
${ZB_STACK}"
      BAD=1
      jps | grep surefirebooter | cut -d ' ' -f 1 | xargs kill -9
    else
      echo "We're ok: there is no zombie test, but some tests took some time to stop"
    fi
  else
    echo "We're ok: there is no zombie test"
  fi
[HBase-1.0] $ /bin/bash -xe /tmp/hudson4623829346007228957.sh
++ jps
++ grep surefirebooter
++ wc -l
+ ZOMBIE_TESTS_COUNT=0
+ [[ 0 != 0 ]]
+ echo 'We'\''re ok: there is no zombie test'
We're ok: there is no zombie test
POST BUILD TASK : SUCCESS
END OF POST BUILD TASK : 0
Archiving artifacts
Recording test results
Updating HBASE-14605

Mime
View raw message