hbase-builds mailing list archives

Site index · List index
Message view « Date » · « Thread »
Top « Date » · « Thread »
From Apache Jenkins Server <jenk...@builds.apache.org>
Subject Build failed in Jenkins: HBase-1.2 » latest1.7,Hadoop #241
Date Mon, 12 Oct 2015 21:01:44 GMT
See <https://builds.apache.org/job/HBase-1.2/jdk=latest1.7,label=Hadoop/241/changes>

Changes:

[eclark] HBASE-14585 Clean up TestSnapshotCloneIndependence

------------------------------------------
[...truncated 45239 lines...]
Tests run: 1, Failures: 0, Errors: 0, Skipped: 0, Time elapsed: 13.012 sec - in org.apache.hadoop.hbase.filter.TestColumnRangeFilter
Running org.apache.hadoop.hbase.filter.TestFuzzyRowFilterEndToEnd
Running org.apache.hadoop.hbase.TestHBaseTestingUtility
Tests run: 20, Failures: 0, Errors: 0, Skipped: 0, Time elapsed: 24.125 sec - in org.apache.hadoop.hbase.filter.TestMultiRowRangeFilter
Running org.apache.hadoop.hbase.filter.TestFilterWithScanLimits
Tests run: 1, Failures: 0, Errors: 0, Skipped: 0, Time elapsed: 3.895 sec - in org.apache.hadoop.hbase.filter.TestFilterWithScanLimits
Running org.apache.hadoop.hbase.quotas.TestQuotaThrottle
Running org.apache.hadoop.hbase.quotas.TestQuotaAdmin
Tests run: 3, Failures: 0, Errors: 0, Skipped: 0, Time elapsed: 4.749 sec - in org.apache.hadoop.hbase.quotas.TestQuotaAdmin
Running org.apache.hadoop.hbase.quotas.TestQuotaTableUtil
Tests run: 3, Failures: 0, Errors: 0, Skipped: 0, Time elapsed: 2.452 sec - in org.apache.hadoop.hbase.quotas.TestQuotaTableUtil
Tests run: 12, Failures: 0, Errors: 0, Skipped: 0, Time elapsed: 31.215 sec - in org.apache.hadoop.hbase.quotas.TestQuotaThrottle
Running org.apache.hadoop.hbase.io.encoding.TestDataBlockEncoders
Tests run: 11, Failures: 0, Errors: 0, Skipped: 0, Time elapsed: 69.306 sec - in org.apache.hadoop.hbase.TestHBaseTestingUtility
Running org.apache.hadoop.hbase.io.encoding.TestEncodedSeekers
Running org.apache.hadoop.hbase.io.encoding.TestChangingEncoding
Tests run: 2, Failures: 0, Errors: 0, Skipped: 0, Time elapsed: 232.598 sec - in org.apache.hadoop.hbase.filter.TestFuzzyRowFilterEndToEnd
Running org.apache.hadoop.hbase.io.encoding.TestBufferedDataBlockEncoder
Tests run: 3, Failures: 0, Errors: 0, Skipped: 0, Time elapsed: 169.957 sec - in org.apache.hadoop.hbase.io.encoding.TestChangingEncoding
Running org.apache.hadoop.hbase.io.encoding.TestLoadAndSwitchEncodeOnDisk
Tests run: 1, Failures: 0, Errors: 0, Skipped: 0, Time elapsed: 20.392 sec - in org.apache.hadoop.hbase.io.encoding.TestBufferedDataBlockEncoder
Running org.apache.hadoop.hbase.io.hfile.TestScannerSelectionUsingTTL
Tests run: 20, Failures: 0, Errors: 0, Skipped: 0, Time elapsed: 201.325 sec - in org.apache.hadoop.hbase.io.encoding.TestEncodedSeekers
Running org.apache.hadoop.hbase.io.hfile.TestHFileBlock
Tests run: 1, Failures: 0, Errors: 0, Skipped: 0, Time elapsed: 41.308 sec - in org.apache.hadoop.hbase.io.encoding.TestLoadAndSwitchEncodeOnDisk
Running org.apache.hadoop.hbase.io.hfile.TestCacheOnWrite
Tests run: 6, Failures: 0, Errors: 0, Skipped: 0, Time elapsed: 67.378 sec - in org.apache.hadoop.hbase.io.hfile.TestScannerSelectionUsingTTL
Running org.apache.hadoop.hbase.io.hfile.TestHFileBlockIndex
Tests run: 10, Failures: 0, Errors: 0, Skipped: 0, Time elapsed: 20.696 sec - in org.apache.hadoop.hbase.io.hfile.TestHFileBlockIndex
Running org.apache.hadoop.hbase.io.hfile.TestHFileSeek
Tests run: 1, Failures: 0, Errors: 0, Skipped: 0, Time elapsed: 4.129 sec - in org.apache.hadoop.hbase.io.hfile.TestHFileSeek
Running org.apache.hadoop.hbase.io.hfile.TestCacheConfig
Tests run: 6, Failures: 0, Errors: 0, Skipped: 0, Time elapsed: 4.607 sec - in org.apache.hadoop.hbase.io.hfile.TestCacheConfig
Tests run: 28, Failures: 0, Errors: 0, Skipped: 0, Time elapsed: 101.738 sec - in org.apache.hadoop.hbase.io.hfile.TestHFileBlock
Running org.apache.hadoop.hbase.io.hfile.TestForceCacheImportantBlocks
Running org.apache.hadoop.hbase.io.TestFileLink
Running org.apache.hadoop.hbase.procedure.TestZKProcedure
Tests run: 4, Failures: 0, Errors: 0, Skipped: 0, Time elapsed: 4.404 sec - in org.apache.hadoop.hbase.procedure.TestZKProcedure
Running org.apache.hadoop.hbase.procedure.TestZKProcedureControllers
Tests run: 4, Failures: 0, Errors: 0, Skipped: 0, Time elapsed: 3.306 sec - in org.apache.hadoop.hbase.procedure.TestZKProcedureControllers
Running org.apache.hadoop.hbase.TestHBaseOnOtherDfsCluster
Tests run: 5, Failures: 0, Errors: 0, Skipped: 0, Time elapsed: 28.195 sec - in org.apache.hadoop.hbase.io.TestFileLink
Running org.apache.hadoop.hbase.ipc.TestHBaseClient
Tests run: 1, Failures: 0, Errors: 0, Skipped: 0, Time elapsed: 0.716 sec - in org.apache.hadoop.hbase.ipc.TestHBaseClient
Tests run: 1, Failures: 0, Errors: 0, Skipped: 0, Time elapsed: 19.744 sec - in org.apache.hadoop.hbase.TestHBaseOnOtherDfsCluster
Running org.apache.hadoop.hbase.ipc.TestDelayedRpc
Running org.apache.hadoop.hbase.ipc.TestProtoBufRpc
Tests run: 1, Failures: 0, Errors: 0, Skipped: 0, Time elapsed: 3.845 sec - in org.apache.hadoop.hbase.ipc.TestProtoBufRpc
Tests run: 4, Failures: 0, Errors: 0, Skipped: 0, Time elapsed: 5.889 sec - in org.apache.hadoop.hbase.ipc.TestDelayedRpc
Running org.apache.hadoop.hbase.TestLocalHBaseCluster
Running org.apache.hadoop.hbase.TestAcidGuarantees
Tests run: 1, Failures: 0, Errors: 0, Skipped: 0, Time elapsed: 16.451 sec - in org.apache.hadoop.hbase.TestLocalHBaseCluster
Tests run: 4, Failures: 0, Errors: 0, Skipped: 0, Time elapsed: 70.419 sec - in org.apache.hadoop.hbase.io.hfile.TestForceCacheImportantBlocks
Tests run: 28, Failures: 0, Errors: 0, Skipped: 0, Time elapsed: 399.81 sec - in org.apache.hadoop.hbase.io.encoding.TestDataBlockEncoders
Running org.apache.hadoop.hbase.zookeeper.TestRecoverableZooKeeper
Tests run: 1, Failures: 0, Errors: 0, Skipped: 0, Time elapsed: 1.651 sec - in org.apache.hadoop.hbase.zookeeper.TestRecoverableZooKeeper
Running org.apache.hadoop.hbase.zookeeper.TestZooKeeperNodeTracker
Tests run: 3, Failures: 0, Errors: 0, Skipped: 0, Time elapsed: 1.923 sec - in org.apache.hadoop.hbase.zookeeper.TestZooKeeperNodeTracker
Running org.apache.hadoop.hbase.TestServerSideScanMetricsFromClientSide
Running org.apache.hadoop.hbase.zookeeper.TestZKTableStateManager
Running org.apache.hadoop.hbase.zookeeper.TestZooKeeperACL
Tests run: 1, Failures: 0, Errors: 0, Skipped: 0, Time elapsed: 1.772 sec - in org.apache.hadoop.hbase.zookeeper.TestZKTableStateManager
Tests run: 7, Failures: 0, Errors: 0, Skipped: 0, Time elapsed: 0.855 sec - in org.apache.hadoop.hbase.zookeeper.TestZooKeeperACL
Tests run: 2, Failures: 0, Errors: 0, Skipped: 0, Time elapsed: 4.957 sec - in org.apache.hadoop.hbase.TestServerSideScanMetricsFromClientSide
Running org.apache.hadoop.hbase.zookeeper.TestHQuorumPeer
Running org.apache.hadoop.hbase.zookeeper.TestZKLeaderManager
Tests run: 1, Failures: 0, Errors: 0, Skipped: 0, Time elapsed: 0.308 sec - in org.apache.hadoop.hbase.zookeeper.TestZKLeaderManager
Tests run: 4, Failures: 0, Errors: 0, Skipped: 0, Time elapsed: 2.86 sec - in org.apache.hadoop.hbase.zookeeper.TestHQuorumPeer
Running org.apache.hadoop.hbase.zookeeper.TestZKMulti
Running org.apache.hadoop.hbase.zookeeper.lock.TestZKInterProcessReadWriteLock
Tests run: 12, Failures: 0, Errors: 0, Skipped: 0, Time elapsed: 3.595 sec - in org.apache.hadoop.hbase.zookeeper.TestZKMulti
Running org.apache.hadoop.hbase.TestMetaTableAccessorNoCluster
Tests run: 2, Failures: 0, Errors: 0, Skipped: 0, Time elapsed: 6.449 sec - in org.apache.hadoop.hbase.TestMetaTableAccessorNoCluster
Running org.apache.hadoop.hbase.TestJMXListener
Running org.apache.hadoop.hbase.TestZooKeeper
Tests run: 6, Failures: 0, Errors: 0, Skipped: 0, Time elapsed: 25.697 sec - in org.apache.hadoop.hbase.zookeeper.lock.TestZKInterProcessReadWriteLock
Tests run: 2, Failures: 0, Errors: 0, Skipped: 0, Time elapsed: 16.512 sec - in org.apache.hadoop.hbase.TestJMXListener
Running org.apache.hadoop.hbase.replication.regionserver.TestReplicationWALReaderManager
Tests run: 3, Failures: 0, Errors: 0, Skipped: 0, Time elapsed: 107.808 sec - in org.apache.hadoop.hbase.TestAcidGuarantees
Running org.apache.hadoop.hbase.replication.regionserver.TestRegionReplicaReplicationEndpoint
Running org.apache.hadoop.hbase.replication.regionserver.TestRegionReplicaReplicationEndpointNoMaster
Tests run: 72, Failures: 0, Errors: 0, Skipped: 0, Time elapsed: 268.485 sec - in org.apache.hadoop.hbase.io.hfile.TestCacheOnWrite
Running org.apache.hadoop.hbase.replication.regionserver.TestReplicationSink
Tests run: 5, Failures: 0, Errors: 0, Skipped: 0, Time elapsed: 3.038 sec - in org.apache.hadoop.hbase.replication.regionserver.TestReplicationSink
Running org.apache.hadoop.hbase.replication.regionserver.TestReplicationSourceManager
Tests run: 5, Failures: 0, Errors: 0, Skipped: 0, Time elapsed: 4.843 sec - in org.apache.hadoop.hbase.replication.regionserver.TestReplicationSourceManager
Running org.apache.hadoop.hbase.replication.TestReplicationTrackerZKImpl
Tests run: 5, Failures: 0, Errors: 0, Skipped: 0, Time elapsed: 1.765 sec - in org.apache.hadoop.hbase.replication.TestReplicationTrackerZKImpl
Tests run: 4, Failures: 0, Errors: 0, Skipped: 0, Time elapsed: 55.396 sec - in org.apache.hadoop.hbase.replication.regionserver.TestRegionReplicaReplicationEndpointNoMaster
Running org.apache.hadoop.hbase.replication.TestReplicationKillMasterRSCompressed
Running org.apache.hadoop.hbase.replication.TestReplicationKillMasterRS
Tests run: 9, Failures: 0, Errors: 0, Skipped: 0, Time elapsed: 128.852 sec - in org.apache.hadoop.hbase.replication.regionserver.TestRegionReplicaReplicationEndpoint
Running org.apache.hadoop.hbase.replication.TestMultiSlaveReplication
Tests run: 1, Failures: 0, Errors: 0, Skipped: 0, Time elapsed: 35.849 sec - in org.apache.hadoop.hbase.replication.TestReplicationKillMasterRS
Tests run: 1, Failures: 0, Errors: 0, Skipped: 0, Time elapsed: 46.981 sec - in org.apache.hadoop.hbase.replication.TestReplicationKillMasterRSCompressed
Running org.apache.hadoop.hbase.replication.TestReplicationChangingPeerRegionservers
Tests run: 1, Failures: 0, Errors: 0, Skipped: 0, Time elapsed: 38.712 sec - in org.apache.hadoop.hbase.replication.TestMultiSlaveReplication
Tests run: 12, Failures: 0, Errors: 0, Skipped: 0, Time elapsed: 205.505 sec - in org.apache.hadoop.hbase.TestZooKeeper
Running org.apache.hadoop.hbase.replication.TestReplicationKillSlaveRS
Tests run: 1, Failures: 0, Errors: 0, Skipped: 0, Time elapsed: 6.744 sec - in org.apache.hadoop.hbase.replication.TestReplicationChangingPeerRegionservers
Running org.apache.hadoop.hbase.replication.TestMasterReplication
Running org.apache.hadoop.hbase.replication.TestPerTableCFReplication
Running org.apache.hadoop.hbase.replication.TestReplicationDisableInactivePeer
Tests run: 1, Failures: 0, Errors: 0, Skipped: 0, Time elapsed: 32.593 sec - in org.apache.hadoop.hbase.replication.TestReplicationKillSlaveRS
Tests run: 1, Failures: 0, Errors: 0, Skipped: 0, Time elapsed: 20.904 sec - in org.apache.hadoop.hbase.replication.TestReplicationDisableInactivePeer
Tests run: 8, Failures: 0, Errors: 0, Skipped: 0, Time elapsed: 243.823 sec - in org.apache.hadoop.hbase.replication.regionserver.TestReplicationWALReaderManager
Tests run: 2, Failures: 0, Errors: 0, Skipped: 0, Time elapsed: 35.844 sec - in org.apache.hadoop.hbase.replication.TestPerTableCFReplication
Running org.apache.hadoop.hbase.replication.TestReplicationWithTags
Tests run: 1, Failures: 0, Errors: 0, Skipped: 0, Time elapsed: 3.964 sec - in org.apache.hadoop.hbase.replication.TestReplicationWithTags
Running org.apache.hadoop.hbase.replication.TestReplicationSource
Tests run: 1, Failures: 0, Errors: 0, Skipped: 0, Time elapsed: 0.838 sec - in org.apache.hadoop.hbase.replication.TestReplicationSource
Running org.apache.hadoop.hbase.replication.TestReplicationStateZKImpl
Tests run: 6, Failures: 0, Errors: 0, Skipped: 0, Time elapsed: 1.507 sec - in org.apache.hadoop.hbase.replication.TestReplicationStateZKImpl
Running org.apache.hadoop.hbase.fs.TestBlockReorder
Running org.apache.hadoop.hbase.replication.TestReplicationEndpoint
Running org.apache.hadoop.hbase.replication.TestReplicationSmallTests
Tests run: 3, Failures: 0, Errors: 0, Skipped: 0, Time elapsed: 2.44 sec - in org.apache.hadoop.hbase.replication.TestReplicationEndpoint
Tests run: 3, Failures: 0, Errors: 0, Skipped: 0, Time elapsed: 88.591 sec - in org.apache.hadoop.hbase.replication.TestMasterReplication
Running org.apache.hadoop.hbase.TestMovedRegionsCleaner
Running org.apache.hadoop.hbase.replication.TestReplicationSyncUpTool
Running org.apache.hadoop.hbase.trace.TestHTraceHooks
Tests run: 1, Failures: 0, Errors: 0, Skipped: 0, Time elapsed: 3.595 sec - in org.apache.hadoop.hbase.trace.TestHTraceHooks
Tests run: 1, Failures: 0, Errors: 0, Skipped: 0, Time elapsed: 17.411 sec - in org.apache.hadoop.hbase.TestMovedRegionsCleaner
Tests run: 3, Failures: 0, Errors: 0, Skipped: 0, Time elapsed: 38.317 sec - in org.apache.hadoop.hbase.fs.TestBlockReorder
Running org.apache.hadoop.hbase.TestMetaTableLocator
Tests run: 7, Failures: 0, Errors: 0, Skipped: 0, Time elapsed: 5.579 sec - in org.apache.hadoop.hbase.TestMetaTableLocator
Running org.apache.hadoop.hbase.namespace.TestZKLessNamespaceAuditor
Running org.apache.hadoop.hbase.namespace.TestNamespaceAuditor
Tests run: 10, Failures: 0, Errors: 0, Skipped: 0, Time elapsed: 68.236 sec - in org.apache.hadoop.hbase.replication.TestReplicationSmallTests
Tests run: 1, Failures: 0, Errors: 0, Skipped: 0, Time elapsed: 61.528 sec - in org.apache.hadoop.hbase.replication.TestReplicationSyncUpTool
Running org.apache.hadoop.hbase.mapred.TestTableMapReduceUtil
Running org.apache.hadoop.hbase.mapred.TestTableSnapshotInputFormat
Running org.apache.hadoop.hbase.mapred.TestMultiTableSnapshotInputFormat
Tests run: 12, Failures: 0, Errors: 0, Skipped: 0, Time elapsed: 124.273 sec - in org.apache.hadoop.hbase.namespace.TestNamespaceAuditor
Tests run: 12, Failures: 0, Errors: 0, Skipped: 0, Time elapsed: 128.364 sec - in org.apache.hadoop.hbase.namespace.TestZKLessNamespaceAuditor
Running org.apache.hadoop.hbase.mapred.TestTableInputFormat
Running org.apache.hadoop.hbase.mapred.TestTableMapReduce
Tests run: 4, Failures: 0, Errors: 0, Skipped: 0, Time elapsed: 152.923 sec - in org.apache.hadoop.hbase.mapred.TestTableMapReduceUtil
Running org.apache.hadoop.hbase.TestMetaMigrationConvertingToPB
Tests run: 3, Failures: 0, Errors: 0, Skipped: 0, Time elapsed: 3.411 sec - in org.apache.hadoop.hbase.TestMetaMigrationConvertingToPB
Running org.apache.hadoop.hbase.TestMultiVersions
Tests run: 3, Failures: 0, Errors: 0, Skipped: 0, Time elapsed: 14.946 sec - in org.apache.hadoop.hbase.TestMultiVersions
Tests run: 8, Failures: 0, Errors: 0, Skipped: 0, Time elapsed: 145.444 sec - in org.apache.hadoop.hbase.mapred.TestTableInputFormat
Tests run: 2, Failures: 0, Errors: 0, Skipped: 0, Time elapsed: 166.529 sec - in org.apache.hadoop.hbase.mapred.TestTableMapReduce
Tests run: 4, Failures: 0, Errors: 0, Skipped: 0, Time elapsed: 277.828 sec - in org.apache.hadoop.hbase.mapred.TestMultiTableSnapshotInputFormat
Tests run: 7, Failures: 0, Errors: 0, Skipped: 0, Time elapsed: 437.508 sec - in org.apache.hadoop.hbase.mapred.TestTableSnapshotInputFormat

Results :

Tests run: 2529, Failures: 0, Errors: 0, Skipped: 57

[INFO] ------------------------------------------------------------------------
[INFO] Reactor Summary:
[INFO] 
[INFO] Apache HBase ...................................... SUCCESS [1:27.268s]
[INFO] Apache HBase - Checkstyle ......................... SUCCESS [6.856s]
[INFO] Apache HBase - Resource Bundle .................... SUCCESS [0.257s]
[INFO] Apache HBase - Annotations ........................ SUCCESS [1.804s]
[INFO] Apache HBase - Protocol ........................... SUCCESS [27.050s]
[INFO] Apache HBase - Common ............................. SUCCESS [3:33.028s]
[INFO] Apache HBase - Procedure .......................... SUCCESS [2:07.910s]
[INFO] Apache HBase - Client ............................. SUCCESS [1:59.319s]
[INFO] Apache HBase - Hadoop Compatibility ............... SUCCESS [10.696s]
[INFO] Apache HBase - Hadoop Two Compatibility ........... SUCCESS [14.021s]
[INFO] Apache HBase - Prefix Tree ........................ SUCCESS [16.636s]
[INFO] Apache HBase - Server ............................. FAILURE [1:56:56.835s]
[INFO] Apache HBase - Testing Util ....................... SKIPPED
[INFO] Apache HBase - Thrift ............................. SKIPPED
[INFO] Apache HBase - Rest ............................... SKIPPED
[INFO] Apache HBase - Shell .............................. SKIPPED
[INFO] Apache HBase - Integration Tests .................. SKIPPED
[INFO] Apache HBase - Examples ........................... SKIPPED
[INFO] Apache HBase - External Block Cache ............... SKIPPED
[INFO] Apache HBase - Assembly ........................... SKIPPED
[INFO] Apache HBase - Shaded ............................. SKIPPED
[INFO] Apache HBase - Shaded - Client .................... SKIPPED
[INFO] Apache HBase - Shaded - Server .................... SKIPPED
[INFO] ------------------------------------------------------------------------
[INFO] BUILD FAILURE
[INFO] ------------------------------------------------------------------------
[INFO] Total time: 2:07:51.076s
[INFO] Finished at: Mon Oct 12 20:59:11 UTC 2015
[INFO] Final Memory: 457M/684M
[INFO] ------------------------------------------------------------------------
[ERROR] Failed to execute goal org.apache.maven.plugins:maven-surefire-plugin:2.18.1:test
(secondPartTestsExecution) on project hbase-server: There was a timeout or other error in
the fork -> [Help 1]
[ERROR] 
[ERROR] To see the full stack trace of the errors, re-run Maven with the -e switch.
[ERROR] Re-run Maven using the -X switch to enable full debug logging.
[ERROR] 
[ERROR] For more information about the errors and possible solutions, please read the following
articles:
[ERROR] [Help 1] http://cwiki.apache.org/confluence/display/MAVEN/MojoFailureException
[ERROR] 
[ERROR] After correcting the problems, you can resume the build with the command
[ERROR]   mvn <goals> -rf :hbase-server
Build step 'Invoke top-level Maven targets' marked build as failure
Performing Post build task...
Match found for :.* : True
Logical operation result is TRUE
Running script  :   ZOMBIE_TESTS_COUNT=`jps | grep surefirebooter | wc -l`
  if [[ $ZOMBIE_TESTS_COUNT != 0 ]] ; then
    #It seems sometimes the tests are not dying immediately. Let's give them 10s
    echo "Suspicious java process found - waiting 10s to see if there are just slow to stop"
    sleep 10   
    ZOMBIE_TESTS_COUNT=`jps | grep surefirebooter | wc -l`
    if [[ $ZOMBIE_TESTS_COUNT != 0 ]] ; then
      echo "There are $ZOMBIE_TESTS_COUNT zombie tests, they should have been killed by surefire
but survived"
      echo "************ BEGIN zombies jstack extract"
      ZB_STACK=`jps | grep surefirebooter | cut -d ' ' -f 1 | xargs -n 1 jstack | grep ".test"
| grep "\.java"`
      jps | grep surefirebooter | cut -d ' ' -f 1 | xargs -n 1 jstack
      echo "************ END  zombies jstack extract"
      JIRA_COMMENT="$JIRA_COMMENT

     {color:red}-1 core zombie tests{color}.  There are ${ZOMBIE_TESTS_COUNT} zombie test(s):
${ZB_STACK}"
      BAD=1
      jps | grep surefirebooter | cut -d ' ' -f 1 | xargs kill -9
    else
      echo "We're ok: there is no zombie test, but some tests took some time to stop"
    fi
  else
    echo "We're ok: there is no zombie test"
  fi
[Hadoop] $ /bin/bash -xe /tmp/hudson1552991277977131305.sh
++ grep surefirebooter
++ wc -l
++ jps
+ ZOMBIE_TESTS_COUNT=6
+ [[ 6 != 0 ]]
+ echo 'Suspicious java process found - waiting 10s to see if there are just slow to stop'
Suspicious java process found - waiting 10s to see if there are just slow to stop
+ sleep 10
++ jps
++ grep surefirebooter
++ wc -l
+ ZOMBIE_TESTS_COUNT=6
+ [[ 6 != 0 ]]
+ echo 'There are 6 zombie tests, they should have been killed by surefire but survived'
There are 6 zombie tests, they should have been killed by surefire but survived
+ echo '************ BEGIN zombies jstack extract'
************ BEGIN zombies jstack extract
++ grep '\.java'
++ grep .test
++ xargs -n 1 jstack
++ cut -d ' ' -f 1
++ grep surefirebooter
++ jps
+ ZB_STACK=
POST BUILD TASK : FAILURE
END OF POST BUILD TASK : 0
Archiving artifacts

Mime
View raw message