hbase-builds mailing list archives

Site index · List index
Message view « Date » · « Thread »
Top « Date » · « Thread »
From Apache Jenkins Server <jenk...@builds.apache.org>
Subject Build failed in Jenkins: HBase-1.3 » latest1.7,Hadoop #240
Date Wed, 07 Oct 2015 08:38:33 GMT
See <https://builds.apache.org/job/HBase-1.3/jdk=latest1.7,label=Hadoop/240/changes>

Changes:

[stack] HBASE-14571 Purge TestProcessBasedCluster; it does nothing and then

[stack] HBASE-14502 Purge use of jmock and remove as dependency (Gabor Liptak)

------------------------------------------
[...truncated 48643 lines...]
13160/13509 KB   
13164/13509 KB   
13168/13509 KB   
13172/13509 KB   
13176/13509 KB   
13180/13509 KB   
13184/13509 KB   
13188/13509 KB   
13192/13509 KB   
13196/13509 KB   
13200/13509 KB   
13204/13509 KB   
13208/13509 KB   
13212/13509 KB   
13216/13509 KB   
13220/13509 KB   
13224/13509 KB   
13228/13509 KB   
13232/13509 KB   
13236/13509 KB   
13240/13509 KB   
13244/13509 KB   
13248/13509 KB   
13252/13509 KB   
13256/13509 KB   
13260/13509 KB   
13264/13509 KB   
13268/13509 KB   
13272/13509 KB   
13276/13509 KB   
13280/13509 KB   
13284/13509 KB   
13288/13509 KB   
13292/13509 KB   
13296/13509 KB   
13300/13509 KB   
13304/13509 KB   
13308/13509 KB   
13312/13509 KB   
13316/13509 KB   
13320/13509 KB   
13324/13509 KB   
13328/13509 KB   
13332/13509 KB   
13336/13509 KB   
13340/13509 KB   
13344/13509 KB   
13348/13509 KB   
13352/13509 KB   
13356/13509 KB   
13360/13509 KB   
13364/13509 KB   
13368/13509 KB   
13372/13509 KB   
13376/13509 KB   
13380/13509 KB   
13384/13509 KB   
13388/13509 KB   
13392/13509 KB   
13396/13509 KB   
13400/13509 KB   
13404/13509 KB   
13408/13509 KB   
13412/13509 KB   
13416/13509 KB   
13420/13509 KB   
13424/13509 KB   
13428/13509 KB   
13432/13509 KB   
13436/13509 KB   
13440/13509 KB   
13444/13509 KB   
13448/13509 KB   
13452/13509 KB   
13456/13509 KB   
13460/13509 KB   
13464/13509 KB   
13468/13509 KB   
13472/13509 KB   
13476/13509 KB   
13480/13509 KB   
13484/13509 KB   
13488/13509 KB   
13492/13509 KB   
13496/13509 KB   
13500/13509 KB   
13504/13509 KB   
13508/13509 KB   
13509/13509 KB   
                 
Downloaded: http://repository.jboss.org/nexus/content/groups/public-jboss/org/jruby/jruby-complete/1.6.8/jruby-complete-1.6.8.jar
(13509 KB at 9400.2 KB/sec)
[INFO] 
[INFO] --- maven-enforcer-plugin:1.0.1:enforce (enforce) @ hbase-shell ---
[INFO] 
[INFO] --- buildnumber-maven-plugin:1.3:create-timestamp (default) @ hbase-shell ---
[INFO] 
[INFO] --- jacoco-maven-plugin:0.7.5.201505241946:prepare-agent (prepare-agent) @ hbase-shell
---
[INFO] Skipping JaCoCo execution because property jacoco.skip is set.
[INFO] argLine set to empty
[INFO] 
[INFO] --- build-helper-maven-plugin:1.9.1:add-source (jspcSource-packageInfo-source) @ hbase-shell
---
[INFO] Source directory: <https://builds.apache.org/job/HBase-1.3/jdk=latest1.7,label=Hadoop/ws/hbase-shell/target/generated-jamon>
added.
[INFO] Source directory: <https://builds.apache.org/job/HBase-1.3/jdk=latest1.7,label=Hadoop/ws/hbase-shell/target/generated-sources/java>
added.
[INFO] 
[INFO] --- maven-remote-resources-plugin:1.5:process (default) @ hbase-shell ---
[INFO] 
[INFO] --- maven-resources-plugin:2.6:resources (default-resources) @ hbase-shell ---
[INFO] Using 'UTF-8' encoding to copy filtered resources.
[INFO] Copying 0 resource
[INFO] Copying 3 resources
[INFO] 
[INFO] --- maven-compiler-plugin:2.5.1:compile (default-compile) @ hbase-shell ---
[INFO] No sources to compile
[INFO] 
[INFO] --- maven-dependency-plugin:2.1:build-classpath (create-mrapp-generated-classpath)
@ hbase-shell ---
[INFO] Wrote classpath file '<https://builds.apache.org/job/HBase-1.3/jdk=latest1.7,label=Hadoop/ws/hbase-shell/target/test-classes/mrapp-generated-classpath'.>
[INFO] 
[INFO] --- maven-resources-plugin:2.6:testResources (default-testResources) @ hbase-shell
---
[INFO] Using 'UTF-8' encoding to copy filtered resources.
[INFO] skip non existing resourceDirectory <https://builds.apache.org/job/HBase-1.3/jdk=latest1.7,label=Hadoop/ws/hbase-shell/src/test/resources>
[INFO] Copying 3 resources
[INFO] 
[INFO] --- maven-compiler-plugin:2.5.1:testCompile (default-testCompile) @ hbase-shell ---
[INFO] Compiling 3 source files to <https://builds.apache.org/job/HBase-1.3/jdk=latest1.7,label=Hadoop/ws/hbase-shell/target/test-classes>
[INFO] 
[INFO] --- maven-surefire-plugin:2.18.1:test (default-test) @ hbase-shell ---
[INFO] Surefire report directory: <https://builds.apache.org/job/HBase-1.3/jdk=latest1.7,label=Hadoop/ws/hbase-shell/target/surefire-reports>
[INFO] Using configured provider org.apache.maven.surefire.junitcore.JUnitCoreProvider
[INFO] parallel='none', perCoreThreadCount=true, threadCount=0, useUnlimitedThreads=false,
threadCountSuites=0, threadCountClasses=0, threadCountMethods=0, parallelOptimized=true

-------------------------------------------------------
 T E S T S
-------------------------------------------------------

Results :

Tests run: 0, Failures: 0, Errors: 0, Skipped: 0

[INFO] 
[INFO] --- maven-surefire-plugin:2.18.1:test (secondPartTestsExecution) @ hbase-shell ---
[INFO] Surefire report directory: <https://builds.apache.org/job/HBase-1.3/jdk=latest1.7,label=Hadoop/ws/hbase-shell/target/surefire-reports>
[INFO] Using configured provider org.apache.maven.surefire.junitcore.JUnitCoreProvider
[INFO] parallel='none', perCoreThreadCount=true, threadCount=0, useUnlimitedThreads=false,
threadCountSuites=0, threadCountClasses=0, threadCountMethods=0, parallelOptimized=true

-------------------------------------------------------
 T E S T S
-------------------------------------------------------
Running org.apache.hadoop.hbase.client.TestReplicationShell
Running org.apache.hadoop.hbase.client.TestShell
Tests run: 1, Failures: 0, Errors: 1, Skipped: 0, Time elapsed: 110.633 sec <<< FAILURE!
- in org.apache.hadoop.hbase.client.TestReplicationShell
testRunShellTests(org.apache.hadoop.hbase.client.TestReplicationShell)  Time elapsed: 110.266
sec  <<< ERROR!
org.jruby.embed.EvalFailedException: (RuntimeError) Shell unit tests failed. Check output
file for details.
	at org.jruby.embed.internal.EmbedEvalUnitImpl.run(EmbedEvalUnitImpl.java:136)
	at org.jruby.embed.ScriptingContainer.runUnit(ScriptingContainer.java:1263)
	at org.jruby.embed.ScriptingContainer.runScriptlet(ScriptingContainer.java:1308)
	at org.apache.hadoop.hbase.client.TestReplicationShell.testRunShellTests(TestReplicationShell.java:34)
Caused by: org.jruby.exceptions.RaiseException: (RuntimeError) Shell unit tests failed. Check
output file for details.
	at (Anonymous).(root)(src/test/ruby/tests_runner.rb:84)

Tests run: 1, Failures: 0, Errors: 0, Skipped: 0, Time elapsed: 355.363 sec - in org.apache.hadoop.hbase.client.TestShell

Results :

Tests in error: 
  TestReplicationShell.testRunShellTests:34 » EvalFailed (RuntimeError) Shell un...

Tests run: 2, Failures: 0, Errors: 1, Skipped: 0

[INFO] ------------------------------------------------------------------------
[INFO] Reactor Summary:
[INFO] 
[INFO] Apache HBase ...................................... SUCCESS [1:29.785s]
[INFO] Apache HBase - Checkstyle ......................... SUCCESS [11.237s]
[INFO] Apache HBase - Resource Bundle .................... SUCCESS [0.186s]
[INFO] Apache HBase - Annotations ........................ SUCCESS [1.523s]
[INFO] Apache HBase - Protocol ........................... SUCCESS [16.147s]
[INFO] Apache HBase - Common ............................. SUCCESS [2:00.400s]
[INFO] Apache HBase - Procedure .......................... SUCCESS [1:53.349s]
[INFO] Apache HBase - Client ............................. SUCCESS [1:23.772s]
[INFO] Apache HBase - Hadoop Compatibility ............... SUCCESS [8.876s]
[INFO] Apache HBase - Hadoop Two Compatibility ........... SUCCESS [9.338s]
[INFO] Apache HBase - Prefix Tree ........................ SUCCESS [9.484s]
[INFO] Apache HBase - Server ............................. SUCCESS [1:32:52.578s]
[INFO] Apache HBase - Testing Util ....................... SUCCESS [1.740s]
[INFO] Apache HBase - Thrift ............................. SUCCESS [3:15.692s]
[INFO] Apache HBase - Rest ............................... SUCCESS [9:31.232s]
[INFO] Apache HBase - Shell .............................. FAILURE [6:11.888s]
[INFO] Apache HBase - Integration Tests .................. SKIPPED
[INFO] Apache HBase - Examples ........................... SKIPPED
[INFO] Apache HBase - External Block Cache ............... SKIPPED
[INFO] Apache HBase - Assembly ........................... SKIPPED
[INFO] Apache HBase - Shaded ............................. SKIPPED
[INFO] Apache HBase - Shaded - Client .................... SKIPPED
[INFO] Apache HBase - Shaded - Server .................... SKIPPED
[INFO] ------------------------------------------------------------------------
[INFO] BUILD FAILURE
[INFO] ------------------------------------------------------------------------
[INFO] Total time: 2:00:03.733s
[INFO] Finished at: Wed Oct 07 08:33:34 UTC 2015
[INFO] Final Memory: 114M/575M
[INFO] ------------------------------------------------------------------------
[ERROR] Failed to execute goal org.apache.maven.plugins:maven-surefire-plugin:2.18.1:test
(secondPartTestsExecution) on project hbase-shell: ExecutionException: java.lang.RuntimeException:
java.lang.RuntimeException: org.apache.maven.surefire.report.ReporterException: When writing
xml report stdout/stderr: /tmp/stdout3960279808597996587deferred (No such file or directory)
-> [Help 1]
[ERROR] 
[ERROR] To see the full stack trace of the errors, re-run Maven with the -e switch.
[ERROR] Re-run Maven using the -X switch to enable full debug logging.
[ERROR] 
[ERROR] For more information about the errors and possible solutions, please read the following
articles:
[ERROR] [Help 1] http://cwiki.apache.org/confluence/display/MAVEN/MojoFailureException
[ERROR] 
[ERROR] After correcting the problems, you can resume the build with the command
[ERROR]   mvn <goals> -rf :hbase-shell
Build step 'Invoke top-level Maven targets' marked build as failure
Performing Post build task...
Match found for :.* : True
Logical operation result is TRUE
Running script  :   ZOMBIE_TESTS_COUNT=`jps | grep surefirebooter | wc -l`
  if [[ $ZOMBIE_TESTS_COUNT != 0 ]] ; then
    #It seems sometimes the tests are not dying immediately. Let's give them 10s
    echo "Suspicious java process found - waiting 10s to see if there are just slow to stop"
    sleep 10   
    ZOMBIE_TESTS_COUNT=`jps | grep surefirebooter | wc -l`
    if [[ $ZOMBIE_TESTS_COUNT != 0 ]] ; then
      echo "There are $ZOMBIE_TESTS_COUNT zombie tests, they should have been killed by surefire
but survived"
      echo "************ BEGIN zombies jstack extract"
      ZB_STACK=`jps | grep surefirebooter | cut -d ' ' -f 1 | xargs -n 1 jstack | grep ".test"
| grep "\.java"`
      jps | grep surefirebooter | cut -d ' ' -f 1 | xargs -n 1 jstack
      echo "************ END  zombies jstack extract"
      JIRA_COMMENT="$JIRA_COMMENT

     {color:red}-1 core zombie tests{color}.  There are ${ZOMBIE_TESTS_COUNT} zombie test(s):
${ZB_STACK}"
      BAD=1
      jps | grep surefirebooter | cut -d ' ' -f 1 | xargs kill -9
    else
      echo "We're ok: there is no zombie test, but some tests took some time to stop"
    fi
  else
    echo "We're ok: there is no zombie test"
  fi
[Hadoop] $ /bin/bash -xe /tmp/hudson4092547524506921967.sh
++ jps
++ grep surefirebooter
++ wc -l
+ ZOMBIE_TESTS_COUNT=0
+ [[ 0 != 0 ]]
+ echo 'We'\''re ok: there is no zombie test'
We're ok: there is no zombie test
POST BUILD TASK : SUCCESS
END OF POST BUILD TASK : 0
Archiving artifacts

Mime
View raw message