hbase-builds mailing list archives

Site index · List index
Message view « Date » · « Thread »
Top « Date » · « Thread »
From Apache Jenkins Server <jenk...@builds.apache.org>
Subject Build failed in Jenkins: HBase-1.3 » latest1.7,Hadoop #243
Date Thu, 08 Oct 2015 00:49:35 GMT
See <https://builds.apache.org/job/HBase-1.3/jdk=latest1.7,label=Hadoop/243/changes>

Changes:

[stack] HBASE-14349 pre-commit zombie finder is overly broad

------------------------------------------
[...truncated 48664 lines...]
13243/13509 KB   
13247/13509 KB   
13251/13509 KB   
13255/13509 KB   
13259/13509 KB   
13263/13509 KB   
13267/13509 KB   
13271/13509 KB   
13275/13509 KB   
13279/13509 KB   
13283/13509 KB   
13287/13509 KB   
13291/13509 KB   
13295/13509 KB   
13299/13509 KB   
13303/13509 KB   
13307/13509 KB   
13311/13509 KB   
13315/13509 KB   
13319/13509 KB   
13323/13509 KB   
13327/13509 KB   
13331/13509 KB   
13335/13509 KB   
13339/13509 KB   
13343/13509 KB   
13347/13509 KB   
13347/13509 KB   
13351/13509 KB   
13352/13509 KB   
13354/13509 KB   
13358/13509 KB   
13362/13509 KB   
13366/13509 KB   
13370/13509 KB   
13374/13509 KB   
13378/13509 KB   
13382/13509 KB   
13386/13509 KB   
13390/13509 KB   
13394/13509 KB   
13398/13509 KB   
13402/13509 KB   
13406/13509 KB   
13410/13509 KB   
13414/13509 KB   
13418/13509 KB   
13422/13509 KB   
13426/13509 KB   
13430/13509 KB   
13434/13509 KB   
13438/13509 KB   
13442/13509 KB   
13446/13509 KB   
13450/13509 KB   
13454/13509 KB   
13458/13509 KB   
13462/13509 KB   
13466/13509 KB   
13470/13509 KB   
13474/13509 KB   
13478/13509 KB   
13482/13509 KB   
13486/13509 KB   
13490/13509 KB   
13494/13509 KB   
13498/13509 KB   
13502/13509 KB   
13506/13509 KB   
13509/13509 KB   
                 
Downloaded: http://repository.jboss.org/nexus/content/groups/public-jboss/org/jruby/jruby-complete/1.6.8/jruby-complete-1.6.8.jar
(13509 KB at 8760.1 KB/sec)
[INFO] 
[INFO] --- maven-enforcer-plugin:1.0.1:enforce (enforce) @ hbase-shell ---
[INFO] 
[INFO] --- buildnumber-maven-plugin:1.3:create-timestamp (default) @ hbase-shell ---
[INFO] 
[INFO] --- jacoco-maven-plugin:0.7.5.201505241946:prepare-agent (prepare-agent) @ hbase-shell
---
[INFO] Skipping JaCoCo execution because property jacoco.skip is set.
[INFO] argLine set to empty
[INFO] 
[INFO] --- build-helper-maven-plugin:1.9.1:add-source (jspcSource-packageInfo-source) @ hbase-shell
---
[INFO] Source directory: <https://builds.apache.org/job/HBase-1.3/jdk=latest1.7,label=Hadoop/ws/hbase-shell/target/generated-jamon>
added.
[INFO] Source directory: <https://builds.apache.org/job/HBase-1.3/jdk=latest1.7,label=Hadoop/ws/hbase-shell/target/generated-sources/java>
added.
[INFO] 
[INFO] --- maven-remote-resources-plugin:1.5:process (default) @ hbase-shell ---
[INFO] 
[INFO] --- maven-resources-plugin:2.6:resources (default-resources) @ hbase-shell ---
[INFO] Using 'UTF-8' encoding to copy filtered resources.
[INFO] Copying 0 resource
[INFO] Copying 3 resources
[INFO] 
[INFO] --- maven-compiler-plugin:2.5.1:compile (default-compile) @ hbase-shell ---
[INFO] No sources to compile
[INFO] 
[INFO] --- maven-dependency-plugin:2.1:build-classpath (create-mrapp-generated-classpath)
@ hbase-shell ---
[INFO] Wrote classpath file '<https://builds.apache.org/job/HBase-1.3/jdk=latest1.7,label=Hadoop/ws/hbase-shell/target/test-classes/mrapp-generated-classpath'.>
[INFO] 
[INFO] --- maven-resources-plugin:2.6:testResources (default-testResources) @ hbase-shell
---
[INFO] Using 'UTF-8' encoding to copy filtered resources.
[INFO] skip non existing resourceDirectory <https://builds.apache.org/job/HBase-1.3/jdk=latest1.7,label=Hadoop/ws/hbase-shell/src/test/resources>
[INFO] Copying 3 resources
[INFO] 
[INFO] --- maven-compiler-plugin:2.5.1:testCompile (default-testCompile) @ hbase-shell ---
[INFO] Compiling 3 source files to <https://builds.apache.org/job/HBase-1.3/jdk=latest1.7,label=Hadoop/ws/hbase-shell/target/test-classes>
[INFO] 
[INFO] --- maven-surefire-plugin:2.18.1:test (default-test) @ hbase-shell ---
[INFO] Surefire report directory: <https://builds.apache.org/job/HBase-1.3/jdk=latest1.7,label=Hadoop/ws/hbase-shell/target/surefire-reports>
[INFO] Using configured provider org.apache.maven.surefire.junitcore.JUnitCoreProvider
[INFO] parallel='none', perCoreThreadCount=true, threadCount=0, useUnlimitedThreads=false,
threadCountSuites=0, threadCountClasses=0, threadCountMethods=0, parallelOptimized=true

-------------------------------------------------------
 T E S T S
-------------------------------------------------------

Results :

Tests run: 0, Failures: 0, Errors: 0, Skipped: 0

[INFO] 
[INFO] --- maven-surefire-plugin:2.18.1:test (secondPartTestsExecution) @ hbase-shell ---
[INFO] Surefire report directory: <https://builds.apache.org/job/HBase-1.3/jdk=latest1.7,label=Hadoop/ws/hbase-shell/target/surefire-reports>
[INFO] Using configured provider org.apache.maven.surefire.junitcore.JUnitCoreProvider
[INFO] parallel='none', perCoreThreadCount=true, threadCount=0, useUnlimitedThreads=false,
threadCountSuites=0, threadCountClasses=0, threadCountMethods=0, parallelOptimized=true

-------------------------------------------------------
 T E S T S
-------------------------------------------------------
Running org.apache.hadoop.hbase.client.TestShell
Running org.apache.hadoop.hbase.client.TestReplicationShell
Tests run: 1, Failures: 0, Errors: 1, Skipped: 0, Time elapsed: 110.791 sec <<< FAILURE!
- in org.apache.hadoop.hbase.client.TestReplicationShell
testRunShellTests(org.apache.hadoop.hbase.client.TestReplicationShell)  Time elapsed: 110.43
sec  <<< ERROR!
org.jruby.embed.EvalFailedException: (RuntimeError) Shell unit tests failed. Check output
file for details.
	at org.jruby.embed.internal.EmbedEvalUnitImpl.run(EmbedEvalUnitImpl.java:136)
	at org.jruby.embed.ScriptingContainer.runUnit(ScriptingContainer.java:1263)
	at org.jruby.embed.ScriptingContainer.runScriptlet(ScriptingContainer.java:1308)
	at org.apache.hadoop.hbase.client.TestReplicationShell.testRunShellTests(TestReplicationShell.java:34)
Caused by: org.jruby.exceptions.RaiseException: (RuntimeError) Shell unit tests failed. Check
output file for details.
	at (Anonymous).(root)(src/test/ruby/tests_runner.rb:84)

Tests run: 1, Failures: 0, Errors: 0, Skipped: 0, Time elapsed: 365.244 sec - in org.apache.hadoop.hbase.client.TestShell

Results :

Tests in error: 
  TestReplicationShell.testRunShellTests:34 » EvalFailed (RuntimeError) Shell un...

Tests run: 2, Failures: 0, Errors: 1, Skipped: 0

[INFO] ------------------------------------------------------------------------
[INFO] Reactor Summary:
[INFO] 
[INFO] Apache HBase ...................................... SUCCESS [1:22.780s]
[INFO] Apache HBase - Checkstyle ......................... SUCCESS [6.530s]
[INFO] Apache HBase - Resource Bundle .................... SUCCESS [0.212s]
[INFO] Apache HBase - Annotations ........................ SUCCESS [1.141s]
[INFO] Apache HBase - Protocol ........................... SUCCESS [15.767s]
[INFO] Apache HBase - Common ............................. SUCCESS [1:59.777s]
[INFO] Apache HBase - Procedure .......................... SUCCESS [1:52.691s]
[INFO] Apache HBase - Client ............................. SUCCESS [1:23.610s]
[INFO] Apache HBase - Hadoop Compatibility ............... SUCCESS [7.777s]
[INFO] Apache HBase - Hadoop Two Compatibility ........... SUCCESS [9.489s]
[INFO] Apache HBase - Prefix Tree ........................ SUCCESS [9.684s]
[INFO] Apache HBase - Server ............................. SUCCESS [1:33:00.796s]
[INFO] Apache HBase - Testing Util ....................... SUCCESS [1.961s]
[INFO] Apache HBase - Thrift ............................. SUCCESS [3:16.386s]
[INFO] Apache HBase - Rest ............................... SUCCESS [9:05.692s]
[INFO] Apache HBase - Shell .............................. FAILURE [6:22.976s]
[INFO] Apache HBase - Integration Tests .................. SKIPPED
[INFO] Apache HBase - Examples ........................... SKIPPED
[INFO] Apache HBase - External Block Cache ............... SKIPPED
[INFO] Apache HBase - Assembly ........................... SKIPPED
[INFO] Apache HBase - Shaded ............................. SKIPPED
[INFO] Apache HBase - Shaded - Client .................... SKIPPED
[INFO] Apache HBase - Shaded - Server .................... SKIPPED
[INFO] ------------------------------------------------------------------------
[INFO] BUILD FAILURE
[INFO] ------------------------------------------------------------------------
[INFO] Total time: 1:59:56.489s
[INFO] Finished at: Thu Oct 08 00:47:28 UTC 2015
[INFO] Final Memory: 114M/614M
[INFO] ------------------------------------------------------------------------
[ERROR] Failed to execute goal org.apache.maven.plugins:maven-surefire-plugin:2.18.1:test
(secondPartTestsExecution) on project hbase-shell: ExecutionException: java.lang.RuntimeException:
java.lang.RuntimeException: org.apache.maven.surefire.report.ReporterException: When writing
xml report stdout/stderr: /tmp/stdout2995055936056009783deferred (No such file or directory)
-> [Help 1]
[ERROR] 
[ERROR] To see the full stack trace of the errors, re-run Maven with the -e switch.
[ERROR] Re-run Maven using the -X switch to enable full debug logging.
[ERROR] 
[ERROR] For more information about the errors and possible solutions, please read the following
articles:
[ERROR] [Help 1] http://cwiki.apache.org/confluence/display/MAVEN/MojoFailureException
[ERROR] 
[ERROR] After correcting the problems, you can resume the build with the command
[ERROR]   mvn <goals> -rf :hbase-shell
Build step 'Invoke top-level Maven targets' marked build as failure
Performing Post build task...
Match found for :.* : True
Logical operation result is TRUE
Running script  :   ZOMBIE_TESTS_COUNT=`jps | grep surefirebooter | wc -l`
  if [[ $ZOMBIE_TESTS_COUNT != 0 ]] ; then
    #It seems sometimes the tests are not dying immediately. Let's give them 10s
    echo "Suspicious java process found - waiting 10s to see if there are just slow to stop"
    sleep 10   
    ZOMBIE_TESTS_COUNT=`jps | grep surefirebooter | wc -l`
    if [[ $ZOMBIE_TESTS_COUNT != 0 ]] ; then
      echo "There are $ZOMBIE_TESTS_COUNT zombie tests, they should have been killed by surefire
but survived"
      echo "************ BEGIN zombies jstack extract"
      ZB_STACK=`jps | grep surefirebooter | cut -d ' ' -f 1 | xargs -n 1 jstack | grep ".test"
| grep "\.java"`
      jps | grep surefirebooter | cut -d ' ' -f 1 | xargs -n 1 jstack
      echo "************ END  zombies jstack extract"
      JIRA_COMMENT="$JIRA_COMMENT

     {color:red}-1 core zombie tests{color}.  There are ${ZOMBIE_TESTS_COUNT} zombie test(s):
${ZB_STACK}"
      BAD=1
      jps | grep surefirebooter | cut -d ' ' -f 1 | xargs kill -9
    else
      echo "We're ok: there is no zombie test, but some tests took some time to stop"
    fi
  else
    echo "We're ok: there is no zombie test"
  fi
[Hadoop] $ /bin/bash -xe /tmp/hudson1430164515650304077.sh
++ jps
++ grep surefirebooter
++ wc -l
+ ZOMBIE_TESTS_COUNT=1
+ [[ 1 != 0 ]]
+ echo 'Suspicious java process found - waiting 10s to see if there are just slow to stop'
Suspicious java process found - waiting 10s to see if there are just slow to stop
+ sleep 10
++ jps
++ grep surefirebooter
++ wc -l
+ ZOMBIE_TESTS_COUNT=1
+ [[ 1 != 0 ]]
+ echo 'There are 1 zombie tests, they should have been killed by surefire but survived'
There are 1 zombie tests, they should have been killed by surefire but survived
+ echo '************ BEGIN zombies jstack extract'
************ BEGIN zombies jstack extract
++ jps
++ grep surefirebooter
++ cut -d ' ' -f 1
++ xargs -n 1 jstack
++ grep .test
++ grep '\.java'
8268: Unable to open socket file: target process not responding or HotSpot VM not loaded
The -F option can be used when the target process is not responding
+ ZB_STACK=
POST BUILD TASK : FAILURE
END OF POST BUILD TASK : 0
Archiving artifacts

Mime
View raw message