hbase-builds mailing list archives

Site index · List index
Message view « Date » · « Thread »
Top « Date » · « Thread »
From Apache Jenkins Server <jenk...@builds.apache.org>
Subject Build failed in Jenkins: HBase-1.3 » latest1.7,Hadoop #244
Date Thu, 08 Oct 2015 04:04:32 GMT
See <https://builds.apache.org/job/HBase-1.3/jdk=latest1.7,label=Hadoop/244/changes>

Changes:

[ndimiduk] HBASE-12911 Client-side metrics

------------------------------------------
[...truncated 45027 lines...]
[INFO]                                                                         
[INFO] ------------------------------------------------------------------------
[INFO] Building Apache HBase - Thrift 1.3.0-SNAPSHOT
[INFO] ------------------------------------------------------------------------
Downloading: https://repository.apache.org/content/repositories/releases/org/apache/thrift/libthrift/0.9.2/libthrift-0.9.2.pom
4/4 KB   
         
Downloaded: https://repository.apache.org/content/repositories/releases/org/apache/thrift/libthrift/0.9.2/libthrift-0.9.2.pom
(4 KB at 17.3 KB/sec)
Downloading: https://repository.apache.org/content/repositories/releases/org/apache/thrift/libthrift/0.9.2/libthrift-0.9.2.jar
4/223 KB   
8/223 KB   
8/223 KB   
12/223 KB   
14/223 KB   
16/223 KB   
20/223 KB   
22/223 KB   
24/223 KB   
28/223 KB   
30/223 KB   
32/223 KB   
36/223 KB   
38/223 KB   
40/223 KB   
44/223 KB   
45/223 KB   
48/223 KB   
52/223 KB   
53/223 KB   
56/223 KB   
60/223 KB   
61/223 KB   
64/223 KB   
68/223 KB   
69/223 KB   
72/223 KB   
76/223 KB   
77/223 KB   
80/223 KB   
84/223 KB   
85/223 KB   
88/223 KB   
92/223 KB   
96/223 KB   
96/223 KB   
100/223 KB   
104/223 KB   
104/223 KB   
108/223 KB   
112/223 KB   
112/223 KB   
116/223 KB   
120/223 KB   
120/223 KB   
124/223 KB   
128/223 KB   
128/223 KB   
131/223 KB   
135/223 KB   
136/223 KB   
139/223 KB   
143/223 KB   
144/223 KB   
147/223 KB   
151/223 KB   
152/223 KB   
155/223 KB   
159/223 KB   
160/223 KB   
163/223 KB   
167/223 KB   
168/223 KB   
170/223 KB   
174/223 KB   
176/223 KB   
178/223 KB   
182/223 KB   
184/223 KB   
186/223 KB   
190/223 KB   
192/223 KB   
194/223 KB   
198/223 KB   
200/223 KB   
202/223 KB   
206/223 KB   
208/223 KB   
210/223 KB   
214/223 KB   
216/223 KB   
217/223 KB   
221/223 KB   
223/223 KB   
             
Downloaded: https://repository.apache.org/content/repositories/releases/org/apache/thrift/libthrift/0.9.2/libthrift-0.9.2.jar
(223 KB at 1106.3 KB/sec)
[INFO] 
[INFO] --- maven-enforcer-plugin:1.0.1:enforce (enforce) @ hbase-thrift ---
[INFO] 
[INFO] --- buildnumber-maven-plugin:1.3:create-timestamp (default) @ hbase-thrift ---
[INFO] 
[INFO] --- jacoco-maven-plugin:0.7.5.201505241946:prepare-agent (prepare-agent) @ hbase-thrift
---
[INFO] Skipping JaCoCo execution because property jacoco.skip is set.
[INFO] argLine set to empty
[INFO] 
[INFO] --- maven-antrun-plugin:1.6:run (generate) @ hbase-thrift ---
[INFO] Executing tasks

main:
    [mkdir] Created dir: <https://builds.apache.org/job/HBase-1.3/jdk=latest1.7,label=Hadoop/ws/hbase-thrift/target/hbase-webapps>
     [copy] Copying 17 files to <https://builds.apache.org/job/HBase-1.3/jdk=latest1.7,label=Hadoop/ws/hbase-thrift/target/hbase-webapps>
log4j:WARN No appenders could be found for logger (org.mortbay.log).
log4j:WARN Please initialize the log4j system properly.
log4j:WARN See http://logging.apache.org/log4j/1.2/faq.html#noconfig for more info.
    [mkdir] Created dir: <https://builds.apache.org/job/HBase-1.3/jdk=latest1.7,label=Hadoop/ws/hbase-thrift/target/hbase-webapps/thrift/WEB-INF>
[INFO] Executed tasks
[INFO] 
[INFO] --- build-helper-maven-plugin:1.9.1:add-source (jspcSource-packageInfo-source) @ hbase-thrift
---
[INFO] Source directory: <https://builds.apache.org/job/HBase-1.3/jdk=latest1.7,label=Hadoop/ws/hbase-thrift/target/generated-sources/java>
added.
[INFO] 
[INFO] --- maven-remote-resources-plugin:1.5:process (default) @ hbase-thrift ---
[INFO] 
[INFO] --- maven-resources-plugin:2.6:resources (default-resources) @ hbase-thrift ---
[INFO] Using 'UTF-8' encoding to copy filtered resources.
[INFO] Copying 18 resources
[INFO] Copying 3 resources
[INFO] 
[INFO] --- maven-compiler-plugin:2.5.1:compile (default-compile) @ hbase-thrift ---
[INFO] Compiling 53 source files to <https://builds.apache.org/job/HBase-1.3/jdk=latest1.7,label=Hadoop/ws/hbase-thrift/target/classes>
[INFO] 
[INFO] --- maven-dependency-plugin:2.1:build-classpath (create-mrapp-generated-classpath)
@ hbase-thrift ---
[INFO] Wrote classpath file '<https://builds.apache.org/job/HBase-1.3/jdk=latest1.7,label=Hadoop/ws/hbase-thrift/target/test-classes/mrapp-generated-classpath'.>
[INFO] 
[INFO] --- maven-resources-plugin:2.6:testResources (default-testResources) @ hbase-thrift
---
[INFO] Using 'UTF-8' encoding to copy filtered resources.
[INFO] Copying 2 resources to META-INF/
[INFO] Copying 3 resources
[INFO] Copying 3 resources
[INFO] 
[INFO] --- maven-compiler-plugin:2.5.1:testCompile (default-testCompile) @ hbase-thrift ---
[INFO] Compiling 6 source files to <https://builds.apache.org/job/HBase-1.3/jdk=latest1.7,label=Hadoop/ws/hbase-thrift/target/test-classes>
[INFO] 
[INFO] --- maven-surefire-plugin:2.18.1:test (default-test) @ hbase-thrift ---
[INFO] Surefire report directory: <https://builds.apache.org/job/HBase-1.3/jdk=latest1.7,label=Hadoop/ws/hbase-thrift/target/surefire-reports>
[INFO] Using configured provider org.apache.maven.surefire.junitcore.JUnitCoreProvider
[INFO] parallel='none', perCoreThreadCount=true, threadCount=0, useUnlimitedThreads=false,
threadCountSuites=0, threadCountClasses=0, threadCountMethods=0, parallelOptimized=true

-------------------------------------------------------
 T E S T S
-------------------------------------------------------
Running org.apache.hadoop.hbase.thrift2.TestThriftHBaseServiceHandlerWithLabels
Tests run: 6, Failures: 0, Errors: 0, Skipped: 0, Time elapsed: 1.836 sec - in org.apache.hadoop.hbase.thrift2.TestThriftHBaseServiceHandlerWithLabels
Running org.apache.hadoop.hbase.thrift2.TestThriftHBaseServiceHandler
Tests run: 21, Failures: 0, Errors: 0, Skipped: 0, Time elapsed: 2.217 sec - in org.apache.hadoop.hbase.thrift2.TestThriftHBaseServiceHandler
Running org.apache.hadoop.hbase.thrift.TestThriftHttpServer
Tests run: 2, Failures: 0, Errors: 0, Skipped: 0, Time elapsed: 4.979 sec - in org.apache.hadoop.hbase.thrift.TestThriftHttpServer
Running org.apache.hadoop.hbase.thrift.TestCallQueue
Tests run: 18, Failures: 0, Errors: 0, Skipped: 0, Time elapsed: 0.44 sec - in org.apache.hadoop.hbase.thrift.TestCallQueue
Running org.apache.hadoop.hbase.thrift.TestThriftServer
Killed
Running org.apache.hadoop.hbase.thrift.TestThriftServerCmdLine
Tests run: 32, Failures: 0, Errors: 0, Skipped: 0, Time elapsed: 51.75 sec - in org.apache.hadoop.hbase.thrift.TestThriftServerCmdLine

Results :

Tests run: 79, Failures: 0, Errors: 0, Skipped: 0

[INFO] ------------------------------------------------------------------------
[INFO] Reactor Summary:
[INFO] 
[INFO] Apache HBase ...................................... SUCCESS [1:41.628s]
[INFO] Apache HBase - Checkstyle ......................... SUCCESS [9.970s]
[INFO] Apache HBase - Resource Bundle .................... SUCCESS [0.229s]
[INFO] Apache HBase - Annotations ........................ SUCCESS [1.094s]
[INFO] Apache HBase - Protocol ........................... SUCCESS [17.222s]
[INFO] Apache HBase - Common ............................. SUCCESS [2:00.057s]
[INFO] Apache HBase - Procedure .......................... SUCCESS [1:56.261s]
[INFO] Apache HBase - Client ............................. SUCCESS [1:31.109s]
[INFO] Apache HBase - Hadoop Compatibility ............... SUCCESS [8.332s]
[INFO] Apache HBase - Hadoop Two Compatibility ........... SUCCESS [10.746s]
[INFO] Apache HBase - Prefix Tree ........................ SUCCESS [10.579s]
[INFO] Apache HBase - Server ............................. SUCCESS [2:00:58.308s]
[INFO] Apache HBase - Testing Util ....................... SUCCESS [2.032s]
[INFO] Apache HBase - Thrift ............................. FAILURE [2:20.928s]
[INFO] Apache HBase - Rest ............................... SKIPPED
[INFO] Apache HBase - Shell .............................. SKIPPED
[INFO] Apache HBase - Integration Tests .................. SKIPPED
[INFO] Apache HBase - Examples ........................... SKIPPED
[INFO] Apache HBase - External Block Cache ............... SKIPPED
[INFO] Apache HBase - Assembly ........................... SKIPPED
[INFO] Apache HBase - Shaded ............................. SKIPPED
[INFO] Apache HBase - Shaded - Client .................... SKIPPED
[INFO] Apache HBase - Shaded - Server .................... SKIPPED
[INFO] ------------------------------------------------------------------------
[INFO] BUILD FAILURE
[INFO] ------------------------------------------------------------------------
[INFO] Total time: 2:12:00.097s
[INFO] Finished at: Thu Oct 08 04:02:48 UTC 2015
[INFO] Final Memory: 107M/597M
[INFO] ------------------------------------------------------------------------
[ERROR] Failed to execute goal org.apache.maven.plugins:maven-surefire-plugin:2.18.1:test
(default-test) on project hbase-thrift: ExecutionException: java.lang.RuntimeException: The
forked VM terminated without properly saying goodbye. VM crash or System.exit called?
[ERROR] Command was /bin/sh -c cd <https://builds.apache.org/job/HBase-1.3/jdk=latest1.7,label=Hadoop/ws/hbase-thrift>
&& /home/jenkins/jenkins-slave/tools/hudson.model.JDK/latest1.7/jre/bin/java -enableassertions
-Dhbase.test -Xmx2800m -XX:MaxPermSize=256m -Djava.security.egd=file:/dev/./urandom -Djava.net.preferIPv4Stack=true
-Djava.awt.headless=true -jar <https://builds.apache.org/job/HBase-1.3/jdk=latest1.7,label=Hadoop/ws/hbase-thrift/target/surefire/surefirebooter5111883534488398959.jar>
<https://builds.apache.org/job/HBase-1.3/jdk=latest1.7,label=Hadoop/ws/hbase-thrift/target/surefire/surefire2434257038137721234tmp>
<https://builds.apache.org/job/HBase-1.3/jdk=latest1.7,label=Hadoop/ws/hbase-thrift/target/surefire/surefire_13601920205364738569497tmp>
[ERROR] -> [Help 1]
[ERROR] 
[ERROR] To see the full stack trace of the errors, re-run Maven with the -e switch.
[ERROR] Re-run Maven using the -X switch to enable full debug logging.
[ERROR] 
[ERROR] For more information about the errors and possible solutions, please read the following
articles:
[ERROR] [Help 1] http://cwiki.apache.org/confluence/display/MAVEN/MojoFailureException
[ERROR] 
[ERROR] After correcting the problems, you can resume the build with the command
[ERROR]   mvn <goals> -rf :hbase-thrift
Build step 'Invoke top-level Maven targets' marked build as failure
Performing Post build task...
Match found for :.* : True
Logical operation result is TRUE
Running script  :   ZOMBIE_TESTS_COUNT=`jps | grep surefirebooter | wc -l`
  if [[ $ZOMBIE_TESTS_COUNT != 0 ]] ; then
    #It seems sometimes the tests are not dying immediately. Let's give them 10s
    echo "Suspicious java process found - waiting 10s to see if there are just slow to stop"
    sleep 10   
    ZOMBIE_TESTS_COUNT=`jps | grep surefirebooter | wc -l`
    if [[ $ZOMBIE_TESTS_COUNT != 0 ]] ; then
      echo "There are $ZOMBIE_TESTS_COUNT zombie tests, they should have been killed by surefire
but survived"
      echo "************ BEGIN zombies jstack extract"
      ZB_STACK=`jps | grep surefirebooter | cut -d ' ' -f 1 | xargs -n 1 jstack | grep ".test"
| grep "\.java"`
      jps | grep surefirebooter | cut -d ' ' -f 1 | xargs -n 1 jstack
      echo "************ END  zombies jstack extract"
      JIRA_COMMENT="$JIRA_COMMENT

     {color:red}-1 core zombie tests{color}.  There are ${ZOMBIE_TESTS_COUNT} zombie test(s):
${ZB_STACK}"
      BAD=1
      jps | grep surefirebooter | cut -d ' ' -f 1 | xargs kill -9
    else
      echo "We're ok: there is no zombie test, but some tests took some time to stop"
    fi
  else
    echo "We're ok: there is no zombie test"
  fi
[Hadoop] $ /bin/bash -xe /tmp/hudson4087175675949174720.sh
++ jps
++ grep surefirebooter
++ wc -l
+ ZOMBIE_TESTS_COUNT=0
+ [[ 0 != 0 ]]
+ echo 'We'\''re ok: there is no zombie test'
We're ok: there is no zombie test
POST BUILD TASK : SUCCESS
END OF POST BUILD TASK : 0
Archiving artifacts

Mime
View raw message