hbase-builds mailing list archives

Site index · List index
Message view « Date » · « Thread »
Top « Date » · « Thread »
From Apache Jenkins Server <jenk...@builds.apache.org>
Subject Build failed in Jenkins: HBase-1.3 » latest1.7,Hadoop #291
Date Thu, 22 Oct 2015 21:47:54 GMT
See <https://builds.apache.org/job/HBase-1.3/jdk=latest1.7,label=Hadoop/291/changes>

Changes:

[matteo.bertozzi] HBASE-14667 HBaseFsck constructors have diverged

------------------------------------------
[...truncated 48183 lines...]
13201/13509 KB   
13205/13509 KB   
13208/13509 KB   
13212/13509 KB   
13216/13509 KB   
13220/13509 KB   
13221/13509 KB   
13225/13509 KB   
13229/13509 KB   
13233/13509 KB   
13237/13509 KB   
13241/13509 KB   
13242/13509 KB   
13246/13509 KB   
13247/13509 KB   
13251/13509 KB   
13255/13509 KB   
13258/13509 KB   
13262/13509 KB   
13264/13509 KB   
13266/13509 KB   
13267/13509 KB   
13270/13509 KB   
13272/13509 KB   
13276/13509 KB   
13279/13509 KB   
13283/13509 KB   
13287/13509 KB   
13288/13509 KB   
13292/13509 KB   
13295/13509 KB   
13296/13509 KB   
13300/13509 KB   
13304/13509 KB   
13308/13509 KB   
13310/13509 KB   
13314/13509 KB   
13318/13509 KB   
13322/13509 KB   
13326/13509 KB   
13330/13509 KB   
13334/13509 KB   
13338/13509 KB   
13342/13509 KB   
13346/13509 KB   
13350/13509 KB   
13354/13509 KB   
13358/13509 KB   
13362/13509 KB   
13366/13509 KB   
13370/13509 KB   
13374/13509 KB   
13378/13509 KB   
13380/13509 KB   
13382/13509 KB   
13385/13509 KB   
13389/13509 KB   
13391/13509 KB   
13393/13509 KB   
13396/13509 KB   
13399/13509 KB   
13403/13509 KB   
13407/13509 KB   
13411/13509 KB   
13412/13509 KB   
13414/13509 KB   
13418/13509 KB   
13420/13509 KB   
13424/13509 KB   
13426/13509 KB   
13429/13509 KB   
13430/13509 KB   
13433/13509 KB   
13436/13509 KB   
13439/13509 KB   
13441/13509 KB   
13443/13509 KB   
13446/13509 KB   
13447/13509 KB   
13451/13509 KB   
13453/13509 KB   
13457/13509 KB   
13459/13509 KB   
13463/13509 KB   
13467/13509 KB   
13471/13509 KB   
13472/13509 KB   
13476/13509 KB   
13480/13509 KB   
13483/13509 KB   
13487/13509 KB   
13488/13509 KB   
13491/13509 KB   
13495/13509 KB   
13499/13509 KB   
13503/13509 KB   
13507/13509 KB   
13509/13509 KB   
                 
Downloaded: http://repository.jboss.org/nexus/content/groups/public-jboss/org/jruby/jruby-complete/1.6.8/jruby-complete-1.6.8.jar
(13509 KB at 2825.4 KB/sec)
[INFO] 
[INFO] --- maven-enforcer-plugin:1.0.1:enforce (enforce) @ hbase-shell ---
[INFO] 
[INFO] --- buildnumber-maven-plugin:1.3:create-timestamp (default) @ hbase-shell ---
[INFO] 
[INFO] --- build-helper-maven-plugin:1.9.1:add-source (jspcSource-packageInfo-source) @ hbase-shell
---
[INFO] Source directory: <https://builds.apache.org/job/HBase-1.3/jdk=latest1.7,label=Hadoop/ws/hbase-shell/target/generated-jamon>
added.
[INFO] Source directory: <https://builds.apache.org/job/HBase-1.3/jdk=latest1.7,label=Hadoop/ws/hbase-shell/target/generated-sources/java>
added.
[INFO] 
[INFO] --- maven-remote-resources-plugin:1.5:process (default) @ hbase-shell ---
[INFO] 
[INFO] --- maven-resources-plugin:2.6:resources (default-resources) @ hbase-shell ---
[INFO] Using 'UTF-8' encoding to copy filtered resources.
[INFO] Copying 0 resource
[INFO] Copying 3 resources
[INFO] 
[INFO] --- maven-compiler-plugin:2.5.1:compile (default-compile) @ hbase-shell ---
[INFO] No sources to compile
[INFO] 
[INFO] --- maven-dependency-plugin:2.1:build-classpath (create-mrapp-generated-classpath)
@ hbase-shell ---
[INFO] Wrote classpath file '<https://builds.apache.org/job/HBase-1.3/jdk=latest1.7,label=Hadoop/ws/hbase-shell/target/test-classes/mrapp-generated-classpath'.>
[INFO] 
[INFO] --- maven-resources-plugin:2.6:testResources (default-testResources) @ hbase-shell
---
[INFO] Using 'UTF-8' encoding to copy filtered resources.
[INFO] skip non existing resourceDirectory <https://builds.apache.org/job/HBase-1.3/jdk=latest1.7,label=Hadoop/ws/hbase-shell/src/test/resources>
[INFO] Copying 3 resources
[INFO] 
[INFO] --- maven-compiler-plugin:2.5.1:testCompile (default-testCompile) @ hbase-shell ---
[INFO] Compiling 3 source files to <https://builds.apache.org/job/HBase-1.3/jdk=latest1.7,label=Hadoop/ws/hbase-shell/target/test-classes>
[INFO] 
[INFO] --- maven-surefire-plugin:2.18.1:test (default-test) @ hbase-shell ---
[INFO] Surefire report directory: <https://builds.apache.org/job/HBase-1.3/jdk=latest1.7,label=Hadoop/ws/hbase-shell/target/surefire-reports>
[INFO] Using configured provider org.apache.maven.surefire.junitcore.JUnitCoreProvider
[INFO] parallel='none', perCoreThreadCount=true, threadCount=0, useUnlimitedThreads=false,
threadCountSuites=0, threadCountClasses=0, threadCountMethods=0, parallelOptimized=true

-------------------------------------------------------
 T E S T S
-------------------------------------------------------

Results :

Tests run: 0, Failures: 0, Errors: 0, Skipped: 0

[INFO] 
[INFO] --- maven-surefire-plugin:2.18.1:test (secondPartTestsExecution) @ hbase-shell ---
[INFO] Surefire report directory: <https://builds.apache.org/job/HBase-1.3/jdk=latest1.7,label=Hadoop/ws/hbase-shell/target/surefire-reports>
[INFO] Using configured provider org.apache.maven.surefire.junitcore.JUnitCoreProvider
[INFO] parallel='none', perCoreThreadCount=true, threadCount=0, useUnlimitedThreads=false,
threadCountSuites=0, threadCountClasses=0, threadCountMethods=0, parallelOptimized=true

-------------------------------------------------------
 T E S T S
-------------------------------------------------------
Running org.apache.hadoop.hbase.client.TestReplicationShell
Tests run: 1, Failures: 0, Errors: 0, Skipped: 1, Time elapsed: 0.001 sec - in org.apache.hadoop.hbase.client.TestReplicationShell
Running org.apache.hadoop.hbase.client.TestShell
Killed

Results :

Tests run: 1, Failures: 0, Errors: 0, Skipped: 1

[INFO] ------------------------------------------------------------------------
[INFO] Reactor Summary:
[INFO] 
[INFO] Apache HBase ...................................... SUCCESS [1:25.756s]
[INFO] Apache HBase - Checkstyle ......................... SUCCESS [7.547s]
[INFO] Apache HBase - Resource Bundle .................... SUCCESS [0.243s]
[INFO] Apache HBase - Annotations ........................ SUCCESS [1.286s]
[INFO] Apache HBase - Protocol ........................... SUCCESS [17.540s]
[INFO] Apache HBase - Common ............................. SUCCESS [2:09.220s]
[INFO] Apache HBase - Procedure .......................... SUCCESS [1:55.151s]
[INFO] Apache HBase - Client ............................. SUCCESS [1:31.337s]
[INFO] Apache HBase - Hadoop Compatibility ............... SUCCESS [9.131s]
[INFO] Apache HBase - Hadoop Two Compatibility ........... SUCCESS [10.073s]
[INFO] Apache HBase - Prefix Tree ........................ SUCCESS [10.966s]
[INFO] Apache HBase - Server ............................. SUCCESS [1:54:36.011s]
[INFO] Apache HBase - Testing Util ....................... SUCCESS [5.170s]
[INFO] Apache HBase - Thrift ............................. SUCCESS [3:45.925s]
[INFO] Apache HBase - Rest ............................... SUCCESS [9:46.356s]
[INFO] Apache HBase - Shell .............................. FAILURE [1:04.545s]
[INFO] Apache HBase - Integration Tests .................. SKIPPED
[INFO] Apache HBase - Examples ........................... SKIPPED
[INFO] Apache HBase - External Block Cache ............... SKIPPED
[INFO] Apache HBase - Assembly ........................... SKIPPED
[INFO] Apache HBase - Shaded ............................. SKIPPED
[INFO] Apache HBase - Shaded - Client .................... SKIPPED
[INFO] Apache HBase - Shaded - Server .................... SKIPPED
[INFO] ------------------------------------------------------------------------
[INFO] BUILD FAILURE
[INFO] ------------------------------------------------------------------------
[INFO] Total time: 2:17:42.026s
[INFO] Finished at: Thu Oct 22 21:46:19 UTC 2015
[INFO] Final Memory: 117M/619M
[INFO] ------------------------------------------------------------------------
[ERROR] Failed to execute goal org.apache.maven.plugins:maven-surefire-plugin:2.18.1:test
(secondPartTestsExecution) on project hbase-shell: ExecutionException: java.lang.RuntimeException:
The forked VM terminated without properly saying goodbye. VM crash or System.exit called?
[ERROR] Command was /bin/sh -c cd <https://builds.apache.org/job/HBase-1.3/jdk=latest1.7,label=Hadoop/ws/hbase-shell>
&& /home/jenkins/jenkins-slave/tools/hudson.model.JDK/latest1.7/jre/bin/java -enableassertions
-Dhbase.test -Xmx2800m -XX:MaxPermSize=256m -Djava.security.egd=file:/dev/./urandom -Djava.net.preferIPv4Stack=true
-Djava.awt.headless=true -jar <https://builds.apache.org/job/HBase-1.3/jdk=latest1.7,label=Hadoop/ws/hbase-shell/target/surefire/surefirebooter2265715772363848095.jar>
<https://builds.apache.org/job/HBase-1.3/jdk=latest1.7,label=Hadoop/ws/hbase-shell/target/surefire/surefire8007476918119906855tmp>
<https://builds.apache.org/job/HBase-1.3/jdk=latest1.7,label=Hadoop/ws/hbase-shell/target/surefire/surefire_1421575432565613272941tmp>
[ERROR] -> [Help 1]
[ERROR] 
[ERROR] To see the full stack trace of the errors, re-run Maven with the -e switch.
[ERROR] Re-run Maven using the -X switch to enable full debug logging.
[ERROR] 
[ERROR] For more information about the errors and possible solutions, please read the following
articles:
[ERROR] [Help 1] http://cwiki.apache.org/confluence/display/MAVEN/MojoFailureException
[ERROR] 
[ERROR] After correcting the problems, you can resume the build with the command
[ERROR]   mvn <goals> -rf :hbase-shell
Build step 'Invoke top-level Maven targets' marked build as failure
Performing Post build task...
Match found for :.* : True
Logical operation result is TRUE
Running script  :     ZOMBIE_TESTS_COUNT=`jps -v | grep surefirebooter | grep '-Dhbase.test'
| wc -l`
  if [[ $ZOMBIE_TESTS_COUNT != 0 ]] ; then
    #It seems sometimes the tests are not dying immediately. Let's give them 30s
    echo "Suspicious java process found - waiting 30s to see if there are just slow to stop"
    sleep 30
    ZOMBIE_TESTS_COUNT=`jps -v | grep surefirebooter | grep '-Dhbase.test' | wc -l`
    if [[ $ZOMBIE_TESTS_COUNT != 0 ]] ; then
      echo "There are $ZOMBIE_TESTS_COUNT zombie tests, they should have been killed by surefire
but survived"
      echo "************ zombies jps listing"
      jps -v
      jps -v | grep surefirebooter | grep '-Dhbase.test'
      echo "************ BEGIN zombies jstack extract"
      # HBase tests have been flagged with an innocuous '-Dhbase.test' just so they can
      # be identified as hbase in a process listing.
      ZB_STACK=`jps -v | grep surefirebooter | grep '-Dhbase.test' | cut -d ' ' -f 1 | xargs
-n 1 jstack | grep ".test" | grep "\.java"`
      jps -v | grep surefirebooter | grep '-Dhbase.test' | cut -d ' ' -f 1 | xargs -n 1 jstack
      echo "************ END  zombies jstack extract"
      JIRA_COMMENT="$JIRA_COMMENT

     {color:red}-1 core zombie tests{color}.  There are ${ZOMBIE_TESTS_COUNT} zombie test(s):
${ZB_STACK}"
      BAD=1
      # Killing these zombies
      echo 'Killing ZOMBIES!!!'
      jps -v
      jps -v | grep surefirebooter | grep '-Dhbase.test' | cut -d ' ' -f 1 | xargs kill -9
    else
      echo "We're ok: there is no zombie test, but some tests took some time to stop"
    fi
[Hadoop] $ /bin/bash -xe /tmp/hudson8252982472206937505.sh
++ jps -v
++ grep surefirebooter
++ grep -Dhbase.test
++ wc -l
grep: unknown devices method
+ ZOMBIE_TESTS_COUNT=0
/tmp/hudson8252982472206937505.sh: line 30: syntax error: unexpected end of file
POST BUILD TASK : FAILURE
END OF POST BUILD TASK : 0
Archiving artifacts

Mime
View raw message