hbase-builds mailing list archives

Site index · List index
Message view « Date » · « Thread »
Top « Date » · « Thread »
From Apache Jenkins Server <jenk...@builds.apache.org>
Subject Build failed in Jenkins: HBase-1.0 #1074
Date Wed, 07 Oct 2015 07:58:11 GMT
See <https://builds.apache.org/job/HBase-1.0/1074/changes>

Changes:

[stack] HBASE-14571 Purge TestProcessBasedCluster; it does nothing and then

------------------------------------------
[...truncated 1902 lines...]
Running org.apache.hadoop.hbase.coprocessor.TestCoprocessorTableEndpoint
Tests run: 1, Failures: 0, Errors: 0, Skipped: 0, Time elapsed: 14.229 sec - in org.apache.hadoop.hbase.coprocessor.TestRegionServerCoprocessorExceptionWithRemove
Tests run: 7, Failures: 0, Errors: 0, Skipped: 0, Time elapsed: 8.62 sec - in org.apache.hadoop.hbase.coprocessor.TestMasterObserver
Running org.apache.hadoop.hbase.coprocessor.TestRegionServerCoprocessorExceptionWithAbort
Tests run: 2, Failures: 0, Errors: 0, Skipped: 0, Time elapsed: 3.821 sec - in org.apache.hadoop.hbase.coprocessor.TestCoprocessorTableEndpoint
Running org.apache.hadoop.hbase.coprocessor.TestDoubleColumnInterpreter
Running org.apache.hadoop.hbase.coprocessor.TestCoprocessorEndpoint
Tests run: 6, Failures: 0, Errors: 0, Skipped: 0, Time elapsed: 1.771 sec - in org.apache.hadoop.hbase.coprocessor.TestCoprocessorEndpoint
Tests run: 38, Failures: 0, Errors: 0, Skipped: 0, Time elapsed: 5.756 sec - in org.apache.hadoop.hbase.coprocessor.TestDoubleColumnInterpreter
Tests run: 2, Failures: 0, Errors: 0, Skipped: 0, Time elapsed: 18.578 sec - in org.apache.hadoop.hbase.coprocessor.TestRegionServerCoprocessorExceptionWithAbort
Running org.apache.hadoop.hbase.coprocessor.TestMasterCoprocessorExceptionWithRemove
Running org.apache.hadoop.hbase.coprocessor.TestBatchCoprocessorEndpoint
Running org.apache.hadoop.hbase.coprocessor.TestRowProcessorEndpoint
Tests run: 4, Failures: 0, Errors: 0, Skipped: 0, Time elapsed: 1.971 sec - in org.apache.hadoop.hbase.coprocessor.TestBatchCoprocessorEndpoint
Tests run: 1, Failures: 0, Errors: 0, Skipped: 0, Time elapsed: 4.867 sec - in org.apache.hadoop.hbase.coprocessor.TestMasterCoprocessorExceptionWithRemove
Tests run: 4, Failures: 0, Errors: 0, Skipped: 0, Time elapsed: 6.777 sec - in org.apache.hadoop.hbase.coprocessor.TestRowProcessorEndpoint
Running org.apache.hadoop.hbase.coprocessor.TestRegionObserverInterface
Running org.apache.hadoop.hbase.coprocessor.TestOpenTableInCoprocessor
Tests run: 2, Failures: 0, Errors: 0, Skipped: 0, Time elapsed: 3.186 sec - in org.apache.hadoop.hbase.coprocessor.TestOpenTableInCoprocessor
Running org.apache.hadoop.hbase.coprocessor.TestBigDecimalColumnInterpreter
Tests run: 38, Failures: 0, Errors: 0, Skipped: 0, Time elapsed: 5.053 sec - in org.apache.hadoop.hbase.coprocessor.TestBigDecimalColumnInterpreter
Running org.apache.hadoop.hbase.coprocessor.TestCoprocessorStop
Running org.apache.hadoop.hbase.coprocessor.TestAggregateProtocol
Tests run: 44, Failures: 0, Errors: 0, Skipped: 0, Time elapsed: 5.573 sec - in org.apache.hadoop.hbase.coprocessor.TestAggregateProtocol
Tests run: 1, Failures: 0, Errors: 0, Skipped: 0, Time elapsed: 15.62 sec - in org.apache.hadoop.hbase.coprocessor.TestCoprocessorStop
Tests run: 14, Failures: 0, Errors: 0, Skipped: 0, Time elapsed: 37.794 sec - in org.apache.hadoop.hbase.coprocessor.TestRegionObserverInterface
Running org.apache.hadoop.hbase.coprocessor.TestRegionObserverBypass
Running org.apache.hadoop.hbase.coprocessor.TestHTableWrapper
Running org.apache.hadoop.hbase.backup.example.TestZooKeeperTableArchiveClient
Tests run: 1, Failures: 0, Errors: 0, Skipped: 0, Time elapsed: 2.674 sec - in org.apache.hadoop.hbase.coprocessor.TestHTableWrapper
Tests run: 2, Failures: 0, Errors: 0, Skipped: 0, Time elapsed: 3.033 sec - in org.apache.hadoop.hbase.coprocessor.TestRegionObserverBypass
Running org.apache.hadoop.hbase.regionserver.TestHRegionServerBulkLoad
Tests run: 3, Failures: 0, Errors: 0, Skipped: 0, Time elapsed: 4.446 sec - in org.apache.hadoop.hbase.backup.example.TestZooKeeperTableArchiveClient
Running org.apache.hadoop.hbase.backup.TestHFileArchiving
Running org.apache.hadoop.hbase.regionserver.TestScannerRetriableFailure
Tests run: 1, Failures: 0, Errors: 0, Skipped: 0, Time elapsed: 41.433 sec - in org.apache.hadoop.hbase.regionserver.TestHRegionServerBulkLoad
Tests run: 1, Failures: 0, Errors: 0, Skipped: 0, Time elapsed: 34.841 sec - in org.apache.hadoop.hbase.regionserver.TestScannerRetriableFailure
Tests run: 5, Failures: 0, Errors: 0, Skipped: 0, Time elapsed: 42.752 sec - in org.apache.hadoop.hbase.backup.TestHFileArchiving
Running org.apache.hadoop.hbase.regionserver.TestReversibleScanners
Tests run: 5, Failures: 0, Errors: 0, Skipped: 0, Time elapsed: 6.695 sec - in org.apache.hadoop.hbase.regionserver.TestReversibleScanners
Running org.apache.hadoop.hbase.regionserver.TestRegionFavoredNodes
Running org.apache.hadoop.hbase.regionserver.TestEndToEndSplitTransaction
Running org.apache.hadoop.hbase.regionserver.TestRegionServerNoMaster
Tests run: 1, Failures: 0, Errors: 0, Skipped: 0, Time elapsed: 12.453 sec - in org.apache.hadoop.hbase.regionserver.TestRegionFavoredNodes
Running org.apache.hadoop.hbase.regionserver.TestClusterId
Tests run: 2, Failures: 0, Errors: 0, Skipped: 0, Time elapsed: 16.902 sec - in org.apache.hadoop.hbase.regionserver.TestEndToEndSplitTransaction
Running org.apache.hadoop.hbase.regionserver.TestMajorCompaction
Tests run: 9, Failures: 0, Errors: 0, Skipped: 0, Time elapsed: 17.882 sec - in org.apache.hadoop.hbase.regionserver.TestRegionServerNoMaster
Running org.apache.hadoop.hbase.regionserver.TestServerCustomProtocol
Tests run: 2, Failures: 0, Errors: 0, Skipped: 0, Time elapsed: 27.829 sec - in org.apache.hadoop.hbase.regionserver.TestClusterId
Running org.apache.hadoop.hbase.regionserver.TestEncryptionKeyRotation
Tests run: 7, Failures: 0, Errors: 0, Skipped: 0, Time elapsed: 14.845 sec - in org.apache.hadoop.hbase.regionserver.TestServerCustomProtocol
Running org.apache.hadoop.hbase.regionserver.TestPriorityRpc
Tests run: 3, Failures: 0, Errors: 0, Skipped: 0, Time elapsed: 2.462 sec - in org.apache.hadoop.hbase.regionserver.TestPriorityRpc
Running org.apache.hadoop.hbase.regionserver.TestBlocksRead
Tests run: 4, Failures: 0, Errors: 0, Skipped: 0, Time elapsed: 2.005 sec - in org.apache.hadoop.hbase.regionserver.TestBlocksRead
Running org.apache.hadoop.hbase.regionserver.TestSplitLogWorker
Tests run: 2, Failures: 0, Errors: 0, Skipped: 0, Time elapsed: 13.145 sec - in org.apache.hadoop.hbase.regionserver.TestEncryptionKeyRotation
Tests run: 7, Failures: 0, Errors: 0, Skipped: 0, Time elapsed: 48.814 sec - in org.apache.hadoop.hbase.regionserver.TestMajorCompaction
Running org.apache.hadoop.hbase.regionserver.TestZKLessMergeOnCluster
Tests run: 9, Failures: 0, Errors: 0, Skipped: 0, Time elapsed: 321.28 sec - in org.apache.hadoop.hbase.snapshot.TestSecureExportSnapshot
Running org.apache.hadoop.hbase.regionserver.TestJoinedScanners
Running org.apache.hadoop.hbase.regionserver.TestZKLessSplitOnCluster
Tests run: 3, Failures: 0, Errors: 0, Skipped: 0, Time elapsed: 11.284 sec - in org.apache.hadoop.hbase.regionserver.TestZKLessMergeOnCluster
Tests run: 7, Failures: 0, Errors: 0, Skipped: 0, Time elapsed: 22.263 sec - in org.apache.hadoop.hbase.regionserver.TestSplitLogWorker
Running org.apache.hadoop.hbase.regionserver.TestMinorCompaction
Tests run: 6, Failures: 0, Errors: 0, Skipped: 0, Time elapsed: 4.434 sec - in org.apache.hadoop.hbase.regionserver.TestMinorCompaction
Running org.apache.hadoop.hbase.regionserver.TestRegionServerMetrics
Tests run: 9, Failures: 0, Errors: 0, Skipped: 0, Time elapsed: 6.045 sec - in org.apache.hadoop.hbase.regionserver.TestRegionServerMetrics
Tests run: 1, Failures: 0, Errors: 0, Skipped: 0, Time elapsed: 23.733 sec - in org.apache.hadoop.hbase.regionserver.TestJoinedScanners
Running org.apache.hadoop.hbase.regionserver.TestTags
Running org.apache.hadoop.hbase.regionserver.TestHRegionOnCluster
Running org.apache.hadoop.hbase.regionserver.TestRowTooBig
Tests run: 9, Failures: 0, Errors: 0, Skipped: 0, Time elapsed: 317.397 sec - in org.apache.hadoop.hbase.snapshot.TestExportSnapshot
Tests run: 1, Failures: 0, Errors: 0, Skipped: 0, Time elapsed: 12.315 sec - in org.apache.hadoop.hbase.regionserver.TestHRegionOnCluster
Tests run: 16, Failures: 0, Errors: 0, Skipped: 0, Time elapsed: 38.764 sec - in org.apache.hadoop.hbase.regionserver.TestZKLessSplitOnCluster
Running org.apache.hadoop.hbase.regionserver.TestSeekOptimizations
Running org.apache.hadoop.hbase.regionserver.TestSCVFWithMiniCluster
Tests run: 5, Failures: 0, Errors: 0, Skipped: 0, Time elapsed: 0.34 sec - in org.apache.hadoop.hbase.regionserver.TestSCVFWithMiniCluster
Tests run: 6, Failures: 0, Errors: 0, Skipped: 0, Time elapsed: 5.165 sec - in org.apache.hadoop.hbase.regionserver.TestSeekOptimizations
Running org.apache.hadoop.hbase.regionserver.TestCompactionState
Running org.apache.hadoop.hbase.regionserver.TestCompactionWithCoprocessor
Tests run: 2, Failures: 0, Errors: 0, Skipped: 0, Time elapsed: 14.634 sec - in org.apache.hadoop.hbase.regionserver.TestRowTooBig
Running org.apache.hadoop.hbase.regionserver.TestStoreScanner
Tests run: 16, Failures: 0, Errors: 0, Skipped: 0, Time elapsed: 1.116 sec - in org.apache.hadoop.hbase.regionserver.TestStoreScanner
Running org.apache.hadoop.hbase.regionserver.TestCacheOnWriteInSchema
Tests run: 3, Failures: 0, Errors: 0, Skipped: 0, Time elapsed: 2.931 sec - in org.apache.hadoop.hbase.regionserver.TestCacheOnWriteInSchema
Tests run: 4, Failures: 0, Errors: 0, Skipped: 0, Time elapsed: 32.579 sec - in org.apache.hadoop.hbase.regionserver.TestTags
Running org.apache.hadoop.hbase.regionserver.wal.TestReadOldRootAndMetaEdits
Tests run: 1, Failures: 0, Errors: 0, Skipped: 0, Time elapsed: 0.301 sec - in org.apache.hadoop.hbase.regionserver.wal.TestReadOldRootAndMetaEdits
Running org.apache.hadoop.hbase.regionserver.TestRegionReplicas
Running org.apache.hadoop.hbase.regionserver.wal.TestFSHLog
Running org.apache.hadoop.hbase.regionserver.wal.TestWALReplayCompressed
Tests run: 6, Failures: 0, Errors: 0, Skipped: 0, Time elapsed: 4.691 sec - in org.apache.hadoop.hbase.regionserver.wal.TestFSHLog
Tests run: 5, Failures: 0, Errors: 0, Skipped: 0, Time elapsed: 25.278 sec - in org.apache.hadoop.hbase.regionserver.TestCompactionWithCoprocessor
Tests run: 5, Failures: 0, Errors: 0, Skipped: 0, Time elapsed: 28.015 sec - in org.apache.hadoop.hbase.regionserver.TestCompactionState
Running org.apache.hadoop.hbase.regionserver.wal.TestLogRollAbort
Running org.apache.hadoop.hbase.regionserver.wal.TestSecureWALReplay
Running org.apache.hadoop.hbase.regionserver.wal.TestWALReplay
Tests run: 2, Failures: 0, Errors: 0, Skipped: 0, Time elapsed: 22.865 sec - in org.apache.hadoop.hbase.regionserver.wal.TestLogRollAbort
Running org.apache.hadoop.hbase.regionserver.wal.TestLogRolling
Tests run: 9, Failures: 0, Errors: 0, Skipped: 0, Time elapsed: 39.53 sec - in org.apache.hadoop.hbase.regionserver.wal.TestWALReplayCompressed
Running org.apache.hadoop.hbase.regionserver.wal.TestProtobufLog
Tests run: 1, Failures: 0, Errors: 0, Skipped: 0, Time elapsed: 1.991 sec - in org.apache.hadoop.hbase.regionserver.wal.TestProtobufLog
Running org.apache.hadoop.hbase.regionserver.wal.TestDurability
Tests run: 9, Failures: 0, Errors: 0, Skipped: 0, Time elapsed: 44.108 sec - in org.apache.hadoop.hbase.regionserver.wal.TestSecureWALReplay
Tests run: 2, Failures: 0, Errors: 0, Skipped: 0, Time elapsed: 2.522 sec - in org.apache.hadoop.hbase.regionserver.wal.TestDurability
Tests run: 9, Failures: 0, Errors: 0, Skipped: 0, Time elapsed: 42.168 sec - in org.apache.hadoop.hbase.regionserver.wal.TestWALReplay
Running org.apache.hadoop.hbase.regionserver.wal.TestLogRollPeriod
Running org.apache.hadoop.hbase.regionserver.TestScannerWithBulkload
Running org.apache.hadoop.hbase.regionserver.TestEncryptionRandomKeying
Tests run: 1, Failures: 0, Errors: 0, Skipped: 0, Time elapsed: 1.21 sec - in org.apache.hadoop.hbase.regionserver.TestEncryptionRandomKeying
Tests run: 3, Failures: 0, Errors: 0, Skipped: 0, Time elapsed: 6.596 sec - in org.apache.hadoop.hbase.regionserver.TestScannerWithBulkload
Running org.apache.hadoop.hbase.regionserver.TestDefaultMemStore
Running org.apache.hadoop.hbase.regionserver.handler.TestOpenRegionHandler
Tests run: 6, Failures: 0, Errors: 0, Skipped: 0, Time elapsed: 2.084 sec - in org.apache.hadoop.hbase.regionserver.handler.TestOpenRegionHandler
Running org.apache.hadoop.hbase.regionserver.handler.TestCloseRegionHandler
Tests run: 3, Failures: 0, Errors: 0, Skipped: 0, Time elapsed: 2.516 sec - in org.apache.hadoop.hbase.regionserver.handler.TestCloseRegionHandler
Running org.apache.hadoop.hbase.regionserver.TestMasterAddressTracker
Tests run: 5, Failures: 0, Errors: 0, Skipped: 0, Time elapsed: 1.518 sec - in org.apache.hadoop.hbase.regionserver.TestMasterAddressTracker
Running org.apache.hadoop.hbase.regionserver.TestSplitTransactionOnCluster
Tests run: 2, Failures: 0, Errors: 0, Skipped: 0, Time elapsed: 52.115 sec - in org.apache.hadoop.hbase.regionserver.wal.TestLogRollPeriod
Running org.apache.hadoop.hbase.regionserver.TestParallelPut
Tests run: 23, Failures: 0, Errors: 0, Skipped: 0, Time elapsed: 46.481 sec - in org.apache.hadoop.hbase.regionserver.TestDefaultMemStore
Running org.apache.hadoop.hbase.regionserver.TestRegionServerOnlineConfigChange
Tests run: 2, Failures: 0, Errors: 0, Skipped: 0, Time elapsed: 1.156 sec - in org.apache.hadoop.hbase.regionserver.TestRegionServerOnlineConfigChange
Running org.apache.hadoop.hbase.regionserver.TestCompaction
Tests run: 16, Failures: 0, Errors: 0, Skipped: 0, Time elapsed: 47.814 sec - in org.apache.hadoop.hbase.regionserver.TestSplitTransactionOnCluster
Running org.apache.hadoop.hbase.regionserver.TestRegionMergeTransactionOnCluster
Tests run: 7, Failures: 0, Errors: 0, Skipped: 0, Time elapsed: 173.416 sec - in org.apache.hadoop.hbase.regionserver.TestRegionReplicas
Running org.apache.hadoop.hbase.regionserver.TestRecoveredEdits
Tests run: 3, Failures: 0, Errors: 0, Skipped: 0, Time elapsed: 13.733 sec - in org.apache.hadoop.hbase.regionserver.TestRegionMergeTransactionOnCluster
Tests run: 5, Failures: 0, Errors: 0, Skipped: 0, Time elapsed: 29.862 sec - in org.apache.hadoop.hbase.regionserver.TestCompaction
Running org.apache.hadoop.hbase.regionserver.TestCompoundBloomFilter
Running org.apache.hadoop.hbase.regionserver.TestGetClosestAtOrBefore
Tests run: 3, Failures: 0, Errors: 0, Skipped: 0, Time elapsed: 2.506 sec - in org.apache.hadoop.hbase.regionserver.TestGetClosestAtOrBefore
Tests run: 1, Failures: 0, Errors: 0, Skipped: 0, Time elapsed: 14.867 sec - in org.apache.hadoop.hbase.regionserver.TestRecoveredEdits
Running org.apache.hadoop.hbase.regionserver.TestRegionServerReportForDuty
Tests run: 2, Failures: 0, Errors: 0, Skipped: 0, Time elapsed: 59.822 sec - in org.apache.hadoop.hbase.regionserver.TestParallelPut
Running org.apache.hadoop.hbase.regionserver.TestHRegion
Running org.apache.hadoop.hbase.regionserver.TestAtomicOperation
Tests run: 1, Failures: 0, Errors: 0, Skipped: 0, Time elapsed: 17.339 sec - in org.apache.hadoop.hbase.regionserver.TestRegionServerReportForDuty
Running org.apache.hadoop.hbase.regionserver.TestFSErrorsExposed
Tests run: 3, Failures: 0, Errors: 0, Skipped: 0, Time elapsed: 35.475 sec - in org.apache.hadoop.hbase.regionserver.TestCompoundBloomFilter
Running org.apache.hadoop.hbase.regionserver.TestRSKilledWhenInitializing
Tests run: 1, Failures: 0, Errors: 0, Skipped: 0, Time elapsed: 23.139 sec - in org.apache.hadoop.hbase.regionserver.TestRSKilledWhenInitializing
Running org.apache.hadoop.hbase.regionserver.TestMultiColumnScanner
Tests run: 3, Failures: 0, Errors: 0, Skipped: 0, Time elapsed: 38.011 sec - in org.apache.hadoop.hbase.regionserver.TestFSErrorsExposed
Running org.apache.hadoop.hbase.regionserver.TestFlushRegionEntry
Tests run: 1, Failures: 0, Errors: 0, Skipped: 0, Time elapsed: 1.192 sec - in org.apache.hadoop.hbase.regionserver.TestFlushRegionEntry
Running org.apache.hadoop.hbase.regionserver.TestStore
Tests run: 18, Failures: 0, Errors: 0, Skipped: 0, Time elapsed: 16.987 sec - in org.apache.hadoop.hbase.regionserver.TestStore
Tests run: 6, Failures: 0, Errors: 0, Skipped: 0, Time elapsed: 75.107 sec - in org.apache.hadoop.hbase.regionserver.TestAtomicOperation
Running org.apache.hadoop.hbase.TestMetaTableLocator
Tests run: 7, Failures: 0, Errors: 0, Skipped: 0, Time elapsed: 4.018 sec - in org.apache.hadoop.hbase.TestMetaTableLocator
Tests run: 5, Failures: 0, Errors: 0, Skipped: 0, Time elapsed: 259.528 sec - in org.apache.hadoop.hbase.regionserver.wal.TestLogRolling
Tests run: 12, Failures: 0, Errors: 0, Skipped: 0, Time elapsed: 68.354 sec - in org.apache.hadoop.hbase.regionserver.TestMultiColumnScanner
Tests run: 96, Failures: 0, Errors: 0, Skipped: 0, Time elapsed: 148.778 sec - in org.apache.hadoop.hbase.regionserver.TestHRegion

Results :


Tests in error: 
  TestAssignmentManager.testBalanceOnMasterFailoverScenarioWithOpenedNode:269 ยป TestTimedOut


Tests run: 2240, Failures: 0, Errors: 1, Skipped: 18

[INFO] ------------------------------------------------------------------------
[INFO] Reactor Summary:
[INFO] 
[INFO] Apache HBase ...................................... SUCCESS [4.038s]
[INFO] Apache HBase - Checkstyle ......................... SUCCESS [0.867s]
[INFO] Apache HBase - Resource Bundle .................... SUCCESS [0.241s]
[INFO] Apache HBase - Annotations ........................ SUCCESS [1.913s]
[INFO] Apache HBase - Common ............................. SUCCESS [1:03.946s]
[INFO] Apache HBase - Protocol ........................... SUCCESS [9.930s]
[INFO] Apache HBase - Client ............................. SUCCESS [1:23.281s]
[INFO] Apache HBase - Hadoop Compatibility ............... SUCCESS [7.492s]
[INFO] Apache HBase - Hadoop Two Compatibility ........... SUCCESS [7.282s]
[INFO] Apache HBase - Prefix Tree ........................ SUCCESS [9.274s]
[INFO] Apache HBase - Server ............................. FAILURE [1:08:47.788s]
[INFO] Apache HBase - Testing Util ....................... SKIPPED
[INFO] Apache HBase - Thrift ............................. SKIPPED
[INFO] Apache HBase - Rest ............................... SKIPPED
[INFO] Apache HBase - Shell .............................. SKIPPED
[INFO] Apache HBase - Integration Tests .................. SKIPPED
[INFO] Apache HBase - Examples ........................... SKIPPED
[INFO] Apache HBase - Assembly ........................... SKIPPED
[INFO] ------------------------------------------------------------------------
[INFO] BUILD FAILURE
[INFO] ------------------------------------------------------------------------
[INFO] Total time: 1:11:57.765s
[INFO] Finished at: Wed Oct 07 07:56:39 UTC 2015
[INFO] Final Memory: 46M/580M
[INFO] ------------------------------------------------------------------------
[ERROR] Failed to execute goal org.apache.maven.plugins:maven-surefire-plugin:2.18:test (secondPartTestsExecution)
on project hbase-server: There are test failures.
[ERROR] 
[ERROR] Please refer to <https://builds.apache.org/job/HBase-1.0/ws/hbase-server/target/surefire-reports>
for the individual test results.
[ERROR] -> [Help 1]
[ERROR] 
[ERROR] To see the full stack trace of the errors, re-run Maven with the -e switch.
[ERROR] Re-run Maven using the -X switch to enable full debug logging.
[ERROR] 
[ERROR] For more information about the errors and possible solutions, please read the following
articles:
[ERROR] [Help 1] http://cwiki.apache.org/confluence/display/MAVEN/MojoFailureException
[ERROR] 
[ERROR] After correcting the problems, you can resume the build with the command
[ERROR]   mvn <goals> -rf :hbase-server
Build step 'Invoke top-level Maven targets' marked build as failure
Performing Post build task...
Match found for :.* : True
Logical operation result is TRUE
Running script  :   ZOMBIE_TESTS_COUNT=`jps | grep surefirebooter | wc -l`
  if [[ $ZOMBIE_TESTS_COUNT != 0 ]] ; then
    #It seems sometimes the tests are not dying immediately. Let's give them 10s
    echo "Suspicious java process found - waiting 10s to see if there are just slow to stop"
    sleep 10   
    ZOMBIE_TESTS_COUNT=`jps | grep surefirebooter | wc -l`
    if [[ $ZOMBIE_TESTS_COUNT != 0 ]] ; then
      echo "There are $ZOMBIE_TESTS_COUNT zombie tests, they should have been killed by surefire
but survived"
      echo "************ BEGIN zombies jstack extract"
      ZB_STACK=`jps | grep surefirebooter | cut -d ' ' -f 1 | xargs -n 1 jstack | grep ".test"
| grep "\.java"`
      jps | grep surefirebooter | cut -d ' ' -f 1 | xargs -n 1 jstack
      echo "************ END  zombies jstack extract"
      JIRA_COMMENT="$JIRA_COMMENT

     {color:red}-1 core zombie tests{color}.  There are ${ZOMBIE_TESTS_COUNT} zombie test(s):
${ZB_STACK}"
      BAD=1
      jps | grep surefirebooter | cut -d ' ' -f 1 | xargs kill -9
    else
      echo "We're ok: there is no zombie test, but some tests took some time to stop"
    fi
  else
    echo "We're ok: there is no zombie test"
  fi
[HBase-1.0] $ /bin/bash -xe /tmp/hudson9108133505846799665.sh
++ jps
++ grep surefirebooter
++ wc -l
+ ZOMBIE_TESTS_COUNT=0
+ [[ 0 != 0 ]]
+ echo 'We'\''re ok: there is no zombie test'
We're ok: there is no zombie test
POST BUILD TASK : SUCCESS
END OF POST BUILD TASK : 0
Archiving artifacts
Recording test results
Updating HBASE-14571

Mime
View raw message