hbase-builds mailing list archives

Site index · List index
Message view « Date » · « Thread »
Top « Date » · « Thread »
From Apache Jenkins Server <jenk...@builds.apache.org>
Subject Build failed in Jenkins: HBase-1.2 » latest1.8,Hadoop #274
Date Mon, 19 Oct 2015 18:52:37 GMT
See <https://builds.apache.org/job/HBase-1.2/jdk=latest1.8,label=Hadoop/274/changes>

Changes:

[stack] HBASE-14646 Move TestCellACLs from medium to large category

[stack] HBASE-14647 Disable

------------------------------------------
[...truncated 43217 lines...]
25/25 KB   67/246 KB   248/281 KB   20/20 KB   5/5 KB   
25/25 KB   71/246 KB   248/281 KB   20/20 KB   5/5 KB   
25/25 KB   71/246 KB   252/281 KB   20/20 KB   5/5 KB   
25/25 KB   71/246 KB   256/281 KB   20/20 KB   5/5 KB   
25/25 KB   75/246 KB   256/281 KB   20/20 KB   5/5 KB   
25/25 KB   79/246 KB   256/281 KB   20/20 KB   5/5 KB   
25/25 KB   83/246 KB   256/281 KB   20/20 KB   5/5 KB   
25/25 KB   87/246 KB   256/281 KB   20/20 KB   5/5 KB   
25/25 KB   87/246 KB   260/281 KB   20/20 KB   5/5 KB   
25/25 KB   91/246 KB   260/281 KB   20/20 KB   5/5 KB   
25/25 KB   95/246 KB   260/281 KB   20/20 KB   5/5 KB   
25/25 KB   99/246 KB   260/281 KB   20/20 KB   5/5 KB   
25/25 KB   103/246 KB   260/281 KB   20/20 KB   5/5 KB   
25/25 KB   103/246 KB   264/281 KB   20/20 KB   5/5 KB   
25/25 KB   107/246 KB   264/281 KB   20/20 KB   5/5 KB   
25/25 KB   111/246 KB   264/281 KB   20/20 KB   5/5 KB   
25/25 KB   115/246 KB   264/281 KB   20/20 KB   5/5 KB   
25/25 KB   115/246 KB   268/281 KB   20/20 KB   5/5 KB   
25/25 KB   119/246 KB   268/281 KB   20/20 KB   5/5 KB   
25/25 KB   119/246 KB   272/281 KB   20/20 KB   5/5 KB   
25/25 KB   123/246 KB   272/281 KB   20/20 KB   5/5 KB   
25/25 KB   123/246 KB   276/281 KB   20/20 KB   5/5 KB   
25/25 KB   127/246 KB   280/281 KB   20/20 KB   5/5 KB   
25/25 KB   127/246 KB   280/281 KB   20/20 KB   5/5 KB   
25/25 KB   131/246 KB   280/281 KB   20/20 KB   5/5 KB   
25/25 KB   131/246 KB   281/281 KB   20/20 KB   5/5 KB   
25/25 KB   135/246 KB   281/281 KB   20/20 KB   5/5 KB   
25/25 KB   139/246 KB   281/281 KB   20/20 KB   5/5 KB   
25/25 KB   143/246 KB   281/281 KB   20/20 KB   5/5 KB   
25/25 KB   147/246 KB   281/281 KB   20/20 KB   5/5 KB   
25/25 KB   151/246 KB   281/281 KB   20/20 KB   5/5 KB   
25/25 KB   155/246 KB   281/281 KB   20/20 KB   5/5 KB   
25/25 KB   159/246 KB   281/281 KB   20/20 KB   5/5 KB   
25/25 KB   163/246 KB   281/281 KB   20/20 KB   5/5 KB   
25/25 KB   167/246 KB   281/281 KB   20/20 KB   5/5 KB   
25/25 KB   171/246 KB   281/281 KB   20/20 KB   5/5 KB   
25/25 KB   175/246 KB   281/281 KB   20/20 KB   5/5 KB   
25/25 KB   179/246 KB   281/281 KB   20/20 KB   5/5 KB   
25/25 KB   183/246 KB   281/281 KB   20/20 KB   5/5 KB   
25/25 KB   187/246 KB   281/281 KB   20/20 KB   5/5 KB   
25/25 KB   191/246 KB   281/281 KB   20/20 KB   5/5 KB   
25/25 KB   195/246 KB   281/281 KB   20/20 KB   5/5 KB   
25/25 KB   199/246 KB   281/281 KB   20/20 KB   5/5 KB   
25/25 KB   203/246 KB   281/281 KB   20/20 KB   5/5 KB   
25/25 KB   207/246 KB   281/281 KB   20/20 KB   5/5 KB   
25/25 KB   211/246 KB   281/281 KB   20/20 KB   5/5 KB   
25/25 KB   215/246 KB   281/281 KB   20/20 KB   5/5 KB   
25/25 KB   219/246 KB   281/281 KB   20/20 KB   5/5 KB   
25/25 KB   223/246 KB   281/281 KB   20/20 KB   5/5 KB   
25/25 KB   227/246 KB   281/281 KB   20/20 KB   5/5 KB   
25/25 KB   231/246 KB   281/281 KB   20/20 KB   5/5 KB   
25/25 KB   235/246 KB   281/281 KB   20/20 KB   5/5 KB   
25/25 KB   239/246 KB   281/281 KB   20/20 KB   5/5 KB   
25/25 KB   243/246 KB   281/281 KB   20/20 KB   5/5 KB   
25/25 KB   246/246 KB   281/281 KB   20/20 KB   5/5 KB   
                                                         
Downloaded: http://repo.maven.apache.org/maven2/org/jamon/jamon-runtime/2.4.0/jamon-runtime-2.4.0.jar
(25 KB at 227.2 KB/sec)
                                                         
Downloaded: http://repo.maven.apache.org/maven2/org/jamon/jamon-processor/2.4.1/jamon-processor-2.4.1.jar
(281 KB at 2597.9 KB/sec)
                                                         
Downloaded: http://repo.maven.apache.org/maven2/org/codehaus/plexus/plexus-compiler-api/1.8.1/plexus-compiler-api-1.8.1.jar
(20 KB at 177.2 KB/sec)
                                                         
Downloaded: http://repo.maven.apache.org/maven2/org/codehaus/plexus/plexus-utils/1.5.5/plexus-utils-1.5.5.jar
(246 KB at 2190.9 KB/sec)
                                                         
Downloaded: http://repo.maven.apache.org/maven2/org/jamon/jamon-api/2.3.0/jamon-api-2.3.0.jar
(5 KB at 39.8 KB/sec)
[INFO] Translating 10 templates from <https://builds.apache.org/job/HBase-1.2/jdk=latest1.8,label=Hadoop/ws/hbase-server/src/main/jamon>
to <https://builds.apache.org/job/HBase-1.2/jdk=latest1.8,label=Hadoop/ws/hbase-server/target/generated-jamon>
[INFO] 
[INFO] --- maven-antrun-plugin:1.6:run (generate) @ hbase-server ---
[INFO] Executing tasks

main:
    [mkdir] Created dir: <https://builds.apache.org/job/HBase-1.2/jdk=latest1.8,label=Hadoop/ws/hbase-server/target/hbase-webapps>
     [copy] Copying 20 files to <https://builds.apache.org/job/HBase-1.2/jdk=latest1.8,label=Hadoop/ws/hbase-server/target/hbase-webapps>
log4j:WARN No appenders could be found for logger (org.mortbay.log).
log4j:WARN Please initialize the log4j system properly.
log4j:WARN See http://logging.apache.org/log4j/1.2/faq.html#noconfig for more info.
    [mkdir] Created dir: <https://builds.apache.org/job/HBase-1.2/jdk=latest1.8,label=Hadoop/ws/hbase-server/target/hbase-webapps/master/WEB-INF>
    [mkdir] Created dir: <https://builds.apache.org/job/HBase-1.2/jdk=latest1.8,label=Hadoop/ws/hbase-server/target/hbase-webapps/regionserver/WEB-INF>
[INFO] Executed tasks
[INFO] 
[INFO] --- maven-remote-resources-plugin:1.5:process (default) @ hbase-server ---
[INFO] 
[INFO] --- maven-resources-plugin:2.6:resources (default-resources) @ hbase-server ---
[INFO] Using 'UTF-8' encoding to copy filtered resources.
[INFO] Copying 22 resources
[INFO] Copying 2 resources
[INFO] 
[INFO] --- maven-compiler-plugin:2.5.1:compile (default-compile) @ hbase-server ---
[INFO] Compiling 786 source files to <https://builds.apache.org/job/HBase-1.2/jdk=latest1.8,label=Hadoop/ws/hbase-server/target/classes>
[WARNING] <https://builds.apache.org/job/HBase-1.2/jdk=latest1.8,label=Hadoop/ws/hbase-server/src/main/java/org/apache/hadoop/hbase/regionserver/HRegionServer.java>:[190,15]
Signal is internal proprietary API and may be removed in a future release
[WARNING] <https://builds.apache.org/job/HBase-1.2/jdk=latest1.8,label=Hadoop/ws/hbase-server/src/main/java/org/apache/hadoop/hbase/regionserver/HRegionServer.java>:[191,15]
SignalHandler is internal proprietary API and may be removed in a future release
[WARNING] <https://builds.apache.org/job/HBase-1.2/jdk=latest1.8,label=Hadoop/ws/hbase-server/src/main/java/org/apache/hadoop/hbase/regionserver/HRegionServer.java>:[605,22]
Signal is internal proprietary API and may be removed in a future release
[WARNING] <https://builds.apache.org/job/HBase-1.2/jdk=latest1.8,label=Hadoop/ws/hbase-server/src/main/java/org/apache/hadoop/hbase/regionserver/HRegionServer.java>:[605,41]
SignalHandler is internal proprietary API and may be removed in a future release
[WARNING] <https://builds.apache.org/job/HBase-1.2/jdk=latest1.8,label=Hadoop/ws/hbase-server/src/main/java/org/apache/hadoop/hbase/regionserver/HRegionServer.java>:[606,25]
Signal is internal proprietary API and may be removed in a future release
[WARNING] <https://builds.apache.org/job/HBase-1.2/jdk=latest1.8,label=Hadoop/ws/hbase-server/src/main/java/org/apache/hadoop/hbase/regionserver/HRegionServer.java>:[605,4]
Signal is internal proprietary API and may be removed in a future release
[INFO] 
[INFO] --- maven-dependency-plugin:2.1:build-classpath (create-mrapp-generated-classpath)
@ hbase-server ---
[INFO] Wrote classpath file '<https://builds.apache.org/job/HBase-1.2/jdk=latest1.8,label=Hadoop/ws/hbase-server/target/test-classes/mrapp-generated-classpath'.>
[INFO] 
[INFO] --- maven-resources-plugin:2.6:testResources (default-testResources) @ hbase-server
---
[INFO] Using 'UTF-8' encoding to copy filtered resources.
[INFO] Copying 1 resource to META-INF/
[INFO] Copying 16 resources
[INFO] 
[INFO] --- maven-compiler-plugin:2.5.1:testCompile (default-testCompile) @ hbase-server ---
[INFO] Compiling 733 source files to <https://builds.apache.org/job/HBase-1.2/jdk=latest1.8,label=Hadoop/ws/hbase-server/target/test-classes>
[INFO] -------------------------------------------------------------
[ERROR] COMPILATION ERROR : 
[INFO] -------------------------------------------------------------
[ERROR] <https://builds.apache.org/job/HBase-1.2/jdk=latest1.8,label=Hadoop/ws/hbase-server/src/test/java/org/apache/hadoop/hbase/security/access/TestCellACLs.java>:[159,27]
error: cannot find symbol
[ERROR]   symbol: class HTable
<https://builds.apache.org/job/HBase-1.2/jdk=latest1.8,label=Hadoop/ws/hbase-server/src/test/java/org/apache/hadoop/hbase/security/access/TestCellACLs.java>:[186,27]
error: cannot find symbol
[ERROR]   symbol: class HTable
<https://builds.apache.org/job/HBase-1.2/jdk=latest1.8,label=Hadoop/ws/hbase-server/src/test/java/org/apache/hadoop/hbase/security/access/TestCellACLs.java>:[197,27]
error: cannot find symbol
[ERROR]   symbol: class HTable
<https://builds.apache.org/job/HBase-1.2/jdk=latest1.8,label=Hadoop/ws/hbase-server/src/test/java/org/apache/hadoop/hbase/security/access/TestCellACLs.java>:[208,27]
error: cannot find symbol
[ERROR]   symbol: class HTable
<https://builds.apache.org/job/HBase-1.2/jdk=latest1.8,label=Hadoop/ws/hbase-server/src/test/java/org/apache/hadoop/hbase/security/access/TestCellACLs.java>:[219,27]
error: cannot find symbol
[ERROR]   symbol: class HTable
<https://builds.apache.org/job/HBase-1.2/jdk=latest1.8,label=Hadoop/ws/hbase-server/src/test/java/org/apache/hadoop/hbase/security/access/TestCellACLs.java>:[249,27]
error: cannot find symbol
[ERROR]   symbol: class HTable
<https://builds.apache.org/job/HBase-1.2/jdk=latest1.8,label=Hadoop/ws/hbase-server/src/test/java/org/apache/hadoop/hbase/security/access/TestCellACLs.java>:[284,27]
error: cannot find symbol
[ERROR]   symbol: class HTable
<https://builds.apache.org/job/HBase-1.2/jdk=latest1.8,label=Hadoop/ws/hbase-server/src/test/java/org/apache/hadoop/hbase/security/access/TestCellACLs.java>:[296,27]
error: cannot find symbol
[ERROR]   symbol: class HTable
<https://builds.apache.org/job/HBase-1.2/jdk=latest1.8,label=Hadoop/ws/hbase-server/src/test/java/org/apache/hadoop/hbase/security/access/TestCellACLs.java>:[310,27]
error: cannot find symbol
[ERROR]   symbol: class HTable
<https://builds.apache.org/job/HBase-1.2/jdk=latest1.8,label=Hadoop/ws/hbase-server/src/test/java/org/apache/hadoop/hbase/security/access/TestCellACLs.java>:[322,27]
error: cannot find symbol
[ERROR]   symbol: class HTable
<https://builds.apache.org/job/HBase-1.2/jdk=latest1.8,label=Hadoop/ws/hbase-server/src/test/java/org/apache/hadoop/hbase/security/access/TestCellACLs.java>:[347,27]
error: cannot find symbol
[ERROR]   symbol: class HTable
<https://builds.apache.org/job/HBase-1.2/jdk=latest1.8,label=Hadoop/ws/hbase-server/src/test/java/org/apache/hadoop/hbase/security/access/TestCellACLs.java>:[359,27]
error: cannot find symbol
[ERROR]   symbol: class HTable
<https://builds.apache.org/job/HBase-1.2/jdk=latest1.8,label=Hadoop/ws/hbase-server/src/test/java/org/apache/hadoop/hbase/security/access/TestCellACLs.java>:[396,27]
error: cannot find symbol
[INFO] 13 errors 
[INFO] -------------------------------------------------------------
[INFO] ------------------------------------------------------------------------
[INFO] Reactor Summary:
[INFO] 
[INFO] Apache HBase ...................................... SUCCESS [1:32.358s]
[INFO] Apache HBase - Checkstyle ......................... SUCCESS [7.017s]
[INFO] Apache HBase - Resource Bundle .................... SUCCESS [0.171s]
[INFO] Apache HBase - Annotations ........................ SUCCESS [1.332s]
[INFO] Apache HBase - Protocol ........................... SUCCESS [19.878s]
[INFO] Apache HBase - Common ............................. SUCCESS [4:09.987s]
[INFO] Apache HBase - Procedure .......................... SUCCESS [1:56.813s]
[INFO] Apache HBase - Client ............................. SUCCESS [2:32.471s]
[INFO] Apache HBase - Hadoop Compatibility ............... SUCCESS [8.598s]
[INFO] Apache HBase - Hadoop Two Compatibility ........... SUCCESS [9.195s]
[INFO] Apache HBase - Prefix Tree ........................ SUCCESS [9.133s]
[INFO] Apache HBase - Server ............................. FAILURE [43.946s]
[INFO] Apache HBase - Testing Util ....................... SKIPPED
[INFO] Apache HBase - Thrift ............................. SKIPPED
[INFO] Apache HBase - Rest ............................... SKIPPED
[INFO] Apache HBase - Shell .............................. SKIPPED
[INFO] Apache HBase - Integration Tests .................. SKIPPED
[INFO] Apache HBase - Examples ........................... SKIPPED
[INFO] Apache HBase - External Block Cache ............... SKIPPED
[INFO] Apache HBase - Assembly ........................... SKIPPED
[INFO] Apache HBase - Shaded ............................. SKIPPED
[INFO] Apache HBase - Shaded - Client .................... SKIPPED
[INFO] Apache HBase - Shaded - Server .................... SKIPPED
[INFO] ------------------------------------------------------------------------
[INFO] BUILD FAILURE
[INFO] ------------------------------------------------------------------------
[INFO] Total time: 12:17.247s
[INFO] Finished at: Mon Oct 19 18:53:13 UTC 2015
[INFO] Final Memory: 112M/1692M
[INFO] ------------------------------------------------------------------------
[ERROR] Failed to execute goal org.apache.maven.plugins:maven-compiler-plugin:2.5.1:testCompile
(default-testCompile) on project hbase-server: Compilation failure: Compilation failure:
[ERROR] <https://builds.apache.org/job/HBase-1.2/jdk=latest1.8,label=Hadoop/ws/hbase-server/src/test/java/org/apache/hadoop/hbase/security/access/TestCellACLs.java>:[159,27]
error: cannot find symbol
[ERROR] symbol: class HTable
[ERROR] <https://builds.apache.org/job/HBase-1.2/jdk=latest1.8,label=Hadoop/ws/hbase-server/src/test/java/org/apache/hadoop/hbase/security/access/TestCellACLs.java>:[186,27]
error: cannot find symbol
[ERROR] symbol: class HTable
[ERROR] <https://builds.apache.org/job/HBase-1.2/jdk=latest1.8,label=Hadoop/ws/hbase-server/src/test/java/org/apache/hadoop/hbase/security/access/TestCellACLs.java>:[197,27]
error: cannot find symbol
[ERROR] symbol: class HTable
[ERROR] <https://builds.apache.org/job/HBase-1.2/jdk=latest1.8,label=Hadoop/ws/hbase-server/src/test/java/org/apache/hadoop/hbase/security/access/TestCellACLs.java>:[208,27]
error: cannot find symbol
[ERROR] symbol: class HTable
[ERROR] <https://builds.apache.org/job/HBase-1.2/jdk=latest1.8,label=Hadoop/ws/hbase-server/src/test/java/org/apache/hadoop/hbase/security/access/TestCellACLs.java>:[219,27]
error: cannot find symbol
[ERROR] symbol: class HTable
[ERROR] <https://builds.apache.org/job/HBase-1.2/jdk=latest1.8,label=Hadoop/ws/hbase-server/src/test/java/org/apache/hadoop/hbase/security/access/TestCellACLs.java>:[249,27]
error: cannot find symbol
[ERROR] symbol: class HTable
[ERROR] <https://builds.apache.org/job/HBase-1.2/jdk=latest1.8,label=Hadoop/ws/hbase-server/src/test/java/org/apache/hadoop/hbase/security/access/TestCellACLs.java>:[284,27]
error: cannot find symbol
[ERROR] symbol: class HTable
[ERROR] <https://builds.apache.org/job/HBase-1.2/jdk=latest1.8,label=Hadoop/ws/hbase-server/src/test/java/org/apache/hadoop/hbase/security/access/TestCellACLs.java>:[296,27]
error: cannot find symbol
[ERROR] symbol: class HTable
[ERROR] <https://builds.apache.org/job/HBase-1.2/jdk=latest1.8,label=Hadoop/ws/hbase-server/src/test/java/org/apache/hadoop/hbase/security/access/TestCellACLs.java>:[310,27]
error: cannot find symbol
[ERROR] symbol: class HTable
[ERROR] <https://builds.apache.org/job/HBase-1.2/jdk=latest1.8,label=Hadoop/ws/hbase-server/src/test/java/org/apache/hadoop/hbase/security/access/TestCellACLs.java>:[322,27]
error: cannot find symbol
[ERROR] symbol: class HTable
[ERROR] <https://builds.apache.org/job/HBase-1.2/jdk=latest1.8,label=Hadoop/ws/hbase-server/src/test/java/org/apache/hadoop/hbase/security/access/TestCellACLs.java>:[347,27]
error: cannot find symbol
[ERROR] symbol: class HTable
[ERROR] <https://builds.apache.org/job/HBase-1.2/jdk=latest1.8,label=Hadoop/ws/hbase-server/src/test/java/org/apache/hadoop/hbase/security/access/TestCellACLs.java>:[359,27]
error: cannot find symbol
[ERROR] symbol: class HTable
[ERROR] <https://builds.apache.org/job/HBase-1.2/jdk=latest1.8,label=Hadoop/ws/hbase-server/src/test/java/org/apache/hadoop/hbase/security/access/TestCellACLs.java>:[396,27]
error: cannot find symbol
[ERROR] -> [Help 1]
[ERROR] 
[ERROR] To see the full stack trace of the errors, re-run Maven with the -e switch.
[ERROR] Re-run Maven using the -X switch to enable full debug logging.
[ERROR] 
[ERROR] For more information about the errors and possible solutions, please read the following
articles:
[ERROR] [Help 1] http://cwiki.apache.org/confluence/display/MAVEN/MojoFailureException
[ERROR] 
[ERROR] After correcting the problems, you can resume the build with the command
[ERROR]   mvn <goals> -rf :hbase-server
Build step 'Invoke top-level Maven targets' marked build as failure
Performing Post build task...
Match found for :.* : True
Logical operation result is TRUE
Running script  :     ZOMBIE_TESTS_COUNT=`jps -v | grep surefirebooter | grep '-Dhbase.test'
| wc -l`
  if [[ $ZOMBIE_TESTS_COUNT != 0 ]] ; then
    #It seems sometimes the tests are not dying immediately. Let's give them 30s
    echo "Suspicious java process found - waiting 30s to see if there are just slow to stop"
    sleep 30
    ZOMBIE_TESTS_COUNT=`jps -v | grep surefirebooter | grep '-Dhbase.test' | wc -l`
    if [[ $ZOMBIE_TESTS_COUNT != 0 ]] ; then
      echo "There are $ZOMBIE_TESTS_COUNT zombie tests, they should have been killed by surefire
but survived"
      echo "************ zombies jps listing"
      jps -v
      jps -v | grep surefirebooter | grep '-Dhbase.test'
      echo "************ BEGIN zombies jstack extract"
      # HBase tests have been flagged with an innocuous '-Dhbase.test' just so they can
      # be identified as hbase in a process listing.
      ZB_STACK=`jps -v | grep surefirebooter | grep '-Dhbase.test' | cut -d ' ' -f 1 | xargs
-n 1 jstack | grep ".test" | grep "\.java"`
      jps -v | grep surefirebooter | grep '-Dhbase.test' | cut -d ' ' -f 1 | xargs -n 1 jstack
      echo "************ END  zombies jstack extract"
      JIRA_COMMENT="$JIRA_COMMENT

     {color:red}-1 core zombie tests{color}.  There are ${ZOMBIE_TESTS_COUNT} zombie test(s):
${ZB_STACK}"
      BAD=1
      # Killing these zombies
      echo 'Killing ZOMBIES!!!'
      jps -v
      jps -v | grep surefirebooter | grep '-Dhbase.test' | cut -d ' ' -f 1 | xargs kill -9
    else
      echo "We're ok: there is no zombie test, but some tests took some time to stop"
    fi
[Hadoop] $ /bin/bash -xe /tmp/hudson8839227356063695317.sh
++ jps -v
++ grep surefirebooter
++ grep -Dhbase.test
++ wc -l
grep: unknown devices method
grep: write error: Broken pipe
+ ZOMBIE_TESTS_COUNT=0
/tmp/hudson8839227356063695317.sh: line 30: syntax error: unexpected end of file
POST BUILD TASK : FAILURE
END OF POST BUILD TASK : 0
Archiving artifacts

Mime
View raw message