hbase-builds mailing list archives

Site index · List index
Message view « Date » · « Thread »
Top « Date » · « Thread »
From Apache Jenkins Server <jenk...@builds.apache.org>
Subject Build failed in Jenkins: HBase-1.2-IT » IntegrationTestAcidGuarantees,latest1.7,Hadoop #204
Date Tue, 13 Oct 2015 08:59:03 GMT
See <https://builds.apache.org/job/HBase-1.2-IT/it.test=IntegrationTestAcidGuarantees,jdk=latest1.7,label=Hadoop/204/changes>

Changes:

[stack] HBASE-14596 TestCellACLs failing... on1.2 builds; TUNEUP

[stack] HBASE-14588 Stop accessing test resources from within src folder (Andrew

[stack] HBASE-14268 Improve KeyLocker (Hiroshi Ikeda)

------------------------------------------
[...truncated 407 lines...]
[INFO] Using 'UTF-8' encoding to copy filtered resources.
[INFO] skip non existing resourceDirectory <https://builds.apache.org/job/HBase-1.2-IT/it.test=IntegrationTestAcidGuarantees,jdk=latest1.7,label=Hadoop/ws/hbase-protocol/src/main/resources>
[INFO] Copying 3 resources
[INFO] 
[INFO] --- maven-compiler-plugin:2.5.1:compile (default-compile) @ hbase-protocol ---
[INFO] Compiling 34 source files to <https://builds.apache.org/job/HBase-1.2-IT/it.test=IntegrationTestAcidGuarantees,jdk=latest1.7,label=Hadoop/ws/hbase-protocol/target/classes>
[INFO] 
[INFO] --- maven-resources-plugin:2.6:testResources (default-testResources) @ hbase-protocol
---
[INFO] Using 'UTF-8' encoding to copy filtered resources.
[INFO] skip non existing resourceDirectory <https://builds.apache.org/job/HBase-1.2-IT/it.test=IntegrationTestAcidGuarantees,jdk=latest1.7,label=Hadoop/ws/hbase-protocol/src/test/resources>
[INFO] Copying 3 resources
[INFO] 
[INFO] --- maven-compiler-plugin:2.5.1:testCompile (default-testCompile) @ hbase-protocol
---
[INFO] No sources to compile
[INFO] 
[INFO] --- maven-surefire-plugin:2.18.1:test (default-test) @ hbase-protocol ---
[INFO] 
[INFO] --- maven-surefire-plugin:2.18.1:test (secondPartTestsExecution) @ hbase-protocol ---
[INFO] Tests are skipped.
[INFO] 
[INFO] --- jacoco-maven-plugin:0.7.5.201505241946:report (report) @ hbase-protocol ---
[INFO] Skipping JaCoCo execution because property jacoco.skip is set.
[INFO] 
[INFO] --- maven-source-plugin:2.2.1:jar-no-fork (attach-sources) @ hbase-protocol ---
[INFO] Building jar: <https://builds.apache.org/job/HBase-1.2-IT/it.test=IntegrationTestAcidGuarantees,jdk=latest1.7,label=Hadoop/ws/hbase-protocol/target/hbase-protocol-1.2.0-SNAPSHOT-sources.jar>
[INFO] 
[INFO] --- maven-jar-plugin:2.4:test-jar (default) @ hbase-protocol ---
[INFO] Building jar: <https://builds.apache.org/job/HBase-1.2-IT/it.test=IntegrationTestAcidGuarantees,jdk=latest1.7,label=Hadoop/ws/hbase-protocol/target/hbase-protocol-1.2.0-SNAPSHOT-tests.jar>
[INFO] 
[INFO] --- maven-jar-plugin:2.4:jar (default-jar) @ hbase-protocol ---
[INFO] Building jar: <https://builds.apache.org/job/HBase-1.2-IT/it.test=IntegrationTestAcidGuarantees,jdk=latest1.7,label=Hadoop/ws/hbase-protocol/target/hbase-protocol-1.2.0-SNAPSHOT.jar>
[INFO] 
[INFO] --- maven-enforcer-plugin:1.0.1:enforce (enforce) @ hbase-protocol ---
[INFO] 
[INFO] --- buildnumber-maven-plugin:1.3:create-timestamp (default) @ hbase-protocol ---
[INFO] 
[INFO] --- jacoco-maven-plugin:0.7.5.201505241946:prepare-agent (prepare-agent) @ hbase-protocol
---
[INFO] Skipping JaCoCo execution because property jacoco.skip is set.
[INFO] argLine set to empty
[INFO] 
[INFO] --- maven-remote-resources-plugin:1.5:process (default) @ hbase-protocol ---
[INFO] 
[INFO] --- maven-resources-plugin:2.6:resources (default-resources) @ hbase-protocol ---
[INFO] Using 'UTF-8' encoding to copy filtered resources.
[INFO] skip non existing resourceDirectory <https://builds.apache.org/job/HBase-1.2-IT/it.test=IntegrationTestAcidGuarantees,jdk=latest1.7,label=Hadoop/ws/hbase-protocol/src/main/resources>
[INFO] Copying 3 resources
[INFO] Copying 3 resources
[INFO] 
[INFO] --- maven-compiler-plugin:2.5.1:compile (default-compile) @ hbase-protocol ---
[INFO] Nothing to compile - all classes are up to date
[INFO] 
[INFO] --- maven-resources-plugin:2.6:testResources (default-testResources) @ hbase-protocol
---
[INFO] Using 'UTF-8' encoding to copy filtered resources.
[INFO] skip non existing resourceDirectory <https://builds.apache.org/job/HBase-1.2-IT/it.test=IntegrationTestAcidGuarantees,jdk=latest1.7,label=Hadoop/ws/hbase-protocol/src/test/resources>
[INFO] Copying 3 resources
[INFO] Copying 3 resources
[INFO] 
[INFO] --- maven-compiler-plugin:2.5.1:testCompile (default-testCompile) @ hbase-protocol
---
[INFO] No sources to compile
[INFO] 
[INFO] --- maven-surefire-plugin:2.18.1:test (default-test) @ hbase-protocol ---
[INFO] Skipping execution of surefire because it has already been run for this configuration
[INFO] 
[INFO] --- maven-surefire-plugin:2.18.1:test (secondPartTestsExecution) @ hbase-protocol ---
[INFO] Tests are skipped.
[INFO] 
[INFO] --- jacoco-maven-plugin:0.7.5.201505241946:report (report) @ hbase-protocol ---
[INFO] Skipping JaCoCo execution because property jacoco.skip is set.
[INFO] 
[INFO] --- maven-source-plugin:2.2.1:jar-no-fork (attach-sources) @ hbase-protocol ---
[INFO] Building jar: <https://builds.apache.org/job/HBase-1.2-IT/it.test=IntegrationTestAcidGuarantees,jdk=latest1.7,label=Hadoop/ws/hbase-protocol/target/hbase-protocol-1.2.0-SNAPSHOT-sources.jar>
[WARNING] Artifact org.apache.hbase:hbase-protocol:java-source:sources:1.2.0-SNAPSHOT already
attached to project, ignoring duplicate
[INFO] 
[INFO] --- maven-jar-plugin:2.4:test-jar (default) @ hbase-protocol ---
[INFO] Building jar: <https://builds.apache.org/job/HBase-1.2-IT/it.test=IntegrationTestAcidGuarantees,jdk=latest1.7,label=Hadoop/ws/hbase-protocol/target/hbase-protocol-1.2.0-SNAPSHOT-tests.jar>
[WARNING] Artifact org.apache.hbase:hbase-protocol:test-jar:tests:1.2.0-SNAPSHOT already attached
to project, ignoring duplicate
[INFO] 
[INFO] --- maven-jar-plugin:2.4:jar (default-jar) @ hbase-protocol ---
[INFO]                                                                         
[INFO] ------------------------------------------------------------------------
[INFO] Building Apache HBase - Common 1.2.0-SNAPSHOT
[INFO] ------------------------------------------------------------------------
[INFO] 
[INFO] --- maven-clean-plugin:2.5:clean (default-clean) @ hbase-common ---
[INFO] Deleting <https://builds.apache.org/job/HBase-1.2-IT/it.test=IntegrationTestAcidGuarantees,jdk=latest1.7,label=Hadoop/ws/hbase-common/target>
[INFO] 
[INFO] --- maven-enforcer-plugin:1.0.1:enforce (enforce) @ hbase-common ---
[INFO] 
[INFO] --- buildnumber-maven-plugin:1.3:create-timestamp (default) @ hbase-common ---
[INFO] 
[INFO] --- jacoco-maven-plugin:0.7.5.201505241946:prepare-agent (prepare-agent) @ hbase-common
---
[INFO] Skipping JaCoCo execution because property jacoco.skip is set.
[INFO] argLine set to empty
[INFO] 
[INFO] --- maven-antrun-plugin:1.6:run (generate) @ hbase-common ---
[INFO] Executing tasks

main:
     [exec] ~/jenkins-slave/workspace/HBase-1.2-IT/it.test/IntegrationTestAcidGuarantees/jdk/latest1.7/label/Hadoop/hbase-common
~/jenkins-slave/workspace/HBase-1.2-IT/it.test/IntegrationTestAcidGuarantees/jdk/latest1.7/label/Hadoop/hbase-common
     [exec] ~/jenkins-slave/workspace/HBase-1.2-IT/it.test/IntegrationTestAcidGuarantees/jdk/latest1.7/label/Hadoop/hbase-common
[INFO] Executed tasks
[INFO] 
[INFO] --- build-helper-maven-plugin:1.9.1:add-source (versionInfo-source) @ hbase-common
---
[INFO] Source directory: <https://builds.apache.org/job/HBase-1.2-IT/it.test=IntegrationTestAcidGuarantees,jdk=latest1.7,label=Hadoop/ws/hbase-common/target/generated-sources/java>
added.
[INFO] 
[INFO] --- maven-remote-resources-plugin:1.5:process (default) @ hbase-common ---
[INFO] 
[INFO] --- maven-resources-plugin:2.6:resources (default-resources) @ hbase-common ---
[INFO] Using 'UTF-8' encoding to copy filtered resources.
[INFO] Copying 1 resource
[INFO] Copying 3 resources
[INFO] 
[INFO] --- maven-antrun-plugin:1.6:run (default) @ hbase-common ---
[INFO] Executing tasks

main:
    [mkdir] Created dir: <https://builds.apache.org/job/HBase-1.2-IT/it.test=IntegrationTestAcidGuarantees,jdk=latest1.7,label=Hadoop/ws/hbase-common/target/nativelib>
     [exec] tar: hadoop-snappy-nativelibs.tar: Cannot open: No such file or directory
     [exec] tar: Error is not recoverable: exiting now
     [exec] Result: 2
[INFO] Executed tasks
[INFO] 
[INFO] --- maven-compiler-plugin:2.5.1:compile (default-compile) @ hbase-common ---
[INFO] Compiling 186 source files to <https://builds.apache.org/job/HBase-1.2-IT/it.test=IntegrationTestAcidGuarantees,jdk=latest1.7,label=Hadoop/ws/hbase-common/target/classes>
[INFO] -------------------------------------------------------------
[ERROR] COMPILATION ERROR : 
[INFO] -------------------------------------------------------------
[ERROR] <https://builds.apache.org/job/HBase-1.2-IT/it.test=IntegrationTestAcidGuarantees,jdk=latest1.7,label=Hadoop/ws/hbase-common/src/main/java/org/apache/hadoop/hbase/util/KeyLocker.java>:[51,16]
error: cannot find symbol
[ERROR]   symbol:   class WeakObjectPool
  location: class KeyLocker<K>
  where K is a type-variable:
    K extends Object declared in class KeyLocker
<https://builds.apache.org/job/HBase-1.2-IT/it.test=IntegrationTestAcidGuarantees,jdk=latest1.7,label=Hadoop/ws/hbase-common/src/main/java/org/apache/hadoop/hbase/util/UnsafeAccess.java>:[30,15]
Unsafe is internal proprietary API and may be removed in a future release
[ERROR] <https://builds.apache.org/job/HBase-1.2-IT/it.test=IntegrationTestAcidGuarantees,jdk=latest1.7,label=Hadoop/ws/hbase-common/src/main/java/org/apache/hadoop/hbase/io/encoding/DataBlockEncoding.java>:[46,3]
Unsafe is internal proprietary API and may be removed in a future release
[ERROR] <https://builds.apache.org/job/HBase-1.2-IT/it.test=IntegrationTestAcidGuarantees,jdk=latest1.7,label=Hadoop/ws/hbase-common/src/main/java/org/apache/hadoop/hbase/util/Bytes.java>:[1317,19]
Unsafe is internal proprietary API and may be removed in a future release
[ERROR] <https://builds.apache.org/job/HBase-1.2-IT/it.test=IntegrationTestAcidGuarantees,jdk=latest1.7,label=Hadoop/ws/hbase-common/src/main/java/org/apache/hadoop/hbase/util/Bytes.java>:[1323,21]
Unsafe is internal proprietary API and may be removed in a future release
[ERROR] <https://builds.apache.org/job/HBase-1.2-IT/it.test=IntegrationTestAcidGuarantees,jdk=latest1.7,label=Hadoop/ws/hbase-common/src/main/java/org/apache/hadoop/hbase/util/Bytes.java>:[1328,28]
Unsafe is internal proprietary API and may be removed in a future release
[ERROR] <https://builds.apache.org/job/HBase-1.2-IT/it.test=IntegrationTestAcidGuarantees,jdk=latest1.7,label=Hadoop/ws/hbase-common/src/main/java/org/apache/hadoop/hbase/util/KeyLocker.java>:[52,10]
error: cannot find symbol
[ERROR]   symbol:   class WeakObjectPool
  location: class KeyLocker<K>
  where K is a type-variable:
    K extends Object declared in class KeyLocker
<https://builds.apache.org/job/HBase-1.2-IT/it.test=IntegrationTestAcidGuarantees,jdk=latest1.7,label=Hadoop/ws/hbase-common/src/main/java/org/apache/hadoop/hbase/util/KeyLocker.java>:[53,28]
error: package WeakObjectPool does not exist
[ERROR] <https://builds.apache.org/job/HBase-1.2-IT/it.test=IntegrationTestAcidGuarantees,jdk=latest1.7,label=Hadoop/ws/hbase-common/src/main/java/org/apache/hadoop/hbase/util/UnsafeAccess.java>:[38,22]
Unsafe is internal proprietary API and may be removed in a future release
[ERROR] <https://builds.apache.org/job/HBase-1.2-IT/it.test=IntegrationTestAcidGuarantees,jdk=latest1.7,label=Hadoop/ws/hbase-common/src/main/java/org/apache/hadoop/hbase/util/UnsafeAccess.java>:[44,17]
Unsafe is internal proprietary API and may be removed in a future release
[ERROR] <https://builds.apache.org/job/HBase-1.2-IT/it.test=IntegrationTestAcidGuarantees,jdk=latest1.7,label=Hadoop/ws/hbase-common/src/main/java/org/apache/hadoop/hbase/util/UnsafeAccess.java>:[48,20]
Unsafe is internal proprietary API and may be removed in a future release
[INFO] 11 errors 
[INFO] -------------------------------------------------------------
[INFO] ------------------------------------------------------------------------
[INFO] Reactor Summary:
[INFO] 
[INFO] Apache HBase ...................................... SUCCESS [5.330s]
[INFO] Apache HBase - Checkstyle ......................... SUCCESS [0.664s]
[INFO] Apache HBase - Resource Bundle .................... SUCCESS [0.289s]
[INFO] Apache HBase - Annotations ........................ SUCCESS [1.043s]
[INFO] Apache HBase - Protocol ........................... SUCCESS [14.592s]
[INFO] Apache HBase - Common ............................. FAILURE [5.266s]
[INFO] Apache HBase - Procedure .......................... SKIPPED
[INFO] Apache HBase - Client ............................. SKIPPED
[INFO] Apache HBase - Hadoop Compatibility ............... SKIPPED
[INFO] Apache HBase - Hadoop Two Compatibility ........... SKIPPED
[INFO] Apache HBase - Prefix Tree ........................ SKIPPED
[INFO] Apache HBase - Server ............................. SKIPPED
[INFO] Apache HBase - Testing Util ....................... SKIPPED
[INFO] Apache HBase - Thrift ............................. SKIPPED
[INFO] Apache HBase - Rest ............................... SKIPPED
[INFO] Apache HBase - Shell .............................. SKIPPED
[INFO] Apache HBase - Integration Tests .................. SKIPPED
[INFO] Apache HBase - Examples ........................... SKIPPED
[INFO] Apache HBase - External Block Cache ............... SKIPPED
[INFO] Apache HBase - Assembly ........................... SKIPPED
[INFO] Apache HBase - Shaded ............................. SKIPPED
[INFO] Apache HBase - Shaded - Client .................... SKIPPED
[INFO] Apache HBase - Shaded - Server .................... SKIPPED
[INFO] ------------------------------------------------------------------------
[INFO] BUILD FAILURE
[INFO] ------------------------------------------------------------------------
[INFO] Total time: 29.512s
[INFO] Finished at: Tue Oct 13 08:59:43 UTC 2015
[INFO] Final Memory: 68M/1305M
[INFO] ------------------------------------------------------------------------
[ERROR] Failed to execute goal org.apache.maven.plugins:maven-compiler-plugin:2.5.1:compile
(default-compile) on project hbase-common: Compilation failure: Compilation failure:
[ERROR] <https://builds.apache.org/job/HBase-1.2-IT/it.test=IntegrationTestAcidGuarantees,jdk=latest1.7,label=Hadoop/ws/hbase-common/src/main/java/org/apache/hadoop/hbase/util/KeyLocker.java>:[51,16]
error: cannot find symbol
[ERROR] symbol:   class WeakObjectPool
[ERROR] location: class KeyLocker<K>
[ERROR] where K is a type-variable:
[ERROR] K extends Object declared in class KeyLocker
[ERROR] <https://builds.apache.org/job/HBase-1.2-IT/it.test=IntegrationTestAcidGuarantees,jdk=latest1.7,label=Hadoop/ws/hbase-common/src/main/java/org/apache/hadoop/hbase/util/UnsafeAccess.java>:[30,15]
Unsafe is internal proprietary API and may be removed in a future release
[ERROR] <https://builds.apache.org/job/HBase-1.2-IT/it.test=IntegrationTestAcidGuarantees,jdk=latest1.7,label=Hadoop/ws/hbase-common/src/main/java/org/apache/hadoop/hbase/io/encoding/DataBlockEncoding.java>:[46,3]
Unsafe is internal proprietary API and may be removed in a future release
[ERROR] <https://builds.apache.org/job/HBase-1.2-IT/it.test=IntegrationTestAcidGuarantees,jdk=latest1.7,label=Hadoop/ws/hbase-common/src/main/java/org/apache/hadoop/hbase/util/Bytes.java>:[1317,19]
Unsafe is internal proprietary API and may be removed in a future release
[ERROR] <https://builds.apache.org/job/HBase-1.2-IT/it.test=IntegrationTestAcidGuarantees,jdk=latest1.7,label=Hadoop/ws/hbase-common/src/main/java/org/apache/hadoop/hbase/util/Bytes.java>:[1323,21]
Unsafe is internal proprietary API and may be removed in a future release
[ERROR] <https://builds.apache.org/job/HBase-1.2-IT/it.test=IntegrationTestAcidGuarantees,jdk=latest1.7,label=Hadoop/ws/hbase-common/src/main/java/org/apache/hadoop/hbase/util/Bytes.java>:[1328,28]
Unsafe is internal proprietary API and may be removed in a future release
[ERROR] <https://builds.apache.org/job/HBase-1.2-IT/it.test=IntegrationTestAcidGuarantees,jdk=latest1.7,label=Hadoop/ws/hbase-common/src/main/java/org/apache/hadoop/hbase/util/KeyLocker.java>:[52,10]
error: cannot find symbol
[ERROR] symbol:   class WeakObjectPool
[ERROR] location: class KeyLocker<K>
[ERROR] where K is a type-variable:
[ERROR] K extends Object declared in class KeyLocker
[ERROR] <https://builds.apache.org/job/HBase-1.2-IT/it.test=IntegrationTestAcidGuarantees,jdk=latest1.7,label=Hadoop/ws/hbase-common/src/main/java/org/apache/hadoop/hbase/util/KeyLocker.java>:[53,28]
error: package WeakObjectPool does not exist
[ERROR] <https://builds.apache.org/job/HBase-1.2-IT/it.test=IntegrationTestAcidGuarantees,jdk=latest1.7,label=Hadoop/ws/hbase-common/src/main/java/org/apache/hadoop/hbase/util/UnsafeAccess.java>:[38,22]
Unsafe is internal proprietary API and may be removed in a future release
[ERROR] <https://builds.apache.org/job/HBase-1.2-IT/it.test=IntegrationTestAcidGuarantees,jdk=latest1.7,label=Hadoop/ws/hbase-common/src/main/java/org/apache/hadoop/hbase/util/UnsafeAccess.java>:[44,17]
Unsafe is internal proprietary API and may be removed in a future release
[ERROR] <https://builds.apache.org/job/HBase-1.2-IT/it.test=IntegrationTestAcidGuarantees,jdk=latest1.7,label=Hadoop/ws/hbase-common/src/main/java/org/apache/hadoop/hbase/util/UnsafeAccess.java>:[48,20]
Unsafe is internal proprietary API and may be removed in a future release
[ERROR] -> [Help 1]
[ERROR] 
[ERROR] To see the full stack trace of the errors, re-run Maven with the -e switch.
[ERROR] Re-run Maven using the -X switch to enable full debug logging.
[ERROR] 
[ERROR] For more information about the errors and possible solutions, please read the following
articles:
[ERROR] [Help 1] http://cwiki.apache.org/confluence/display/MAVEN/MojoFailureException
[ERROR] 
[ERROR] After correcting the problems, you can resume the build with the command
[ERROR]   mvn <goals> -rf :hbase-common
Build step 'Invoke top-level Maven targets' marked build as failure
Performing Post build task...
Match found for :.* : True
Logical operation result is TRUE
Running script  :   ZOMBIE_TESTS_COUNT=`jps | grep surefirebooter | wc -l`
  if [[ $ZOMBIE_TESTS_COUNT != 0 ]] ; then
    #It seems sometimes the tests are not dying immediately. Let's give them 10s
    echo "Suspicious java process found - waiting 10s to see if there are just slow to stop"
    sleep 10   
    ZOMBIE_TESTS_COUNT=`jps | grep surefirebooter | wc -l`
    if [[ $ZOMBIE_TESTS_COUNT != 0 ]] ; then
      echo "There are $ZOMBIE_TESTS_COUNT zombie tests, they should have been killed by surefire
but survived"
      echo "************ BEGIN zombies jstack extract"
      ZB_STACK=`jps | grep surefirebooter | cut -d ' ' -f 1 | xargs -n 1 jstack | grep ".test"
| grep "\.java"`
      jps | grep surefirebooter | cut -d ' ' -f 1 | xargs -n 1 jstack
      echo "************ END  zombies jstack extract"
      JIRA_COMMENT="$JIRA_COMMENT

     {color:red}-1 core zombie tests{color}.  There are ${ZOMBIE_TESTS_COUNT} zombie test(s):
${ZB_STACK}"
      BAD=1
      jps | grep surefirebooter | cut -d ' ' -f 1 | xargs kill -9
    else
      echo "We're ok: there is no zombie test, but some tests took some time to stop"
    fi
  else
    echo "We're ok: there is no zombie test"
  fi
[Hadoop] $ /bin/bash -xe /tmp/hudson6488945105367981777.sh
++ jps
++ grep surefirebooter
++ wc -l
+ ZOMBIE_TESTS_COUNT=0
+ [[ 0 != 0 ]]
+ echo 'We'\''re ok: there is no zombie test'
We're ok: there is no zombie test
POST BUILD TASK : SUCCESS
END OF POST BUILD TASK : 0
Archiving artifacts

Mime
View raw message