hbase-builds mailing list archives

Site index · List index
Message view « Date » · « Thread »
Top « Date » · « Thread »
From Apache Jenkins Server <jenk...@builds.apache.org>
Subject Build failed in Jenkins: HBase-1.1 #725
Date Tue, 27 Oct 2015 05:05:27 GMT
See <https://builds.apache.org/job/HBase-1.1/725/changes>

Changes:

[enis] HBASE-14283 Reverse scan doesn���t work with HFile inline index/bloom

[enis] HBASE-14682 CM restore functionality for regionservers is broken

[apurtell] Amend HBASE-14283 Reverse scan doesn���t work with HFile inline

[apurtell] Revert "Amend HBASE-14283 Reverse scan doesn���t work with HFile inline

------------------------------------------
[...truncated 2505 lines...]
Running org.apache.hadoop.hbase.io.encoding.TestBufferedDataBlockEncoder
Tests run: 1, Failures: 0, Errors: 0, Skipped: 0, Time elapsed: 10.5 sec - in org.apache.hadoop.hbase.io.encoding.TestBufferedDataBlockEncoder
Running org.apache.hadoop.hbase.io.encoding.TestLoadAndSwitchEncodeOnDisk
Tests run: 72, Failures: 0, Errors: 0, Skipped: 0, Time elapsed: 158.771 sec - in org.apache.hadoop.hbase.io.hfile.TestCacheOnWrite
Running org.apache.hadoop.hbase.TestRegionRebalancing
Tests run: 1, Failures: 0, Errors: 0, Skipped: 0, Time elapsed: 38.036 sec - in org.apache.hadoop.hbase.io.encoding.TestLoadAndSwitchEncodeOnDisk
Running org.apache.hadoop.hbase.TestHColumnDescriptorDefaultVersions
Tests run: 20, Failures: 0, Errors: 0, Skipped: 0, Time elapsed: 124.108 sec - in org.apache.hadoop.hbase.io.encoding.TestEncodedSeekers
Running org.apache.hadoop.hbase.mapred.TestTableMapReduceUtil
Tests run: 3, Failures: 0, Errors: 0, Skipped: 0, Time elapsed: 42.746 sec - in org.apache.hadoop.hbase.TestHColumnDescriptorDefaultVersions
Tests run: 2, Failures: 0, Errors: 0, Skipped: 0, Time elapsed: 58.39 sec - in org.apache.hadoop.hbase.TestRegionRebalancing
Running org.apache.hadoop.hbase.mapred.TestTableInputFormat
Running org.apache.hadoop.hbase.mapred.TestTableMapReduce
Tests run: 28, Failures: 0, Errors: 0, Skipped: 0, Time elapsed: 182.78 sec - in org.apache.hadoop.hbase.io.encoding.TestDataBlockEncoders
Running org.apache.hadoop.hbase.mapred.TestTableSnapshotInputFormat
Tests run: 4, Failures: 0, Errors: 0, Skipped: 0, Time elapsed: 91.633 sec - in org.apache.hadoop.hbase.mapred.TestTableMapReduceUtil
Running org.apache.hadoop.hbase.replication.TestReplicationTrackerZKImpl
Tests run: 5, Failures: 0, Errors: 0, Skipped: 0, Time elapsed: 1.548 sec - in org.apache.hadoop.hbase.replication.TestReplicationTrackerZKImpl
Running org.apache.hadoop.hbase.replication.TestReplicationEndpoint
Tests run: 3, Failures: 0, Errors: 0, Skipped: 0, Time elapsed: 4.454 sec - in org.apache.hadoop.hbase.replication.TestReplicationEndpoint
Tests run: 3, Failures: 0, Errors: 0, Skipped: 0, Time elapsed: 261.633 sec - in org.apache.hadoop.hbase.io.encoding.TestChangingEncoding
Tests run: 8, Failures: 0, Errors: 0, Skipped: 0, Time elapsed: 105.34 sec - in org.apache.hadoop.hbase.mapred.TestTableInputFormat
Tests run: 2, Failures: 0, Errors: 0, Skipped: 0, Time elapsed: 102.657 sec - in org.apache.hadoop.hbase.mapred.TestTableMapReduce
Running org.apache.hadoop.hbase.replication.TestReplicationKillMasterRSCompressed
Running org.apache.hadoop.hbase.replication.regionserver.TestReplicationSink
Tests run: 5, Failures: 0, Errors: 0, Skipped: 0, Time elapsed: 2.754 sec - in org.apache.hadoop.hbase.replication.regionserver.TestReplicationSink
Running org.apache.hadoop.hbase.replication.TestPerTableCFReplication
Running org.apache.hadoop.hbase.replication.regionserver.TestReplicationSourceManager
Running org.apache.hadoop.hbase.replication.TestReplicationDisableInactivePeer
Tests run: 5, Failures: 0, Errors: 0, Skipped: 0, Time elapsed: 5.553 sec - in org.apache.hadoop.hbase.replication.regionserver.TestReplicationSourceManager
Running org.apache.hadoop.hbase.replication.regionserver.TestRegionReplicaReplicationEndpoint
Tests run: 1, Failures: 0, Errors: 0, Skipped: 0, Time elapsed: 28.248 sec - in org.apache.hadoop.hbase.replication.TestReplicationKillMasterRSCompressed
Running org.apache.hadoop.hbase.replication.regionserver.TestReplicationWALReaderManager
Tests run: 1, Failures: 0, Errors: 0, Skipped: 0, Time elapsed: 28.937 sec - in org.apache.hadoop.hbase.replication.TestReplicationDisableInactivePeer
Running org.apache.hadoop.hbase.replication.regionserver.TestRegionReplicaReplicationEndpointNoMaster
Tests run: 2, Failures: 0, Errors: 0, Skipped: 0, Time elapsed: 61.89 sec - in org.apache.hadoop.hbase.replication.TestPerTableCFReplication
Running org.apache.hadoop.hbase.replication.TestReplicationSource
Tests run: 1, Failures: 0, Errors: 0, Skipped: 0, Time elapsed: 0.263 sec - in org.apache.hadoop.hbase.replication.TestReplicationSource
Tests run: 4, Failures: 0, Errors: 0, Skipped: 0, Time elapsed: 54.225 sec - in org.apache.hadoop.hbase.replication.regionserver.TestRegionReplicaReplicationEndpointNoMaster
Running org.apache.hadoop.hbase.replication.TestReplicationChangingPeerRegionservers
Tests run: 1, Failures: 0, Errors: 0, Skipped: 0, Time elapsed: 5.544 sec - in org.apache.hadoop.hbase.replication.TestReplicationChangingPeerRegionservers
Killed
Killed
Killed
Killed
Killed
Running org.apache.hadoop.hbase.replication.TestMultiSlaveReplication
Running org.apache.hadoop.hbase.replication.TestReplicationStateZKImpl
Tests run: 6, Failures: 0, Errors: 0, Skipped: 0, Time elapsed: 2.771 sec - in org.apache.hadoop.hbase.replication.TestReplicationStateZKImpl
Running org.apache.hadoop.hbase.replication.TestMasterReplication
Running org.apache.hadoop.hbase.replication.TestReplicationSmallTests
Running org.apache.hadoop.hbase.replication.TestReplicationKillSlaveRS
Running org.apache.hadoop.hbase.replication.TestReplicationWithTags
Tests run: 1, Failures: 0, Errors: 0, Skipped: 0, Time elapsed: 3.538 sec - in org.apache.hadoop.hbase.replication.TestReplicationWithTags
Running org.apache.hadoop.hbase.util.TestMergeTool
Tests run: 1, Failures: 0, Errors: 0, Skipped: 0, Time elapsed: 52.697 sec - in org.apache.hadoop.hbase.replication.TestMultiSlaveReplication
Running org.apache.hadoop.hbase.util.TestFSTableDescriptors
Tests run: 15, Failures: 0, Errors: 0, Skipped: 0, Time elapsed: 2.677 sec - in org.apache.hadoop.hbase.util.TestFSTableDescriptors
Running org.apache.hadoop.hbase.util.TestConnectionCache
Tests run: 1, Failures: 0, Errors: 0, Skipped: 0, Time elapsed: 21.453 sec - in org.apache.hadoop.hbase.replication.TestReplicationKillSlaveRS
Running org.apache.hadoop.hbase.util.TestHBaseFsckEncryption
Tests run: 1, Failures: 0, Errors: 0, Skipped: 0, Time elapsed: 24.985 sec - in org.apache.hadoop.hbase.util.TestMergeTool
Running org.apache.hadoop.hbase.util.TestIdLock
Tests run: 1, Failures: 0, Errors: 0, Skipped: 0, Time elapsed: 19.271 sec - in org.apache.hadoop.hbase.util.TestConnectionCache
Running org.apache.hadoop.hbase.util.TestMiniClusterLoadSequential
Tests run: 1, Failures: 0, Errors: 0, Skipped: 0, Time elapsed: 19.006 sec - in org.apache.hadoop.hbase.util.TestHBaseFsckEncryption
Running org.apache.hadoop.hbase.util.TestMergeTable
Tests run: 1, Failures: 0, Errors: 0, Skipped: 0, Time elapsed: 15.318 sec - in org.apache.hadoop.hbase.util.TestIdLock
Running org.apache.hadoop.hbase.util.TestMiniClusterLoadParallel
Tests run: 10, Failures: 0, Errors: 0, Skipped: 0, Time elapsed: 67.181 sec - in org.apache.hadoop.hbase.replication.TestReplicationSmallTests
Tests run: 1, Failures: 0, Errors: 0, Skipped: 0, Time elapsed: 28.457 sec - in org.apache.hadoop.hbase.util.TestMergeTable
Running org.apache.hadoop.hbase.util.TestFSUtils
Running org.apache.hadoop.hbase.util.TestHBaseFsck
Tests run: 3, Failures: 0, Errors: 0, Skipped: 0, Time elapsed: 119.04 sec - in org.apache.hadoop.hbase.replication.TestMasterReplication
Running org.apache.hadoop.hbase.util.TestRegionSplitter
Tests run: 10, Failures: 0, Errors: 0, Skipped: 0, Time elapsed: 25.774 sec - in org.apache.hadoop.hbase.util.TestFSUtils
Running org.apache.hadoop.hbase.util.TestTableName
Tests run: 6, Failures: 0, Errors: 0, Skipped: 0, Time elapsed: 0.48 sec - in org.apache.hadoop.hbase.util.TestTableName
Running org.apache.hadoop.hbase.util.TestMiniClusterLoadEncoded
Tests run: 4, Failures: 0, Errors: 0, Skipped: 0, Time elapsed: 69.522 sec - in org.apache.hadoop.hbase.util.TestMiniClusterLoadSequential
Tests run: 6, Failures: 0, Errors: 0, Skipped: 0, Time elapsed: 12 sec - in org.apache.hadoop.hbase.util.TestRegionSplitter
Running org.apache.hadoop.hbase.util.TestFSVisitor
Tests run: 3, Failures: 0, Errors: 0, Skipped: 0, Time elapsed: 4.958 sec - in org.apache.hadoop.hbase.util.TestFSVisitor
Running org.apache.hadoop.hbase.util.hbck.TestOfflineMetaRebuildBase
Tests run: 4, Failures: 0, Errors: 0, Skipped: 0, Time elapsed: 66.102 sec - in org.apache.hadoop.hbase.util.TestMiniClusterLoadParallel
Running org.apache.hadoop.hbase.util.hbck.TestOfflineMetaRebuildOverlap
Running org.apache.hadoop.hbase.util.TestCoprocessorScanPolicy
Tests run: 4, Failures: 0, Errors: 0, Skipped: 0, Time elapsed: 24.184 sec - in org.apache.hadoop.hbase.util.TestCoprocessorScanPolicy
Running org.apache.hadoop.hbase.util.hbck.TestOfflineMetaRebuildHole
Tests run: 1, Failures: 0, Errors: 0, Skipped: 0, Time elapsed: 31.766 sec - in org.apache.hadoop.hbase.util.hbck.TestOfflineMetaRebuildOverlap
Running org.apache.hadoop.hbase.util.TestDefaultEnvironmentEdge
Tests run: 1, Failures: 0, Errors: 0, Skipped: 0, Time elapsed: 0.297 sec - in org.apache.hadoop.hbase.util.TestDefaultEnvironmentEdge
Running org.apache.hadoop.hbase.util.TestFSHDFSUtils
Tests run: 1, Failures: 0, Errors: 0, Skipped: 0, Time elapsed: 38.984 sec - in org.apache.hadoop.hbase.util.hbck.TestOfflineMetaRebuildBase
Tests run: 3, Failures: 0, Errors: 0, Skipped: 0, Time elapsed: 8.71 sec - in org.apache.hadoop.hbase.util.TestFSHDFSUtils
Running org.apache.hadoop.hbase.TestMetaTableAccessorNoCluster
Tests run: 2, Failures: 0, Errors: 0, Skipped: 0, Time elapsed: 3.817 sec - in org.apache.hadoop.hbase.TestMetaTableAccessorNoCluster
Running org.apache.hadoop.hbase.migration.TestUpgradeTo96
Tests run: 1, Failures: 0, Errors: 0, Skipped: 0, Time elapsed: 30.618 sec - in org.apache.hadoop.hbase.util.hbck.TestOfflineMetaRebuildHole
Tests run: 5, Failures: 0, Errors: 0, Skipped: 0, Time elapsed: 2.784 sec - in org.apache.hadoop.hbase.migration.TestUpgradeTo96
Running org.apache.hadoop.hbase.migration.TestNamespaceUpgrade
Tests run: 5, Failures: 0, Errors: 0, Skipped: 0, Time elapsed: 77.666 sec - in org.apache.hadoop.hbase.util.TestMiniClusterLoadEncoded
Running org.apache.hadoop.hbase.TestNamespace
Running org.apache.hadoop.hbase.TestInfoServers
Running org.apache.hadoop.hbase.TestMetaTableAccessor
Tests run: 3, Failures: 0, Errors: 0, Skipped: 0, Time elapsed: 4.308 sec - in org.apache.hadoop.hbase.TestInfoServers
Tests run: 5, Failures: 0, Errors: 0, Skipped: 0, Time elapsed: 28.132 sec - in org.apache.hadoop.hbase.migration.TestNamespaceUpgrade
Tests run: 13, Failures: 0, Errors: 0, Skipped: 0, Time elapsed: 22.643 sec - in org.apache.hadoop.hbase.TestMetaTableAccessor
Tests run: 9, Failures: 0, Errors: 0, Skipped: 1, Time elapsed: 44.287 sec - in org.apache.hadoop.hbase.TestNamespace
Tests run: 51, Failures: 0, Errors: 0, Skipped: 1, Time elapsed: 549.323 sec - in org.apache.hadoop.hbase.util.TestHBaseFsck

Results :

Tests in error: 
org.apache.hadoop.hbase.mapreduce.TestLoadIncrementalHFilesUseSecurityEndPoint.testRegionCrossingHFileSplit(org.apache.hadoop.hbase.mapreduce.TestLoadIncrementalHFilesUseSecurityEndPoint)
  Run 1: TestLoadIncrementalHFilesUseSecurityEndPoint>TestLoadIncrementalHFiles.testRegionCrossingHFileSplit:173->TestLoadIncrementalHFiles.testRegionCrossingHFileSplit:195->TestLoadIncrementalHFiles.runTest:223->TestLoadIncrementalHFiles.runTest:232->TestLoadIncrementalHFiles.runTest:254
? TestTimedOut
  Run 2: TestLoadIncrementalHFilesUseSecurityEndPoint>TestLoadIncrementalHFiles.testRegionCrossingHFileSplit:173->TestLoadIncrementalHFiles.testRegionCrossingHFileSplit:195->TestLoadIncrementalHFiles.runTest:223->TestLoadIncrementalHFiles.runTest:232->TestLoadIncrementalHFiles.runTest:254
? TestTimedOut

org.apache.hadoop.hbase.mapreduce.TestLoadIncrementalHFilesUseSecurityEndPoint.testRegionCrossingHFileSplitRowBloom(org.apache.hadoop.hbase.mapreduce.TestLoadIncrementalHFilesUseSecurityEndPoint)
  Run 1: TestLoadIncrementalHFilesUseSecurityEndPoint>TestLoadIncrementalHFiles.testRegionCrossingHFileSplitRowBloom:182->TestLoadIncrementalHFiles.testRegionCrossingHFileSplit:195->TestLoadIncrementalHFiles.runTest:223->TestLoadIncrementalHFiles.runTest:232->TestLoadIncrementalHFiles.runTest:254
? TestTimedOut
  Run 2: TestLoadIncrementalHFilesUseSecurityEndPoint>TestLoadIncrementalHFiles.testRegionCrossingHFileSplitRowBloom:182->TestLoadIncrementalHFiles.testRegionCrossingHFileSplit:195->TestLoadIncrementalHFiles.runTest:223->TestLoadIncrementalHFiles.runTest:232->TestLoadIncrementalHFiles.runTest:271
? TestTimedOut

org.apache.hadoop.hbase.mapreduce.TestLoadIncrementalHFilesUseSecurityEndPoint.testRegionCrossingHFileSplitRowColBloom(org.apache.hadoop.hbase.mapreduce.TestLoadIncrementalHFilesUseSecurityEndPoint)
  Run 1: TestLoadIncrementalHFilesUseSecurityEndPoint>TestLoadIncrementalHFiles.testRegionCrossingHFileSplitRowColBloom:191->TestLoadIncrementalHFiles.testRegionCrossingHFileSplit:195->TestLoadIncrementalHFiles.runTest:223->TestLoadIncrementalHFiles.runTest:232->TestLoadIncrementalHFiles.runTest:285
? TestTimedOut
  Run 2: TestLoadIncrementalHFilesUseSecurityEndPoint>TestLoadIncrementalHFiles.testRegionCrossingHFileSplitRowColBloom:191->TestLoadIncrementalHFiles.testRegionCrossingHFileSplit:195->TestLoadIncrementalHFiles.runTest:223->TestLoadIncrementalHFiles.runTest:232->TestLoadIncrementalHFiles.runTest:285->Object.wait:-2
? TestTimedOut

org.apache.hadoop.hbase.mapreduce.TestLoadIncrementalHFilesUseSecurityEndPoint.testSimpleHFileSplit(org.apache.hadoop.hbase.mapreduce.TestLoadIncrementalHFilesUseSecurityEndPoint)
  Run 1: TestLoadIncrementalHFilesUseSecurityEndPoint>TestLoadIncrementalHFiles.testSimpleHFileSplit:155->TestLoadIncrementalHFiles.runTest:223->TestLoadIncrementalHFiles.runTest:232->TestLoadIncrementalHFiles.runTest:285
? TestTimedOut
  Run 2: TestLoadIncrementalHFilesUseSecurityEndPoint>TestLoadIncrementalHFiles.testSimpleHFileSplit:155->TestLoadIncrementalHFiles.runTest:219->TestLoadIncrementalHFiles.runTest:232->TestLoadIncrementalHFiles.runTest:285
? TestTimedOut

org.apache.hadoop.hbase.mapreduce.TestSecureLoadIncrementalHFiles.testRegionCrossingHFileSplit(org.apache.hadoop.hbase.mapreduce.TestSecureLoadIncrementalHFiles)
  Run 1: TestSecureLoadIncrementalHFiles>TestLoadIncrementalHFiles.testRegionCrossingHFileSplit:173->TestLoadIncrementalHFiles.testRegionCrossingHFileSplit:195->TestLoadIncrementalHFiles.runTest:219->TestLoadIncrementalHFiles.runTest:232->TestLoadIncrementalHFiles.runTest:271
? TestTimedOut
  Run 2: TestSecureLoadIncrementalHFiles>TestLoadIncrementalHFiles.testRegionCrossingHFileSplit:173->TestLoadIncrementalHFiles.testRegionCrossingHFileSplit:195->TestLoadIncrementalHFiles.runTest:223->TestLoadIncrementalHFiles.runTest:232->TestLoadIncrementalHFiles.runTest:285->Object.wait:-2
? TestTimedOut

org.apache.hadoop.hbase.mapreduce.TestSecureLoadIncrementalHFiles.testRegionCrossingHFileSplitRowBloom(org.apache.hadoop.hbase.mapreduce.TestSecureLoadIncrementalHFiles)
  Run 1: TestSecureLoadIncrementalHFiles>TestLoadIncrementalHFiles.testRegionCrossingHFileSplitRowBloom:182->TestLoadIncrementalHFiles.testRegionCrossingHFileSplit:195->TestLoadIncrementalHFiles.runTest:219->TestLoadIncrementalHFiles.runTest:232->TestLoadIncrementalHFiles.runTest:285
? TestTimedOut
  Run 2: TestSecureLoadIncrementalHFiles>TestLoadIncrementalHFiles.testRegionCrossingHFileSplitRowBloom:182->TestLoadIncrementalHFiles.testRegionCrossingHFileSplit:195->TestLoadIncrementalHFiles.runTest:223->TestLoadIncrementalHFiles.runTest:232->TestLoadIncrementalHFiles.runTest:254
? TestTimedOut

org.apache.hadoop.hbase.mapreduce.TestSecureLoadIncrementalHFiles.testRegionCrossingHFileSplitRowColBloom(org.apache.hadoop.hbase.mapreduce.TestSecureLoadIncrementalHFiles)
  Run 1: TestSecureLoadIncrementalHFiles>TestLoadIncrementalHFiles.testRegionCrossingHFileSplitRowColBloom:191->TestLoadIncrementalHFiles.testRegionCrossingHFileSplit:195->TestLoadIncrementalHFiles.runTest:223->TestLoadIncrementalHFiles.runTest:232->TestLoadIncrementalHFiles.runTest:254
? TestTimedOut
  Run 2: TestSecureLoadIncrementalHFiles>TestLoadIncrementalHFiles.testRegionCrossingHFileSplitRowColBloom:191->TestLoadIncrementalHFiles.testRegionCrossingHFileSplit:195->TestLoadIncrementalHFiles.runTest:223->TestLoadIncrementalHFiles.runTest:232->TestLoadIncrementalHFiles.runTest:271
? TestTimedOut

org.apache.hadoop.hbase.mapreduce.TestSecureLoadIncrementalHFiles.testSimpleHFileSplit(org.apache.hadoop.hbase.mapreduce.TestSecureLoadIncrementalHFiles)
  Run 1: TestSecureLoadIncrementalHFiles>TestLoadIncrementalHFiles.testSimpleHFileSplit:155->TestLoadIncrementalHFiles.runTest:223->TestLoadIncrementalHFiles.runTest:232->TestLoadIncrementalHFiles.runTest:254
? TestTimedOut
  Run 2: TestSecureLoadIncrementalHFiles>TestLoadIncrementalHFiles.testSimpleHFileSplit:155->TestLoadIncrementalHFiles.runTest:223->TestLoadIncrementalHFiles.runTest:232->TestLoadIncrementalHFiles.runTest:254
? TestTimedOut

Flaked tests: 
org.apache.hadoop.hbase.client.TestClientPushback.testClientTracksServerPushback(org.apache.hadoop.hbase.client.TestClientPushback)
  Run 1: TestClientPushback.testClientTracksServerPushback:148 AsyncProcess did not submit
the work time. Actual: 0
  Run 2: PASS

org.apache.hadoop.hbase.master.procedure.TestWALProcedureStoreOnHDFS.testWalRollOnLowReplication(org.apache.hadoop.hbase.master.procedure.TestWALProcedureStoreOnHDFS)
  Run 1: TestWALProcedureStoreOnHDFS.testWalRollOnLowReplication:189 ? Runtime sync abo...
  Run 2: TestWALProcedureStoreOnHDFS.testWalRollOnLowReplication:189 ? Runtime sync abo...
  Run 3: PASS


Tests run: 2397, Failures: 0, Errors: 8, Skipped: 20, Flakes: 2

[INFO] ------------------------------------------------------------------------
[INFO] Reactor Summary:
[INFO] 
[INFO] Apache HBase ...................................... SUCCESS [6.958s]
[INFO] Apache HBase - Checkstyle ......................... SUCCESS [1.685s]
[INFO] Apache HBase - Resource Bundle .................... SUCCESS [0.301s]
[INFO] Apache HBase - Annotations ........................ SUCCESS [1.712s]
[INFO] Apache HBase - Protocol ........................... SUCCESS [14.173s]
[INFO] Apache HBase - Common ............................. SUCCESS [1:38.551s]
[INFO] Apache HBase - Procedure .......................... SUCCESS [1:12.820s]
[INFO] Apache HBase - Client ............................. SUCCESS [1:31.048s]
[INFO] Apache HBase - Hadoop Compatibility ............... SUCCESS [8.772s]
[INFO] Apache HBase - Hadoop Two Compatibility ........... SUCCESS [9.427s]
[INFO] Apache HBase - Prefix Tree ........................ SUCCESS [10.177s]
[INFO] Apache HBase - Server ............................. FAILURE [2:25:39.538s]
[INFO] Apache HBase - Testing Util ....................... SKIPPED
[INFO] Apache HBase - Thrift ............................. SKIPPED
[INFO] Apache HBase - Rest ............................... SKIPPED
[INFO] Apache HBase - Shell .............................. SKIPPED
[INFO] Apache HBase - Integration Tests .................. SKIPPED
[INFO] Apache HBase - Examples ........................... SKIPPED
[INFO] Apache HBase - Assembly ........................... SKIPPED
[INFO] Apache HBase - Shaded ............................. SKIPPED
[INFO] Apache HBase - Shaded - Client .................... SKIPPED
[INFO] Apache HBase - Shaded - Server .................... SKIPPED
[INFO] ------------------------------------------------------------------------
[INFO] BUILD FAILURE
[INFO] ------------------------------------------------------------------------
[INFO] Total time: 2:30:57.353s
[INFO] Finished at: Tue Oct 27 05:04:16 UTC 2015
[INFO] Final Memory: 54M/908M
[INFO] ------------------------------------------------------------------------
[ERROR] Failed to execute goal org.apache.maven.plugins:maven-surefire-plugin:2.18.1:test
(secondPartTestsExecution) on project hbase-server: ExecutionException: java.lang.RuntimeException:
The forked VM terminated without properly saying goodbye. VM crash or System.exit called?
[ERROR] Command was /bin/sh -c cd /x1/jenkins/jenkins-slave/workspace/HBase-1.1/hbase-server
&& /x1/jenkins/jenkins-slave/tools/hudson.model.JDK/jdk-1.7u51/jre/bin/java -enableassertions
-XX:MaxDirectMemorySize=1G -Xmx2800m -XX:MaxPermSize=256m -Djava.security.egd=file:/dev/./urandom
-Djava.net.preferIPv4Stack=true -Djava.awt.headless=true -jar /x1/jenkins/jenkins-slave/workspace/HBase-1.1/hbase-server/target/surefire/surefirebooter5371643420263797763.jar
/x1/jenkins/jenkins-slave/workspace/HBase-1.1/hbase-server/target/surefire/surefire4005670640325275119tmp
/x1/jenkins/jenkins-slave/workspace/HBase-1.1/hbase-server/target/surefire/surefire_12054383700532506169921tmp
[ERROR] -> [Help 1]
[ERROR] 
[ERROR] To see the full stack trace of the errors, re-run Maven with the -e switch.
[ERROR] Re-run Maven using the -X switch to enable full debug logging.
[ERROR] 
[ERROR] For more information about the errors and possible solutions, please read the following
articles:
[ERROR] [Help 1] http://cwiki.apache.org/confluence/display/MAVEN/MojoFailureException
[ERROR] 
[ERROR] After correcting the problems, you can resume the build with the command
[ERROR]   mvn <goals> -rf :hbase-server
Build step 'Invoke top-level Maven targets' marked build as failure
Performing Post build task...
Match found for :.* : True
Logical operation result is TRUE
Running script  :   ZOMBIE_TESTS_COUNT=`jps -v | grep surefirebooter | grep '-Dhbase.test'
| wc -l`
  if [[ $ZOMBIE_TESTS_COUNT != 0 ]] ; then
    #It seems sometimes the tests are not dying immediately. Let's give them 30s
    echo "Suspicious java process found - waiting 30s to see if there are just slow to stop"
    sleep 30
    ZOMBIE_TESTS_COUNT=`jps -v | grep surefirebooter | grep '-Dhbase.test' | wc -l`
    if [[ $ZOMBIE_TESTS_COUNT != 0 ]] ; then
      echo "There are $ZOMBIE_TESTS_COUNT zombie tests, they should have been killed by surefire
but survived"
      echo "************ zombies jps listing"
      jps -v
      jps -v | grep surefirebooter | grep '-Dhbase.test'
      echo "************ BEGIN zombies jstack extract"
      # HBase tests have been flagged with an innocuous '-Dhbase.test' just so they can
      # be identified as hbase in a process listing.
      ZB_STACK=`jps -v | grep surefirebooter | grep '-Dhbase.test' | cut -d ' ' -f 1 | xargs
-n 1 jstack | grep ".test" | grep "\.java"`
      jps -v | grep surefirebooter | grep '-Dhbase.test' | cut -d ' ' -f 1 | xargs -n 1 jstack
      echo "************ END  zombies jstack extract"
      JIRA_COMMENT="$JIRA_COMMENT

     {color:red}-1 core zombie tests{color}.  There are ${ZOMBIE_TESTS_COUNT} zombie test(s):
${ZB_STACK}"
      BAD=1
      # Killing these zombies
      echo 'Killing ZOMBIES!!!'
      jps -v
      jps -v | grep surefirebooter | grep '-Dhbase.test' | cut -d ' ' -f 1 | xargs kill -9
    else
      echo "We're ok: there is no zombie test, but some tests took some time to stop"
    fi
[HBase-1.1] $ /bin/bash -xe /tmp/hudson8227866055355812036.sh
++ jps -v
++ grep surefirebooter
++ grep -Dhbase.test
++ wc -l
grep: unknown devices method
+ ZOMBIE_TESTS_COUNT=0
/tmp/hudson8227866055355812036.sh: line 30: syntax error: unexpected end of file
POST BUILD TASK : FAILURE
END OF POST BUILD TASK : 0
Archiving artifacts
Recording test results
Updating HBASE-14283
Updating HBASE-14682

Mime
View raw message