hbase-builds mailing list archives

Site index · List index
Message view « Date » · « Thread »
Top « Date » · « Thread »
From Apache Jenkins Server <jenk...@builds.apache.org>
Subject Build failed in Jenkins: HBase-1.3-IT » IntegrationTestAcidGuarantees,latest1.7,Hadoop #137
Date Wed, 09 Sep 2015 08:42:08 GMT
See <https://builds.apache.org/job/HBase-1.3-IT/it.test=IntegrationTestAcidGuarantees,jdk=latest1.7,label=Hadoop/137/changes>

Changes:

[stack] HBASE-14147 REST Support for Namespaces (Matt Warhaftig)

------------------------------------------
[...truncated 1405 lines...]
[INFO] --- maven-jar-plugin:2.4:test-jar (default) @ hbase-thrift ---
[INFO] Building jar: <https://builds.apache.org/job/HBase-1.3-IT/it.test=IntegrationTestAcidGuarantees,jdk=latest1.7,label=Hadoop/ws/hbase-thrift/target/hbase-thrift-1.3.0-SNAPSHOT-tests.jar>
[INFO] 
[INFO] --- maven-jar-plugin:2.4:jar (default-jar) @ hbase-thrift ---
[INFO] Building jar: <https://builds.apache.org/job/HBase-1.3-IT/it.test=IntegrationTestAcidGuarantees,jdk=latest1.7,label=Hadoop/ws/hbase-thrift/target/hbase-thrift-1.3.0-SNAPSHOT.jar>
[INFO] 
[INFO] --- maven-enforcer-plugin:1.0.1:enforce (enforce) @ hbase-thrift ---
[INFO] 
[INFO] --- buildnumber-maven-plugin:1.3:create-timestamp (default) @ hbase-thrift ---
[INFO] 
[INFO] --- jacoco-maven-plugin:0.7.5.201505241946:prepare-agent (prepare-agent) @ hbase-thrift
---
[INFO] Skipping JaCoCo execution because property jacoco.skip is set.
[INFO] argLine set to empty
[INFO] 
[INFO] --- maven-antrun-plugin:1.6:run (generate) @ hbase-thrift ---
[INFO] Executing tasks

main:
log4j:WARN No appenders could be found for logger (org.mortbay.log).
log4j:WARN Please initialize the log4j system properly.
log4j:WARN See http://logging.apache.org/log4j/1.2/faq.html#noconfig for more info.
[INFO] Executed tasks
[INFO] 
[INFO] --- build-helper-maven-plugin:1.9.1:add-source (jspcSource-packageInfo-source) @ hbase-thrift
---
[INFO] Source directory: <https://builds.apache.org/job/HBase-1.3-IT/it.test=IntegrationTestAcidGuarantees,jdk=latest1.7,label=Hadoop/ws/hbase-thrift/target/generated-sources/java>
added.
[INFO] 
[INFO] --- maven-remote-resources-plugin:1.5:process (default) @ hbase-thrift ---
[INFO] 
[INFO] --- maven-resources-plugin:2.6:resources (default-resources) @ hbase-thrift ---
[INFO] Using 'UTF-8' encoding to copy filtered resources.
[INFO] Copying 18 resources
[INFO] Copying 3 resources
[INFO] Copying 3 resources
[INFO] 
[INFO] --- maven-compiler-plugin:2.5.1:compile (default-compile) @ hbase-thrift ---
[INFO] Nothing to compile - all classes are up to date
[INFO] 
[INFO] --- maven-dependency-plugin:2.1:build-classpath (create-mrapp-generated-classpath)
@ hbase-thrift ---
[INFO] Skipped writing classpath file '<https://builds.apache.org/job/HBase-1.3-IT/it.test=IntegrationTestAcidGuarantees,jdk=latest1.7,label=Hadoop/ws/hbase-thrift/target/test-classes/mrapp-generated-classpath'.>
 No changes found.
[INFO] 
[INFO] --- maven-resources-plugin:2.6:testResources (default-testResources) @ hbase-thrift
---
[INFO] Using 'UTF-8' encoding to copy filtered resources.
[INFO] Copying 2 resources to META-INF/
[INFO] Copying 3 resources
[INFO] Copying 3 resources
[INFO] 
[INFO] --- maven-compiler-plugin:2.5.1:testCompile (default-testCompile) @ hbase-thrift ---
[INFO] Nothing to compile - all classes are up to date
[INFO] 
[INFO] --- maven-surefire-plugin:2.18:test (default-test) @ hbase-thrift ---
[INFO] Skipping execution of surefire because it has already been run for this configuration
[INFO] 
[INFO] --- maven-surefire-plugin:2.18:test (secondPartTestsExecution) @ hbase-thrift ---
[INFO] Tests are skipped.
[INFO] 
[INFO] --- jacoco-maven-plugin:0.7.5.201505241946:report (report) @ hbase-thrift ---
[INFO] Skipping JaCoCo execution because property jacoco.skip is set.
[INFO] 
[INFO] --- maven-source-plugin:2.2.1:jar-no-fork (attach-sources) @ hbase-thrift ---
[INFO] Building jar: <https://builds.apache.org/job/HBase-1.3-IT/it.test=IntegrationTestAcidGuarantees,jdk=latest1.7,label=Hadoop/ws/hbase-thrift/target/hbase-thrift-1.3.0-SNAPSHOT-sources.jar>
[WARNING] Artifact org.apache.hbase:hbase-thrift:java-source:sources:1.3.0-SNAPSHOT already
attached to project, ignoring duplicate
[INFO] 
[INFO] --- maven-jar-plugin:2.4:test-jar (default) @ hbase-thrift ---
[INFO] Building jar: <https://builds.apache.org/job/HBase-1.3-IT/it.test=IntegrationTestAcidGuarantees,jdk=latest1.7,label=Hadoop/ws/hbase-thrift/target/hbase-thrift-1.3.0-SNAPSHOT-tests.jar>
[WARNING] Artifact org.apache.hbase:hbase-thrift:test-jar:tests:1.3.0-SNAPSHOT already attached
to project, ignoring duplicate
[INFO] 
[INFO] --- maven-jar-plugin:2.4:jar (default-jar) @ hbase-thrift ---
[INFO] Building jar: <https://builds.apache.org/job/HBase-1.3-IT/it.test=IntegrationTestAcidGuarantees,jdk=latest1.7,label=Hadoop/ws/hbase-thrift/target/hbase-thrift-1.3.0-SNAPSHOT.jar>
[INFO]                                                                         
[INFO] ------------------------------------------------------------------------
[INFO] Building Apache HBase - Rest 1.3.0-SNAPSHOT
[INFO] ------------------------------------------------------------------------
[INFO] 
[INFO] --- maven-clean-plugin:2.5:clean (default-clean) @ hbase-rest ---
[INFO] Deleting <https://builds.apache.org/job/HBase-1.3-IT/it.test=IntegrationTestAcidGuarantees,jdk=latest1.7,label=Hadoop/ws/hbase-rest/target>
[INFO] 
[INFO] --- maven-enforcer-plugin:1.0.1:enforce (enforce) @ hbase-rest ---
[INFO] 
[INFO] --- buildnumber-maven-plugin:1.3:create-timestamp (default) @ hbase-rest ---
[INFO] 
[INFO] --- jacoco-maven-plugin:0.7.5.201505241946:prepare-agent (prepare-agent) @ hbase-rest
---
[INFO] Skipping JaCoCo execution because property jacoco.skip is set.
[INFO] argLine set to empty
[INFO] 
[INFO] --- maven-antrun-plugin:1.6:run (generate) @ hbase-rest ---
[INFO] Executing tasks

main:
    [mkdir] Created dir: <https://builds.apache.org/job/HBase-1.3-IT/it.test=IntegrationTestAcidGuarantees,jdk=latest1.7,label=Hadoop/ws/hbase-rest/target/hbase-webapps>
     [copy] Copying 1 file to <https://builds.apache.org/job/HBase-1.3-IT/it.test=IntegrationTestAcidGuarantees,jdk=latest1.7,label=Hadoop/ws/hbase-rest/target/hbase-webapps>
log4j:WARN No appenders could be found for logger (org.mortbay.log).
log4j:WARN Please initialize the log4j system properly.
log4j:WARN See http://logging.apache.org/log4j/1.2/faq.html#noconfig for more info.
    [mkdir] Created dir: <https://builds.apache.org/job/HBase-1.3-IT/it.test=IntegrationTestAcidGuarantees,jdk=latest1.7,label=Hadoop/ws/hbase-rest/target/hbase-webapps/rest/WEB-INF>
[INFO] Executed tasks
[INFO] 
[INFO] --- build-helper-maven-plugin:1.9.1:add-source (jspcSource-packageInfo-source) @ hbase-rest
---
[INFO] Source directory: <https://builds.apache.org/job/HBase-1.3-IT/it.test=IntegrationTestAcidGuarantees,jdk=latest1.7,label=Hadoop/ws/hbase-rest/target/generated-sources/java>
added.
[INFO] 
[INFO] --- maven-remote-resources-plugin:1.5:process (default) @ hbase-rest ---
[INFO] 
[INFO] --- maven-resources-plugin:2.6:resources (default-resources) @ hbase-rest ---
[INFO] Using 'UTF-8' encoding to copy filtered resources.
[INFO] Copying 2 resources
[INFO] Copying 3 resources
[INFO] 
[INFO] --- maven-compiler-plugin:2.5.1:compile (default-compile) @ hbase-rest ---
[INFO] Compiling 65 source files to <https://builds.apache.org/job/HBase-1.3-IT/it.test=IntegrationTestAcidGuarantees,jdk=latest1.7,label=Hadoop/ws/hbase-rest/target/classes>
[INFO] -------------------------------------------------------------
[ERROR] COMPILATION ERROR : 
[INFO] -------------------------------------------------------------
[ERROR] <https://builds.apache.org/job/HBase-1.3-IT/it.test=IntegrationTestAcidGuarantees,jdk=latest1.7,label=Hadoop/ws/hbase-rest/src/main/java/org/apache/hadoop/hbase/rest/RootResource.java>:[108,9]
error: cannot find symbol
[ERROR]   symbol:   class NamespacesResource
  location: class RootResource
<https://builds.apache.org/job/HBase-1.3-IT/it.test=IntegrationTestAcidGuarantees,jdk=latest1.7,label=Hadoop/ws/hbase-rest/src/main/java/org/apache/hadoop/hbase/rest/provider/JAXBContextResolver.java>:[34,41]
error: cannot find symbol
[ERROR]   symbol:   class NamespacesInstanceModel
  location: package org.apache.hadoop.hbase.rest.model
<https://builds.apache.org/job/HBase-1.3-IT/it.test=IntegrationTestAcidGuarantees,jdk=latest1.7,label=Hadoop/ws/hbase-rest/src/main/java/org/apache/hadoop/hbase/rest/provider/JAXBContextResolver.java>:[35,41]
error: cannot find symbol
[ERROR]   symbol:   class NamespacesModel
  location: package org.apache.hadoop.hbase.rest.model
<https://builds.apache.org/job/HBase-1.3-IT/it.test=IntegrationTestAcidGuarantees,jdk=latest1.7,label=Hadoop/ws/hbase-rest/src/main/java/org/apache/hadoop/hbase/rest/RootResource.java>:[109,15]
error: cannot find symbol
[ERROR]   symbol:   class NamespacesResource
  location: class RootResource
<https://builds.apache.org/job/HBase-1.3-IT/it.test=IntegrationTestAcidGuarantees,jdk=latest1.7,label=Hadoop/ws/hbase-rest/src/main/java/org/apache/hadoop/hbase/rest/provider/JAXBContextResolver.java>:[68,4]
error: cannot find symbol
[ERROR]   symbol:   class NamespacesModel
  location: class JAXBContextResolver
<https://builds.apache.org/job/HBase-1.3-IT/it.test=IntegrationTestAcidGuarantees,jdk=latest1.7,label=Hadoop/ws/hbase-rest/src/main/java/org/apache/hadoop/hbase/rest/provider/JAXBContextResolver.java>:[69,4]
error: cannot find symbol
[INFO] 6 errors 
[INFO] -------------------------------------------------------------
[INFO] ------------------------------------------------------------------------
[INFO] Reactor Summary:
[INFO] 
[INFO] Apache HBase ...................................... SUCCESS [4.545s]
[INFO] Apache HBase - Checkstyle ......................... SUCCESS [0.665s]
[INFO] Apache HBase - Resource Bundle .................... SUCCESS [0.282s]
[INFO] Apache HBase - Annotations ........................ SUCCESS [1.068s]
[INFO] Apache HBase - Protocol ........................... SUCCESS [13.977s]
[INFO] Apache HBase - Common ............................. SUCCESS [8.801s]
[INFO] Apache HBase - Procedure .......................... SUCCESS [1.319s]
[INFO] Apache HBase - Client ............................. SUCCESS [5.679s]
[INFO] Apache HBase - Hadoop Compatibility ............... SUCCESS [0.385s]
[INFO] Apache HBase - Hadoop Two Compatibility ........... SUCCESS [1.451s]
[INFO] Apache HBase - Prefix Tree ........................ SUCCESS [1.405s]
[INFO] Apache HBase - Server ............................. SUCCESS [23.071s]
[INFO] Apache HBase - Testing Util ....................... SUCCESS [1.561s]
[INFO] Apache HBase - Thrift ............................. SUCCESS [5.927s]
[INFO] Apache HBase - Rest ............................... FAILURE [1.256s]
[INFO] Apache HBase - Shell .............................. SKIPPED
[INFO] Apache HBase - Integration Tests .................. SKIPPED
[INFO] Apache HBase - Examples ........................... SKIPPED
[INFO] Apache HBase - Assembly ........................... SKIPPED
[INFO] Apache HBase - Shaded ............................. SKIPPED
[INFO] Apache HBase - Shaded - Client .................... SKIPPED
[INFO] Apache HBase - Shaded - Server .................... SKIPPED
[INFO] ------------------------------------------------------------------------
[INFO] BUILD FAILURE
[INFO] ------------------------------------------------------------------------
[INFO] Total time: 1:13.509s
[INFO] Finished at: Wed Sep 09 08:41:57 UTC 2015
[INFO] Final Memory: 173M/3666M
[INFO] ------------------------------------------------------------------------
[ERROR] Failed to execute goal org.apache.maven.plugins:maven-compiler-plugin:2.5.1:compile
(default-compile) on project hbase-rest: Compilation failure: Compilation failure:
[ERROR] <https://builds.apache.org/job/HBase-1.3-IT/it.test=IntegrationTestAcidGuarantees,jdk=latest1.7,label=Hadoop/ws/hbase-rest/src/main/java/org/apache/hadoop/hbase/rest/RootResource.java>:[108,9]
error: cannot find symbol
[ERROR] symbol:   class NamespacesResource
[ERROR] location: class RootResource
[ERROR] <https://builds.apache.org/job/HBase-1.3-IT/it.test=IntegrationTestAcidGuarantees,jdk=latest1.7,label=Hadoop/ws/hbase-rest/src/main/java/org/apache/hadoop/hbase/rest/provider/JAXBContextResolver.java>:[34,41]
error: cannot find symbol
[ERROR] symbol:   class NamespacesInstanceModel
[ERROR] location: package org.apache.hadoop.hbase.rest.model
[ERROR] <https://builds.apache.org/job/HBase-1.3-IT/it.test=IntegrationTestAcidGuarantees,jdk=latest1.7,label=Hadoop/ws/hbase-rest/src/main/java/org/apache/hadoop/hbase/rest/provider/JAXBContextResolver.java>:[35,41]
error: cannot find symbol
[ERROR] symbol:   class NamespacesModel
[ERROR] location: package org.apache.hadoop.hbase.rest.model
[ERROR] <https://builds.apache.org/job/HBase-1.3-IT/it.test=IntegrationTestAcidGuarantees,jdk=latest1.7,label=Hadoop/ws/hbase-rest/src/main/java/org/apache/hadoop/hbase/rest/RootResource.java>:[109,15]
error: cannot find symbol
[ERROR] symbol:   class NamespacesResource
[ERROR] location: class RootResource
[ERROR] <https://builds.apache.org/job/HBase-1.3-IT/it.test=IntegrationTestAcidGuarantees,jdk=latest1.7,label=Hadoop/ws/hbase-rest/src/main/java/org/apache/hadoop/hbase/rest/provider/JAXBContextResolver.java>:[68,4]
error: cannot find symbol
[ERROR] symbol:   class NamespacesModel
[ERROR] location: class JAXBContextResolver
[ERROR] <https://builds.apache.org/job/HBase-1.3-IT/it.test=IntegrationTestAcidGuarantees,jdk=latest1.7,label=Hadoop/ws/hbase-rest/src/main/java/org/apache/hadoop/hbase/rest/provider/JAXBContextResolver.java>:[69,4]
error: cannot find symbol
[ERROR] -> [Help 1]
[ERROR] 
[ERROR] To see the full stack trace of the errors, re-run Maven with the -e switch.
[ERROR] Re-run Maven using the -X switch to enable full debug logging.
[ERROR] 
[ERROR] For more information about the errors and possible solutions, please read the following
articles:
[ERROR] [Help 1] http://cwiki.apache.org/confluence/display/MAVEN/MojoFailureException
[ERROR] 
[ERROR] After correcting the problems, you can resume the build with the command
[ERROR]   mvn <goals> -rf :hbase-rest
Build step 'Invoke top-level Maven targets' marked build as failure
Performing Post build task...
Match found for :.* : True
Logical operation result is TRUE
Running script  :   ZOMBIE_TESTS_COUNT=`jps | grep surefirebooter | wc -l`
  if [[ $ZOMBIE_TESTS_COUNT != 0 ]] ; then
    #It seems sometimes the tests are not dying immediately. Let's give them 10s
    echo "Suspicious java process found - waiting 10s to see if there are just slow to stop"
    sleep 10   
    ZOMBIE_TESTS_COUNT=`jps | grep surefirebooter | wc -l`
    if [[ $ZOMBIE_TESTS_COUNT != 0 ]] ; then
      echo "There are $ZOMBIE_TESTS_COUNT zombie tests, they should have been killed by surefire
but survived"
      echo "************ BEGIN zombies jstack extract"
      ZB_STACK=`jps | grep surefirebooter | cut -d ' ' -f 1 | xargs -n 1 jstack | grep ".test"
| grep "\.java"`
      jps | grep surefirebooter | cut -d ' ' -f 1 | xargs -n 1 jstack
      echo "************ END  zombies jstack extract"
      JIRA_COMMENT="$JIRA_COMMENT

     {color:red}-1 core zombie tests{color}.  There are ${ZOMBIE_TESTS_COUNT} zombie test(s):
${ZB_STACK}"
      BAD=1
      jps | grep surefirebooter | cut -d ' ' -f 1 | xargs kill -9
    else
      echo "We're ok: there is no zombie test, but some tests took some time to stop"
    fi
  else
    echo "We're ok: there is no zombie test"
  fi
[Hadoop] $ /bin/bash -xe /tmp/hudson7518343413816094981.sh
++ jps
++ grep surefirebooter
++ wc -l
+ ZOMBIE_TESTS_COUNT=1
+ [[ 1 != 0 ]]
+ echo 'Suspicious java process found - waiting 10s to see if there are just slow to stop'
Suspicious java process found - waiting 10s to see if there are just slow to stop
+ sleep 10
++ jps
++ grep surefirebooter
++ wc -l
+ ZOMBIE_TESTS_COUNT=1
+ [[ 1 != 0 ]]
+ echo 'There are 1 zombie tests, they should have been killed by surefire but survived'
There are 1 zombie tests, they should have been killed by surefire but survived
+ echo '************ BEGIN zombies jstack extract'
************ BEGIN zombies jstack extract
++ jps
++ grep surefirebooter
++ cut -d ' ' -f 1
++ grep '\.java'
++ xargs -n 1 jstack
++ grep .test
+ ZB_STACK=
POST BUILD TASK : FAILURE
END OF POST BUILD TASK : 0
Archiving artifacts
Sending artifact delta relative to HBase-1.3-IT » IntegrationTestAcidGuarantees,latest1.7,Hadoop
#136
Archived 2 artifacts
Archive block size is 32768
Received 0 blocks and 3864153 bytes
Compression is 0.0%
Took 0.94 sec

Mime
View raw message