hbase-builds mailing list archives

Site index · List index
Message view « Date » · « Thread »
Top « Date » · « Thread »
From Apache Jenkins Server <jenk...@builds.apache.org>
Subject Build failed in Jenkins: HBase-0.98 #1131
Date Sat, 26 Sep 2015 04:38:48 GMT
See <https://builds.apache.org/job/HBase-0.98/1131/changes>

Changes:

[apurtell] HBASE-14407 NotServingRegion: hbase region closed forever (Shuaifeng Zhou)

------------------------------------------
[...truncated 393 lines...]
Tests run: 18, Failures: 0, Errors: 0, Skipped: 0, Time elapsed: 0.627 sec - in org.apache.hadoop.hbase.TestKeyValue
Running org.apache.hadoop.hbase.TestCompoundConfiguration
Tests run: 6, Failures: 0, Errors: 0, Skipped: 0, Time elapsed: 0.589 sec - in org.apache.hadoop.hbase.TestCompoundConfiguration

Results :

Tests run: 172, Failures: 0, Errors: 0, Skipped: 0

[INFO] 
[INFO] --- maven-surefire-plugin:2.18.1:test (secondPartTestsExecution) @ hbase-common ---
[INFO] Tests are skipped.
[INFO] 
[INFO] --- jacoco-maven-plugin:0.7.5.201505241946:report (report) @ hbase-common ---
[INFO] Skipping JaCoCo execution because property jacoco.skip is set.
[INFO] 
[INFO] --- maven-source-plugin:2.2.1:jar-no-fork (attach-sources) @ hbase-common ---
[INFO] No sources in project. Archive not created.
[INFO] 
[INFO] --- maven-jar-plugin:2.4:test-jar (default) @ hbase-common ---
[INFO] Building jar: <https://builds.apache.org/job/HBase-0.98/ws/hbase-common/target/hbase-common-0.98.15-SNAPSHOT-tests.jar>
[INFO] 
[INFO] --- maven-jar-plugin:2.4:jar (default-jar) @ hbase-common ---
[INFO] Building jar: <https://builds.apache.org/job/HBase-0.98/ws/hbase-common/target/hbase-common-0.98.15-SNAPSHOT.jar>
[INFO] 
[INFO] --- maven-install-plugin:2.3.1:install (default-install) @ hbase-common ---
[INFO] Installing <https://builds.apache.org/job/HBase-0.98/ws/hbase-common/target/hbase-common-0.98.15-SNAPSHOT.jar>
to /home/jenkins/.m2/repository/org/apache/hbase/hbase-common/0.98.15-SNAPSHOT/hbase-common-0.98.15-SNAPSHOT.jar
[INFO] Installing <https://builds.apache.org/job/HBase-0.98/ws/hbase-common/pom.xml>
to /home/jenkins/.m2/repository/org/apache/hbase/hbase-common/0.98.15-SNAPSHOT/hbase-common-0.98.15-SNAPSHOT.pom
[INFO] Installing <https://builds.apache.org/job/HBase-0.98/ws/hbase-common/target/hbase-common-0.98.15-SNAPSHOT-tests.jar>
to /home/jenkins/.m2/repository/org/apache/hbase/hbase-common/0.98.15-SNAPSHOT/hbase-common-0.98.15-SNAPSHOT-tests.jar
[INFO]                                                                         
[INFO] ------------------------------------------------------------------------
[INFO] Building Apache HBase - Protocol 0.98.15-SNAPSHOT
[INFO] ------------------------------------------------------------------------
[INFO] 
[INFO] --- maven-enforcer-plugin:1.0.1:enforce (enforce) @ hbase-protocol ---
[INFO] 
[INFO] --- buildnumber-maven-plugin:1.3:create-timestamp (default) @ hbase-protocol ---
[INFO] 
[INFO] --- jacoco-maven-plugin:0.7.5.201505241946:prepare-agent (prepare-agent) @ hbase-protocol
---
[INFO] Skipping JaCoCo execution because property jacoco.skip is set.
[INFO] argLine set to empty
[INFO] 
[INFO] --- maven-remote-resources-plugin:1.5:process (default) @ hbase-protocol ---
[INFO] 
[INFO] --- maven-resources-plugin:2.6:resources (default-resources) @ hbase-protocol ---
[INFO] Using 'UTF-8' encoding to copy filtered resources.
[INFO] skip non existing resourceDirectory <https://builds.apache.org/job/HBase-0.98/ws/hbase-protocol/src/main/resources>
[INFO] Copying 3 resources
[INFO] 
[INFO] --- maven-compiler-plugin:2.5.1:compile (default-compile) @ hbase-protocol ---
[INFO] Compiling 30 source files to <https://builds.apache.org/job/HBase-0.98/ws/hbase-protocol/target/classes>
[INFO] 
[INFO] --- maven-resources-plugin:2.6:testResources (default-testResources) @ hbase-protocol
---
[INFO] Using 'UTF-8' encoding to copy filtered resources.
[INFO] skip non existing resourceDirectory <https://builds.apache.org/job/HBase-0.98/ws/hbase-protocol/src/test/resources>
[INFO] Copying 3 resources
[INFO] 
[INFO] --- maven-compiler-plugin:2.5.1:testCompile (default-testCompile) @ hbase-protocol
---
[INFO] No sources to compile
[INFO] 
[INFO] --- maven-surefire-plugin:2.18.1:test (default-test) @ hbase-protocol ---
[INFO] 
[INFO] --- maven-surefire-plugin:2.18.1:test (secondPartTestsExecution) @ hbase-protocol ---
[INFO] Tests are skipped.
[INFO] 
[INFO] --- jacoco-maven-plugin:0.7.5.201505241946:report (report) @ hbase-protocol ---
[INFO] Skipping JaCoCo execution because property jacoco.skip is set.
[INFO] 
[INFO] --- maven-source-plugin:2.2.1:jar-no-fork (attach-sources) @ hbase-protocol ---
[INFO] Building jar: <https://builds.apache.org/job/HBase-0.98/ws/hbase-protocol/target/hbase-protocol-0.98.15-SNAPSHOT-sources.jar>
[INFO] 
[INFO] --- maven-jar-plugin:2.4:test-jar (default) @ hbase-protocol ---
[INFO] Building jar: <https://builds.apache.org/job/HBase-0.98/ws/hbase-protocol/target/hbase-protocol-0.98.15-SNAPSHOT-tests.jar>
[INFO] 
[INFO] --- maven-jar-plugin:2.4:jar (default-jar) @ hbase-protocol ---
[INFO] Building jar: <https://builds.apache.org/job/HBase-0.98/ws/hbase-protocol/target/hbase-protocol-0.98.15-SNAPSHOT.jar>
[INFO] 
[INFO] --- maven-install-plugin:2.3.1:install (default-install) @ hbase-protocol ---
[INFO] Installing <https://builds.apache.org/job/HBase-0.98/ws/hbase-protocol/target/hbase-protocol-0.98.15-SNAPSHOT.jar>
to /home/jenkins/.m2/repository/org/apache/hbase/hbase-protocol/0.98.15-SNAPSHOT/hbase-protocol-0.98.15-SNAPSHOT.jar
[INFO] Installing <https://builds.apache.org/job/HBase-0.98/ws/hbase-protocol/pom.xml>
to /home/jenkins/.m2/repository/org/apache/hbase/hbase-protocol/0.98.15-SNAPSHOT/hbase-protocol-0.98.15-SNAPSHOT.pom
[INFO] Installing <https://builds.apache.org/job/HBase-0.98/ws/hbase-protocol/target/hbase-protocol-0.98.15-SNAPSHOT-sources.jar>
to /home/jenkins/.m2/repository/org/apache/hbase/hbase-protocol/0.98.15-SNAPSHOT/hbase-protocol-0.98.15-SNAPSHOT-sources.jar
[INFO] Installing <https://builds.apache.org/job/HBase-0.98/ws/hbase-protocol/target/hbase-protocol-0.98.15-SNAPSHOT-tests.jar>
to /home/jenkins/.m2/repository/org/apache/hbase/hbase-protocol/0.98.15-SNAPSHOT/hbase-protocol-0.98.15-SNAPSHOT-tests.jar
[INFO]                                                                         
[INFO] ------------------------------------------------------------------------
[INFO] Building Apache HBase - Client 0.98.15-SNAPSHOT
[INFO] ------------------------------------------------------------------------
[INFO] 
[INFO] --- maven-enforcer-plugin:1.0.1:enforce (enforce) @ hbase-client ---
[INFO] 
[INFO] --- buildnumber-maven-plugin:1.3:create-timestamp (default) @ hbase-client ---
[INFO] 
[INFO] --- jacoco-maven-plugin:0.7.5.201505241946:prepare-agent (prepare-agent) @ hbase-client
---
[INFO] Skipping JaCoCo execution because property jacoco.skip is set.
[INFO] argLine set to empty
[INFO] 
[INFO] --- maven-remote-resources-plugin:1.5:process (default) @ hbase-client ---
[INFO] 
[INFO] --- maven-resources-plugin:2.6:resources (default-resources) @ hbase-client ---
[INFO] Using 'UTF-8' encoding to copy filtered resources.
[INFO] Copying 1 resource
[INFO] Copying 3 resources
[INFO] 
[INFO] --- maven-compiler-plugin:2.5.1:compile (default-compile) @ hbase-client ---
[INFO] Compiling 286 source files to <https://builds.apache.org/job/HBase-0.98/ws/hbase-client/target/classes>
[INFO] 
[INFO] --- maven-resources-plugin:2.6:testResources (default-testResources) @ hbase-client
---
[INFO] Using 'UTF-8' encoding to copy filtered resources.
[INFO] Copying 2 resources
[INFO] Copying 3 resources
[INFO] 
[INFO] --- maven-compiler-plugin:2.5.1:testCompile (default-testCompile) @ hbase-client ---
[INFO] Compiling 20 source files to <https://builds.apache.org/job/HBase-0.98/ws/hbase-client/target/test-classes>
[INFO] 
[INFO] --- maven-surefire-plugin:2.18.1:test (default-test) @ hbase-client ---
[INFO] Surefire report directory: <https://builds.apache.org/job/HBase-0.98/ws/hbase-client/target/surefire-reports>
[INFO] Using configured provider org.apache.maven.surefire.junitcore.JUnitCoreProvider
[INFO] parallel='none', perCoreThreadCount=true, threadCount=0, useUnlimitedThreads=false,
threadCountSuites=0, threadCountClasses=0, threadCountMethods=0, parallelOptimized=true

-------------------------------------------------------
 T E S T S
-------------------------------------------------------
Running org.apache.hadoop.hbase.TestInterfaceAudienceAnnotations
Tests run: 2, Failures: 0, Errors: 0, Skipped: 0, Time elapsed: 2.576 sec - in org.apache.hadoop.hbase.TestInterfaceAudienceAnnotations
Running org.apache.hadoop.hbase.client.TestClientSmallScanner
Tests run: 4, Failures: 0, Errors: 0, Skipped: 0, Time elapsed: 0.687 sec - in org.apache.hadoop.hbase.client.TestClientSmallScanner
Running org.apache.hadoop.hbase.client.TestScan
Tests run: 4, Failures: 0, Errors: 0, Skipped: 0, Time elapsed: 0.85 sec - in org.apache.hadoop.hbase.client.TestScan
Running org.apache.hadoop.hbase.client.TestGet
Tests run: 5, Failures: 0, Errors: 0, Skipped: 0, Time elapsed: 0.982 sec - in org.apache.hadoop.hbase.client.TestGet
Running org.apache.hadoop.hbase.client.TestClientNoCluster
Tests run: 5, Failures: 0, Errors: 0, Skipped: 1, Time elapsed: 1.238 sec - in org.apache.hadoop.hbase.client.TestClientNoCluster
Running org.apache.hadoop.hbase.client.TestIncrement
Tests run: 1, Failures: 0, Errors: 0, Skipped: 0, Time elapsed: 0.155 sec - in org.apache.hadoop.hbase.client.TestIncrement
Running org.apache.hadoop.hbase.client.TestOperation
Tests run: 2, Failures: 0, Errors: 0, Skipped: 0, Time elapsed: 0.19 sec - in org.apache.hadoop.hbase.client.TestOperation
Running org.apache.hadoop.hbase.client.TestPutDotHas
Tests run: 4, Failures: 0, Errors: 0, Skipped: 0, Time elapsed: 0.026 sec - in org.apache.hadoop.hbase.client.TestPutDotHas
Running org.apache.hadoop.hbase.client.TestClientExponentialBackoff
Tests run: 4, Failures: 0, Errors: 0, Skipped: 0, Time elapsed: 0.054 sec - in org.apache.hadoop.hbase.client.TestClientExponentialBackoff
Running org.apache.hadoop.hbase.client.TestDelayingRunner
Tests run: 1, Failures: 0, Errors: 0, Skipped: 0, Time elapsed: 1.016 sec - in org.apache.hadoop.hbase.client.TestDelayingRunner
Running org.apache.hadoop.hbase.client.TestAsyncProcess
Killed
Running org.apache.hadoop.hbase.client.TestAttributes
Tests run: 7, Failures: 0, Errors: 0, Skipped: 0, Time elapsed: 0.156 sec - in org.apache.hadoop.hbase.client.TestAttributes
Running org.apache.hadoop.hbase.client.TestSnapshotFromAdmin
Tests run: 2, Failures: 0, Errors: 0, Skipped: 0, Time elapsed: 4.353 sec - in org.apache.hadoop.hbase.client.TestSnapshotFromAdmin
Running org.apache.hadoop.hbase.client.TestClientSmallReversedScanner
Tests run: 4, Failures: 0, Errors: 0, Skipped: 0, Time elapsed: 0.714 sec - in org.apache.hadoop.hbase.client.TestClientSmallReversedScanner
Running org.apache.hadoop.hbase.security.TestEncryptionUtil
Tests run: 3, Failures: 0, Errors: 0, Skipped: 0, Time elapsed: 1.267 sec - in org.apache.hadoop.hbase.security.TestEncryptionUtil
Running org.apache.hadoop.hbase.filter.TestLongComparator
Tests run: 1, Failures: 0, Errors: 0, Skipped: 0, Time elapsed: 0.125 sec - in org.apache.hadoop.hbase.filter.TestLongComparator
Running org.apache.hadoop.hbase.ipc.TestPayloadCarryingRpcController
Tests run: 1, Failures: 0, Errors: 0, Skipped: 0, Time elapsed: 0.12 sec - in org.apache.hadoop.hbase.ipc.TestPayloadCarryingRpcController
Running org.apache.hadoop.hbase.ipc.TestIPCUtil
Tests run: 1, Failures: 0, Errors: 0, Skipped: 0, Time elapsed: 0.288 sec - in org.apache.hadoop.hbase.ipc.TestIPCUtil
Running org.apache.hadoop.hbase.zookeeper.TestZooKeeperWatcher
Tests run: 1, Failures: 0, Errors: 0, Skipped: 0, Time elapsed: 0.531 sec - in org.apache.hadoop.hbase.zookeeper.TestZooKeeperWatcher

Results :

Tests run: 52, Failures: 0, Errors: 0, Skipped: 1

[INFO] ------------------------------------------------------------------------
[INFO] Reactor Summary:
[INFO] 
[INFO] Apache HBase ...................................... SUCCESS [4.963s]
[INFO] Apache HBase - Checkstyle ......................... SUCCESS [0.842s]
[INFO] Apache HBase - Resource Bundle .................... SUCCESS [0.291s]
[INFO] Apache HBase - Annotations ........................ SUCCESS [1.249s]
[INFO] Apache HBase - Common ............................. SUCCESS [53.631s]
[INFO] Apache HBase - Protocol ........................... SUCCESS [10.062s]
[INFO] Apache HBase - Client ............................. FAILURE [50.064s]
[INFO] Apache HBase - Hadoop Compatibility ............... SKIPPED
[INFO] Apache HBase - Hadoop Two Compatibility ........... SKIPPED
[INFO] Apache HBase - Prefix Tree ........................ SKIPPED
[INFO] Apache HBase - Server ............................. SKIPPED
[INFO] Apache HBase - Testing Util ....................... SKIPPED
[INFO] Apache HBase - Thrift ............................. SKIPPED
[INFO] Apache HBase - Rest ............................... SKIPPED
[INFO] Apache HBase - Shell .............................. SKIPPED
[INFO] Apache HBase - Integration Tests .................. SKIPPED
[INFO] Apache HBase - Examples ........................... SKIPPED
[INFO] Apache HBase - Assembly ........................... SKIPPED
[INFO] ------------------------------------------------------------------------
[INFO] BUILD FAILURE
[INFO] ------------------------------------------------------------------------
[INFO] Total time: 2:03.447s
[INFO] Finished at: Sat Sep 26 04:39:05 UTC 2015
[INFO] Final Memory: 58M/731M
[INFO] ------------------------------------------------------------------------
[ERROR] Failed to execute goal org.apache.maven.plugins:maven-surefire-plugin:2.18.1:test
(default-test) on project hbase-client: ExecutionException: java.lang.RuntimeException: The
forked VM terminated without properly saying goodbye. VM crash or System.exit called?
[ERROR] Command was /bin/sh -c cd <https://builds.apache.org/job/HBase-0.98/ws/hbase-client>
&& /home/jenkins/tools/java/jdk1.7.0_25-32/jre/bin/java -enableassertions -XX:MaxDirectMemorySize=1G
-Xmx2800m -XX:MaxPermSize=256m -Djava.security.egd=file:/dev/./urandom -Djava.net.preferIPv4Stack=true
-Djava.awt.headless=true -jar <https://builds.apache.org/job/HBase-0.98/ws/hbase-client/target/surefire/surefirebooter186666262927480337.jar>
<https://builds.apache.org/job/HBase-0.98/ws/hbase-client/target/surefire/surefire1986673557221831685tmp>
<https://builds.apache.org/job/HBase-0.98/ws/hbase-client/target/surefire/surefire_524410337443667410600tmp>
[ERROR] -> [Help 1]
[ERROR] 
[ERROR] To see the full stack trace of the errors, re-run Maven with the -e switch.
[ERROR] Re-run Maven using the -X switch to enable full debug logging.
[ERROR] 
[ERROR] For more information about the errors and possible solutions, please read the following
articles:
[ERROR] [Help 1] http://cwiki.apache.org/confluence/display/MAVEN/MojoFailureException
[ERROR] 
[ERROR] After correcting the problems, you can resume the build with the command
[ERROR]   mvn <goals> -rf :hbase-client
Build step 'Invoke top-level Maven targets' marked build as failure
Performing Post build task...
Match found for :.* : True
Logical operation result is TRUE
Running script  :   ZOMBIE_TESTS_COUNT=`jps | grep surefirebooter | wc -l`
  if [[ $ZOMBIE_TESTS_COUNT != 0 ]] ; then
    #It seems sometimes the tests are not dying immediately. Let's give them 10s
    echo "Suspicious java process found - waiting 10s to see if there are just slow to stop"
    sleep 10   
    ZOMBIE_TESTS_COUNT=`jps | grep surefirebooter | wc -l`
    if [[ $ZOMBIE_TESTS_COUNT != 0 ]] ; then
      echo "There are $ZOMBIE_TESTS_COUNT zombie tests, they should have been killed by surefire
but survived"
      echo "************ BEGIN zombies jstack extract"
      ZB_STACK=`jps | grep surefirebooter | cut -d ' ' -f 1 | xargs -n 1 jstack | grep ".test"
| grep "\.java"`
      jps | grep surefirebooter | cut -d ' ' -f 1 | xargs -n 1 jstack
      echo "************ END  zombies jstack extract"
      JIRA_COMMENT="$JIRA_COMMENT

     {color:red}-1 core zombie tests{color}.  There are ${ZOMBIE_TESTS_COUNT} zombie test(s):
${ZB_STACK}"
      BAD=1
      jps | grep surefirebooter | cut -d ' ' -f 1 | xargs kill -9
    else
      echo "We're ok: there is no zombie test, but some tests took some time to stop"
    fi
  else
    echo "We're ok: there is no zombie test"
  fi
[HBase-0.98] $ /bin/bash -xe /tmp/hudson3436463349105865680.sh
++ jps
++ grep surefirebooter
++ wc -l
+ ZOMBIE_TESTS_COUNT=0
+ [[ 0 != 0 ]]
+ echo 'We'\''re ok: there is no zombie test'
We're ok: there is no zombie test
POST BUILD TASK : SUCCESS
END OF POST BUILD TASK : 0
Archiving artifacts
Sending artifact delta relative to HBase-0.98 #1127
Archived 181 artifacts
Archive block size is 32768
Received 6 blocks and 453984 bytes
Compression is 30.2%
Took 2.5 sec
Recording test results
Updating HBASE-14407

Mime
View raw message