hbase-builds mailing list archives

Site index · List index
Message view « Date » · « Thread »
Top « Date » · « Thread »
From Stack <st...@duboce.net>
Subject Re: Build failed in Jenkins: HBase-1.3 » latest1.8,Hadoop #110
Date Fri, 14 Aug 2015 18:38:38 GMT
Any ideas on why we are getting this "The forked VM terminated without
properly saying goodbye", in these builds?
St.Ack

On Fri, Aug 14, 2015 at 11:08 AM, Apache Jenkins Server <
jenkins@builds.apache.org> wrote:

> See <
> https://builds.apache.org/job/HBase-1.3/jdk=latest1.8,label=Hadoop/110/changes
> >
>
> Changes:
>
> [stack] HBASE-13966 Limit column width in table.jsp (Matt Warhaftig)
>
> ------------------------------------------
> [...truncated 46849 lines...]
> Running org.apache.hadoop.hbase.namespace.TestNamespaceAuditor
> Tests run: 12, Failures: 0, Errors: 0, Skipped: 0, Time elapsed: 92.951
> sec - in org.apache.hadoop.hbase.namespace.TestZKLessNamespaceAuditor
> Java HotSpot(TM) 64-Bit Server VM warning: ignoring option
> MaxPermSize=256m; support was removed in 8.0
> Running org.apache.hadoop.hbase.constraint.TestConstraint
> Tests run: 12, Failures: 0, Errors: 0, Skipped: 0, Time elapsed: 96.778
> sec - in org.apache.hadoop.hbase.namespace.TestNamespaceAuditor
> Java HotSpot(TM) 64-Bit Server VM warning: ignoring option
> MaxPermSize=256m; support was removed in 8.0
> Java HotSpot(TM) 64-Bit Server VM warning: ignoring option
> MaxPermSize=256m; support was removed in 8.0
> Running org.apache.hadoop.hbase.TestNamespace
> Tests run: 5, Failures: 0, Errors: 0, Skipped: 0, Time elapsed: 22.153 sec
> - in org.apache.hadoop.hbase.constraint.TestConstraint
> Java HotSpot(TM) 64-Bit Server VM warning: ignoring option
> MaxPermSize=256m; support was removed in 8.0
> Java HotSpot(TM) 64-Bit Server VM warning: ignoring option
> MaxPermSize=256m; support was removed in 8.0
> Running org.apache.hadoop.hbase.TestMetaMigrationConvertingToPB
> Tests run: 3, Failures: 0, Errors: 0, Skipped: 0, Time elapsed: 2.93 sec -
> in org.apache.hadoop.hbase.TestMetaMigrationConvertingToPB
> Java HotSpot(TM) 64-Bit Server VM warning: ignoring option
> MaxPermSize=256m; support was removed in 8.0
> Tests run: 31, Failures: 0, Errors: 0, Skipped: 0, Time elapsed: 174.775
> sec - in org.apache.hadoop.hbase.wal.TestWALSplit
> Java HotSpot(TM) 64-Bit Server VM warning: ignoring option
> MaxPermSize=256m; support was removed in 8.0
> Java HotSpot(TM) 64-Bit Server VM warning: ignoring option
> MaxPermSize=256m; support was removed in 8.0
> Running org.apache.hadoop.hbase.TestRegionRebalancing
> Tests run: 9, Failures: 0, Errors: 0, Skipped: 1, Time elapsed: 25.647 sec
> - in org.apache.hadoop.hbase.TestNamespace
> Java HotSpot(TM) 64-Bit Server VM warning: ignoring option
> MaxPermSize=256m; support was removed in 8.0
> Java HotSpot(TM) 64-Bit Server VM warning: ignoring option
> MaxPermSize=256m; support was removed in 8.0
> Java HotSpot(TM) 64-Bit Server VM warning: ignoring option
> MaxPermSize=256m; support was removed in 8.0
> Java HotSpot(TM) 64-Bit Server VM warning: ignoring option
> MaxPermSize=256m; support was removed in 8.0
> Java HotSpot(TM) 64-Bit Server VM warning: ignoring option
> MaxPermSize=256m; support was removed in 8.0
> Tests run: 31, Failures: 0, Errors: 0, Skipped: 0, Time elapsed: 177.519
> sec - in org.apache.hadoop.hbase.wal.TestWALSplitCompressed
> Java HotSpot(TM) 64-Bit Server VM warning: ignoring option
> MaxPermSize=256m; support was removed in 8.0
> Running org.apache.hadoop.hbase.TestInfoServers
> Tests run: 3, Failures: 0, Errors: 0, Skipped: 0, Time elapsed: 4.378 sec
> - in org.apache.hadoop.hbase.TestInfoServers
> Running org.apache.hadoop.hbase.filter.TestMultiRowRangeFilter
> Java HotSpot(TM) 64-Bit Server VM warning: ignoring option
> MaxPermSize=256m; support was removed in 8.0
> Java HotSpot(TM) 64-Bit Server VM warning: ignoring option
> MaxPermSize=256m; support was removed in 8.0
> Running org.apache.hadoop.hbase.filter.TestScanRowPrefix
> Java HotSpot(TM) 64-Bit Server VM warning: ignoring option
> MaxPermSize=256m; support was removed in 8.0
> Java HotSpot(TM) 64-Bit Server VM warning: ignoring option
> MaxPermSize=256m; support was removed in 8.0
> Tests run: 1, Failures: 0, Errors: 0, Skipped: 0, Time elapsed: 6.164 sec
> - in org.apache.hadoop.hbase.filter.TestScanRowPrefix
> Java HotSpot(TM) 64-Bit Server VM warning: ignoring option
> MaxPermSize=256m; support was removed in 8.0
> Java HotSpot(TM) 64-Bit Server VM warning: ignoring option
> MaxPermSize=256m; support was removed in 8.0
> Java HotSpot(TM) 64-Bit Server VM warning: ignoring option
> MaxPermSize=256m; support was removed in 8.0
> Java HotSpot(TM) 64-Bit Server VM warning: ignoring option
> MaxPermSize=256m; support was removed in 8.0
> Running org.apache.hadoop.hbase.filter.TestFilterWrapper
> Running org.apache.hadoop.hbase.filter.TestFuzzyRowFilterEndToEnd
> Tests run: 1, Failures: 0, Errors: 0, Skipped: 0, Time elapsed: 4.892 sec
> - in org.apache.hadoop.hbase.filter.TestFilterWrapper
> Java HotSpot(TM) 64-Bit Server VM warning: ignoring option
> MaxPermSize=256m; support was removed in 8.0
> Java HotSpot(TM) 64-Bit Server VM warning: ignoring option
> MaxPermSize=256m; support was removed in 8.0
> Java HotSpot(TM) 64-Bit Server VM warning: ignoring option
> MaxPermSize=256m; support was removed in 8.0
> Tests run: 20, Failures: 0, Errors: 0, Skipped: 0, Time elapsed: 22.924
> sec - in org.apache.hadoop.hbase.filter.TestMultiRowRangeFilter
> Java HotSpot(TM) 64-Bit Server VM warning: ignoring option
> MaxPermSize=256m; support was removed in 8.0
> Java HotSpot(TM) 64-Bit Server VM warning: ignoring option
> MaxPermSize=256m; support was removed in 8.0
> Java HotSpot(TM) 64-Bit Server VM warning: ignoring option
> MaxPermSize=256m; support was removed in 8.0
> Running org.apache.hadoop.hbase.filter.TestFuzzyRowAndColumnRangeFilter
> Running org.apache.hadoop.hbase.filter.TestColumnRangeFilter
> Tests run: 1, Failures: 0, Errors: 0, Skipped: 0, Time elapsed: 3.884 sec
> - in org.apache.hadoop.hbase.filter.TestFuzzyRowAndColumnRangeFilter
> Java HotSpot(TM) 64-Bit Server VM warning: ignoring option
> MaxPermSize=256m; support was removed in 8.0
> Tests run: 1, Failures: 0, Errors: 0, Skipped: 0, Time elapsed: 7.223 sec
> - in org.apache.hadoop.hbase.filter.TestColumnRangeFilter
> Java HotSpot(TM) 64-Bit Server VM warning: ignoring option
> MaxPermSize=256m; support was removed in 8.0
> Java HotSpot(TM) 64-Bit Server VM warning: ignoring option
> MaxPermSize=256m; support was removed in 8.0
> Java HotSpot(TM) 64-Bit Server VM warning: ignoring option
> MaxPermSize=256m; support was removed in 8.0
> Java HotSpot(TM) 64-Bit Server VM warning: ignoring option
> MaxPermSize=256m; support was removed in 8.0
> Java HotSpot(TM) 64-Bit Server VM warning: ignoring option
> MaxPermSize=256m; support was removed in 8.0
> Java HotSpot(TM) 64-Bit Server VM warning: ignoring option
> MaxPermSize=256m; support was removed in 8.0
> Java HotSpot(TM) 64-Bit Server VM warning: ignoring option
> MaxPermSize=256m; support was removed in 8.0
> Tests run: 2, Failures: 0, Errors: 0, Skipped: 0, Time elapsed: 57.975 sec
> - in org.apache.hadoop.hbase.TestRegionRebalancing
> Java HotSpot(TM) 64-Bit Server VM warning: ignoring option
> MaxPermSize=256m; support was removed in 8.0
> Java HotSpot(TM) 64-Bit Server VM warning: ignoring option
> MaxPermSize=256m; support was removed in 8.0
> Java HotSpot(TM) 64-Bit Server VM warning: ignoring option
> MaxPermSize=256m; support was removed in 8.0
> Java HotSpot(TM) 64-Bit Server VM warning: ignoring option
> MaxPermSize=256m; support was removed in 8.0
> Running org.apache.hadoop.hbase.io.TestFileLink
> Running org.apache.hadoop.hbase.filter.TestFilterWithScanLimits
> Running org.apache.hadoop.hbase.io.hfile.TestScannerSelectionUsingTTL
> Tests run: 1, Failures: 0, Errors: 0, Skipped: 0, Time elapsed: 3.629 sec
> - in org.apache.hadoop.hbase.filter.TestFilterWithScanLimits
> Java HotSpot(TM) 64-Bit Server VM warning: ignoring option
> MaxPermSize=256m; support was removed in 8.0
> Java HotSpot(TM) 64-Bit Server VM warning: ignoring option
> MaxPermSize=256m; support was removed in 8.0
> Running org.apache.hadoop.hbase.io.hfile.TestCacheConfig
> Tests run: 6, Failures: 0, Errors: 0, Skipped: 0, Time elapsed: 1.619 sec
> - in org.apache.hadoop.hbase.io.hfile.TestCacheConfig
> Java HotSpot(TM) 64-Bit Server VM warning: ignoring option
> MaxPermSize=256m; support was removed in 8.0
> Running org.apache.hadoop.hbase.io.hfile.TestHFileSeek
> Tests run: 1, Failures: 0, Errors: 0, Skipped: 0, Time elapsed: 1.855 sec
> - in org.apache.hadoop.hbase.io.hfile.TestHFileSeek
> Java HotSpot(TM) 64-Bit Server VM warning: ignoring option
> MaxPermSize=256m; support was removed in 8.0
> Java HotSpot(TM) 64-Bit Server VM warning: ignoring option
> MaxPermSize=256m; support was removed in 8.0
> Tests run: 2, Failures: 0, Errors: 0, Skipped: 0, Time elapsed: 38.271 sec
> - in org.apache.hadoop.hbase.filter.TestFuzzyRowFilterEndToEnd
> Java HotSpot(TM) 64-Bit Server VM warning: ignoring option
> MaxPermSize=256m; support was removed in 8.0
> Java HotSpot(TM) 64-Bit Server VM warning: ignoring option
> MaxPermSize=256m; support was removed in 8.0
> Running org.apache.hadoop.hbase.io.hfile.TestForceCacheImportantBlocks
> Tests run: 5, Failures: 0, Errors: 0, Skipped: 0, Time elapsed: 11.829 sec
> - in org.apache.hadoop.hbase.io.TestFileLink
> Java HotSpot(TM) 64-Bit Server VM warning: ignoring option
> MaxPermSize=256m; support was removed in 8.0
> Java HotSpot(TM) 64-Bit Server VM warning: ignoring option
> MaxPermSize=256m; support was removed in 8.0
> Running org.apache.hadoop.hbase.io.hfile.TestCacheOnWrite
> Java HotSpot(TM) 64-Bit Server VM warning: ignoring option
> MaxPermSize=256m; support was removed in 8.0
> Java HotSpot(TM) 64-Bit Server VM warning: ignoring option
> MaxPermSize=256m; support was removed in 8.0
> Java HotSpot(TM) 64-Bit Server VM warning: ignoring option
> MaxPermSize=256m; support was removed in 8.0
> Running org.apache.hadoop.hbase.io.hfile.TestHFileBlock
> Tests run: 4, Failures: 0, Errors: 0, Skipped: 0, Time elapsed: 36.763 sec
> - in org.apache.hadoop.hbase.io.hfile.TestForceCacheImportantBlocks
> Java HotSpot(TM) 64-Bit Server VM warning: ignoring option
> MaxPermSize=256m; support was removed in 8.0
> Java HotSpot(TM) 64-Bit Server VM warning: ignoring option
> MaxPermSize=256m; support was removed in 8.0
> Java HotSpot(TM) 64-Bit Server VM warning: ignoring option
> MaxPermSize=256m; support was removed in 8.0
> Java HotSpot(TM) 64-Bit Server VM warning: ignoring option
> MaxPermSize=256m; support was removed in 8.0
> Java HotSpot(TM) 64-Bit Server VM warning: ignoring option
> MaxPermSize=256m; support was removed in 8.0
> Java HotSpot(TM) 64-Bit Server VM warning: ignoring option
> MaxPermSize=256m; support was removed in 8.0
> Java HotSpot(TM) 64-Bit Server VM warning: ignoring option
> MaxPermSize=256m; support was removed in 8.0
> Java HotSpot(TM) 64-Bit Server VM warning: ignoring option
> MaxPermSize=256m; support was removed in 8.0
> Java HotSpot(TM) 64-Bit Server VM warning: ignoring option
> MaxPermSize=256m; support was removed in 8.0
> Java HotSpot(TM) 64-Bit Server VM warning: ignoring option
> MaxPermSize=256m; support was removed in 8.0
> Running org.apache.hadoop.hbase.io.hfile.TestHFileBlockIndex
> Tests run: 6, Failures: 0, Errors: 0, Skipped: 0, Time elapsed: 62.81 sec
> - in org.apache.hadoop.hbase.io.hfile.TestScannerSelectionUsingTTL
> Java HotSpot(TM) 64-Bit Server VM warning: ignoring option
> MaxPermSize=256m; support was removed in 8.0
> Java HotSpot(TM) 64-Bit Server VM warning: ignoring option
> MaxPermSize=256m; support was removed in 8.0
> Java HotSpot(TM) 64-Bit Server VM warning: ignoring option
> MaxPermSize=256m; support was removed in 8.0
> Java HotSpot(TM) 64-Bit Server VM warning: ignoring option
> MaxPermSize=256m; support was removed in 8.0
> Java HotSpot(TM) 64-Bit Server VM warning: ignoring option
> MaxPermSize=256m; support was removed in 8.0
> Tests run: 10, Failures: 0, Errors: 0, Skipped: 0, Time elapsed: 8.848 sec
> - in org.apache.hadoop.hbase.io.hfile.TestHFileBlockIndex
> Java HotSpot(TM) 64-Bit Server VM warning: ignoring option
> MaxPermSize=256m; support was removed in 8.0
> Java HotSpot(TM) 64-Bit Server VM warning: ignoring option
> MaxPermSize=256m; support was removed in 8.0
> Java HotSpot(TM) 64-Bit Server VM warning: ignoring option
> MaxPermSize=256m; support was removed in 8.0
> Java HotSpot(TM) 64-Bit Server VM warning: ignoring option
> MaxPermSize=256m; support was removed in 8.0
> Java HotSpot(TM) 64-Bit Server VM warning: ignoring option
> MaxPermSize=256m; support was removed in 8.0
> Java HotSpot(TM) 64-Bit Server VM warning: ignoring option
> MaxPermSize=256m; support was removed in 8.0
> Running org.apache.hadoop.hbase.io.encoding.TestLoadAndSwitchEncodeOnDisk
> Java HotSpot(TM) 64-Bit Server VM warning: ignoring option
> MaxPermSize=256m; support was removed in 8.0
> Running org.apache.hadoop.hbase.io.encoding.TestBufferedDataBlockEncoder
> Tests run: 51, Failures: 0, Errors: 0, Skipped: 1, Time elapsed: 367.064
> sec - in org.apache.hadoop.hbase.util.TestHBaseFsck
> Java HotSpot(TM) 64-Bit Server VM warning: ignoring option
> MaxPermSize=256m; support was removed in 8.0
> Running org.apache.hadoop.hbase.io.encoding.TestEncodedSeekers
> Tests run: 1, Failures: 0, Errors: 0, Skipped: 0, Time elapsed: 16.591 sec
> - in org.apache.hadoop.hbase.io.encoding.TestBufferedDataBlockEncoder
> Java HotSpot(TM) 64-Bit Server VM warning: ignoring option
> MaxPermSize=256m; support was removed in 8.0
> Running org.apache.hadoop.hbase.io.encoding.TestDataBlockEncoders
> Tests run: 1, Failures: 0, Errors: 0, Skipped: 0, Time elapsed: 29.549 sec
> - in org.apache.hadoop.hbase.io.encoding.TestLoadAndSwitchEncodeOnDisk
> Java HotSpot(TM) 64-Bit Server VM warning: ignoring option
> MaxPermSize=256m; support was removed in 8.0
> Java HotSpot(TM) 64-Bit Server VM warning: ignoring option
> MaxPermSize=256m; support was removed in 8.0
> Tests run: 28, Failures: 0, Errors: 0, Skipped: 0, Time elapsed: 90.489
> sec - in org.apache.hadoop.hbase.io.hfile.TestHFileBlock
> Java HotSpot(TM) 64-Bit Server VM warning: ignoring option
> MaxPermSize=256m; support was removed in 8.0
> Java HotSpot(TM) 64-Bit Server VM warning: ignoring option
> MaxPermSize=256m; support was removed in 8.0
> Java HotSpot(TM) 64-Bit Server VM warning: ignoring option
> MaxPermSize=256m; support was removed in 8.0
> Running org.apache.hadoop.hbase.io.encoding.TestChangingEncoding
> Java HotSpot(TM) 64-Bit Server VM warning: ignoring option
> MaxPermSize=256m; support was removed in 8.0
> Running org.apache.hadoop.hbase.TestClusterBootOrder
> Tests run: 2, Failures: 0, Errors: 0, Skipped: 0, Time elapsed: 26.62 sec
> - in org.apache.hadoop.hbase.TestClusterBootOrder
> Tests run: 20, Failures: 0, Errors: 0, Skipped: 0, Time elapsed: 116.05
> sec - in org.apache.hadoop.hbase.io.encoding.TestEncodedSeekers
> Tests run: 3, Failures: 0, Errors: 0, Skipped: 0, Time elapsed: 180.191
> sec - in org.apache.hadoop.hbase.io.encoding.TestChangingEncoding
> Tests run: 28, Failures: 0, Errors: 0, Skipped: 0, Time elapsed: 208.386
> sec - in org.apache.hadoop.hbase.io.encoding.TestDataBlockEncoders
> Tests run: 216, Failures: 0, Errors: 0, Skipped: 0, Time elapsed: 382.579
> sec - in org.apache.hadoop.hbase.io.hfile.TestCacheOnWrite
>
> Results :
>
>
>
> Flaked tests:
>
> org.apache.hadoop.hbase.master.TestTableLockManager.testReapAllTableLocks(org.apache.hadoop.hbase.master.TestTableLockManager)
>   Run 1: TestTableLockManager.testReapAllTableLocks:283 » LockTimeout
> Timed out acquiri...
>   Run 2: PASS
>
>
> org.apache.hadoop.hbase.regionserver.TestSplitWalDataLoss.test(org.apache.hadoop.hbase.regionserver.TestSplitWalDataLoss)
>   Run 1: TestSplitWalDataLoss.test:121 » RetriesExhaustedWithDetails
> Failed 1 action: T...
>   Run 2: PASS
>
>
> org.apache.hadoop.hbase.replication.TestReplicationEndpoint.testReplicationEndpointReturnsFalseOnReplicate(org.apache.hadoop.hbase.replication.TestReplicationEndpoint)
>   Run 1:
> TestReplicationEndpoint.testReplicationEndpointReturnsFalseOnReplicate:145
> Waiting timed out after [60,000] msec
>   Run 2: PASS
>
>
> Tests run: 2657, Failures: 0, Errors: 0, Skipped: 18, Flakes: 3
>
> [INFO]
> ------------------------------------------------------------------------
> [INFO] Reactor Summary:
> [INFO]
> [INFO] Apache HBase ...................................... SUCCESS
> [1:20.740s]
> [INFO] Apache HBase - Checkstyle ......................... SUCCESS [6.645s]
> [INFO] Apache HBase - Resource Bundle .................... SUCCESS [0.206s]
> [INFO] Apache HBase - Annotations ........................ SUCCESS [1.005s]
> [INFO] Apache HBase - Protocol ........................... SUCCESS
> [17.196s]
> [INFO] Apache HBase - Common ............................. SUCCESS
> [2:08.096s]
> [INFO] Apache HBase - Procedure .......................... SUCCESS
> [1:52.359s]
> [INFO] Apache HBase - Client ............................. SUCCESS
> [1:23.324s]
> [INFO] Apache HBase - Hadoop Compatibility ............... SUCCESS [8.637s]
> [INFO] Apache HBase - Hadoop Two Compatibility ........... SUCCESS [8.430s]
> [INFO] Apache HBase - Prefix Tree ........................ SUCCESS [7.291s]
> [INFO] Apache HBase - Server ............................. FAILURE
> [1:32:31.825s]
> [INFO] Apache HBase - Testing Util ....................... SKIPPED
> [INFO] Apache HBase - Thrift ............................. SKIPPED
> [INFO] Apache HBase - Rest ............................... SKIPPED
> [INFO] Apache HBase - Shell .............................. SKIPPED
> [INFO] Apache HBase - Integration Tests .................. SKIPPED
> [INFO] Apache HBase - Examples ........................... SKIPPED
> [INFO] Apache HBase - Assembly ........................... SKIPPED
> [INFO] Apache HBase - Shaded ............................. SKIPPED
> [INFO] Apache HBase - Shaded - Client .................... SKIPPED
> [INFO] Apache HBase - Shaded - Server .................... SKIPPED
> [INFO]
> ------------------------------------------------------------------------
> [INFO] BUILD FAILURE
> [INFO]
> ------------------------------------------------------------------------
> [INFO] Total time: 1:40:30.084s
> [INFO] Finished at: Fri Aug 14 18:05:56 UTC 2015
> [INFO] Final Memory: 97M/693M
> [INFO]
> ------------------------------------------------------------------------
> [ERROR] Failed to execute goal
> org.apache.maven.plugins:maven-surefire-plugin:2.18:test
> (secondPartTestsExecution) on project hbase-server: ExecutionException:
> java.lang.RuntimeException: The forked VM terminated without properly
> saying goodbye. VM crash or System.exit called?
> [ERROR] Command was /bin/sh -c cd <
> https://builds.apache.org/job/HBase-1.3/jdk=latest1.8,label=Hadoop/ws/hbase-server>
> &&
> /home/jenkins/jenkins-slave/tools/hudson.model.JDK/latest1.8/jre/bin/java
> -enableassertions -XX:MaxDirectMemorySize=1G -Xmx2800m -XX:MaxPermSize=256m
> -Djava.security.egd=file:/dev/./urandom -Djava.net.preferIPv4Stack=true
> -Djava.awt.headless=true -jar <
> https://builds.apache.org/job/HBase-1.3/jdk=latest1.8,label=Hadoop/ws/hbase-server/target/surefire/surefirebooter3576834052906340164.jar>
> <
> https://builds.apache.org/job/HBase-1.3/jdk=latest1.8,label=Hadoop/ws/hbase-server/target/surefire/surefire633615529398050398tmp>
> <
> https://builds.apache.org/job/HBase-1.3/jdk=latest1.8,label=Hadoop/ws/hbase-server/target/surefire/surefire_10253936971156728207489tmp
> >
> [ERROR] -> [Help 1]
> [ERROR]
> [ERROR] To see the full stack trace of the errors, re-run Maven with the
> -e switch.
> [ERROR] Re-run Maven using the -X switch to enable full debug logging.
> [ERROR]
> [ERROR] For more information about the errors and possible solutions,
> please read the following articles:
> [ERROR] [Help 1]
> http://cwiki.apache.org/confluence/display/MAVEN/MojoFailureException
> [ERROR]
> [ERROR] After correcting the problems, you can resume the build with the
> command
> [ERROR]   mvn <goals> -rf :hbase-server
> Build step 'Invoke top-level Maven targets' marked build as failure
> Performing Post build task...
> Match found for :.* : True
> Logical operation result is TRUE
> Running script  :   ZOMBIE_TESTS_COUNT=`jps | grep surefirebooter | wc -l`
>   if [[ $ZOMBIE_TESTS_COUNT != 0 ]] ; then
>     #It seems sometimes the tests are not dying immediately. Let's give
> them 10s
>     echo "Suspicious java process found - waiting 10s to see if there are
> just slow to stop"
>     sleep 10
>     ZOMBIE_TESTS_COUNT=`jps | grep surefirebooter | wc -l`
>     if [[ $ZOMBIE_TESTS_COUNT != 0 ]] ; then
>       echo "There are $ZOMBIE_TESTS_COUNT zombie tests, they should have
> been killed by surefire but survived"
>       echo "************ BEGIN zombies jstack extract"
>       ZB_STACK=`jps | grep surefirebooter | cut -d ' ' -f 1 | xargs -n 1
> jstack | grep ".test" | grep "\.java"`
>       jps | grep surefirebooter | cut -d ' ' -f 1 | xargs -n 1 jstack
>       echo "************ END  zombies jstack extract"
>       JIRA_COMMENT="$JIRA_COMMENT
>
>      {color:red}-1 core zombie tests{color}.  There are
> ${ZOMBIE_TESTS_COUNT} zombie test(s): ${ZB_STACK}"
>       BAD=1
>       jps | grep surefirebooter | cut -d ' ' -f 1 | xargs kill -9
>     else
>       echo "We're ok: there is no zombie test, but some tests took some
> time to stop"
>     fi
>   else
>     echo "We're ok: there is no zombie test"
>   fi
> [Hadoop] $ /bin/bash -xe /tmp/hudson1646115724944060795.sh
> ++ jps
> ++ grep surefirebooter
> ++ wc -l
> + ZOMBIE_TESTS_COUNT=0
> + [[ 0 != 0 ]]
> + echo 'We'\''re ok: there is no zombie test'
> We're ok: there is no zombie test
> POST BUILD TASK : SUCCESS
> END OF POST BUILD TASK : 0
> Archiving artifacts
> Sending artifact delta relative to HBase-1.3 » latest1.8,Hadoop #109
> Archived 2116 artifacts
> Archive block size is 32768
> Received 39 blocks and 609565706 bytes
> Compression is 0.2%
> Took 2 min 59 sec
>

Mime
  • Unnamed multipart/alternative (inline, None, 0 bytes)
View raw message