hbase-builds mailing list archives

Site index · List index
Message view « Date » · « Thread »
Top « Date » · « Thread »
From Apache Jenkins Server <jenk...@builds.apache.org>
Subject Build failed in Jenkins: HBase-1.3 » latest1.7,Hadoop #92
Date Thu, 06 Aug 2015 19:20:44 GMT
See <https://builds.apache.org/job/HBase-1.3/jdk=latest1.7,label=Hadoop/92/changes>

Changes:

[ndimiduk] HBASE-13865 Increase the default value for hbase.hregion.memstore.block.multipler
from 2 to 4 (part 2)

------------------------------------------
[...truncated 44574 lines...]
Tests run: 2, Failures: 0, Errors: 0, Skipped: 0, Time elapsed: 9.723 sec - in org.apache.hadoop.hbase.coprocessor.TestCoprocessorInterface
Running org.apache.hadoop.hbase.coprocessor.TestRegionObserverStacking
Tests run: 1, Failures: 0, Errors: 0, Skipped: 0, Time elapsed: 1.514 sec - in org.apache.hadoop.hbase.coprocessor.TestRegionObserverStacking
Running org.apache.hadoop.hbase.protobuf.TestReplicationProtobuf
Tests run: 1, Failures: 0, Errors: 0, Skipped: 0, Time elapsed: 0.447 sec - in org.apache.hadoop.hbase.protobuf.TestReplicationProtobuf
Running org.apache.hadoop.hbase.protobuf.TestProtobufUtil
Tests run: 7, Failures: 0, Errors: 0, Skipped: 0, Time elapsed: 1.469 sec - in org.apache.hadoop.hbase.protobuf.TestProtobufUtil
Running org.apache.hadoop.hbase.TestFSTableDescriptorForceCreation
Tests run: 3, Failures: 0, Errors: 0, Skipped: 0, Time elapsed: 1.29 sec - in org.apache.hadoop.hbase.TestFSTableDescriptorForceCreation
Running org.apache.hadoop.hbase.errorhandling.TestForeignExceptionDispatcher
Tests run: 3, Failures: 0, Errors: 0, Skipped: 0, Time elapsed: 0.627 sec - in org.apache.hadoop.hbase.errorhandling.TestForeignExceptionDispatcher
Running org.apache.hadoop.hbase.errorhandling.TestTimeoutExceptionInjector
Tests run: 4, Failures: 0, Errors: 0, Skipped: 0, Time elapsed: 0.72 sec - in org.apache.hadoop.hbase.errorhandling.TestTimeoutExceptionInjector
Running org.apache.hadoop.hbase.errorhandling.TestForeignExceptionSerialization
Tests run: 2, Failures: 0, Errors: 0, Skipped: 0, Time elapsed: 0.503 sec - in org.apache.hadoop.hbase.errorhandling.TestForeignExceptionSerialization
Running org.apache.hadoop.hbase.TestHRegionLocation
Tests run: 3, Failures: 0, Errors: 0, Skipped: 0, Time elapsed: 0.557 sec - in org.apache.hadoop.hbase.TestHRegionLocation
Running org.apache.hadoop.hbase.conf.TestConfigurationManager
Tests run: 2, Failures: 0, Errors: 0, Skipped: 0, Time elapsed: 0.435 sec - in org.apache.hadoop.hbase.conf.TestConfigurationManager
Running org.apache.hadoop.hbase.snapshot.TestRestoreSnapshotHelper
Tests run: 1, Failures: 0, Errors: 0, Skipped: 0, Time elapsed: 2.056 sec - in org.apache.hadoop.hbase.snapshot.TestRestoreSnapshotHelper
Running org.apache.hadoop.hbase.TestIPv6NIOServerSocketChannel
Tests run: 2, Failures: 0, Errors: 0, Skipped: 0, Time elapsed: 0.637 sec - in org.apache.hadoop.hbase.TestIPv6NIOServerSocketChannel
Running org.apache.hadoop.hbase.quotas.TestRateLimiter
Tests run: 12, Failures: 0, Errors: 0, Skipped: 0, Time elapsed: 0.972 sec - in org.apache.hadoop.hbase.quotas.TestRateLimiter
Running org.apache.hadoop.hbase.quotas.TestQuotaState
Tests run: 5, Failures: 0, Errors: 0, Skipped: 0, Time elapsed: 1.279 sec - in org.apache.hadoop.hbase.quotas.TestQuotaState
Running org.apache.hadoop.hbase.TestSerialization
Tests run: 9, Failures: 0, Errors: 0, Skipped: 0, Time elapsed: 1.827 sec - in org.apache.hadoop.hbase.TestSerialization
Running org.apache.hadoop.hbase.util.TestBoundedPriorityBlockingQueue
Tests run: 7, Failures: 0, Errors: 0, Skipped: 0, Time elapsed: 1.722 sec - in org.apache.hadoop.hbase.util.TestBoundedPriorityBlockingQueue
Running org.apache.hadoop.hbase.util.TestIncrementingEnvironmentEdge
Tests run: 1, Failures: 0, Errors: 0, Skipped: 0, Time elapsed: 0.37 sec - in org.apache.hadoop.hbase.util.TestIncrementingEnvironmentEdge
Running org.apache.hadoop.hbase.util.TestByteBloomFilter
Tests run: 5, Failures: 0, Errors: 0, Skipped: 0, Time elapsed: 1.304 sec - in org.apache.hadoop.hbase.util.TestByteBloomFilter
Running org.apache.hadoop.hbase.util.TestHFileArchiveUtil
Tests run: 4, Failures: 0, Errors: 0, Skipped: 0, Time elapsed: 1.258 sec - in org.apache.hadoop.hbase.util.TestHFileArchiveUtil
Running org.apache.hadoop.hbase.util.TestConfigurationUtil
Tests run: 2, Failures: 0, Errors: 0, Skipped: 0, Time elapsed: 0.555 sec - in org.apache.hadoop.hbase.util.TestConfigurationUtil
Running org.apache.hadoop.hbase.util.TestPoolMap$TestRoundRobinPoolType
Tests run: 3, Failures: 0, Errors: 0, Skipped: 0, Time elapsed: 0.494 sec - in org.apache.hadoop.hbase.util.TestPoolMap$TestRoundRobinPoolType
Running org.apache.hadoop.hbase.util.TestEncryptionTest
Tests run: 3, Failures: 0, Errors: 0, Skipped: 0, Time elapsed: 1.445 sec - in org.apache.hadoop.hbase.util.TestEncryptionTest
Running org.apache.hadoop.hbase.util.TestPoolMap$TestRoundRobinPoolType
Tests run: 3, Failures: 0, Errors: 0, Skipped: 0, Time elapsed: 0.488 sec - in org.apache.hadoop.hbase.util.TestPoolMap$TestRoundRobinPoolType
Running org.apache.hadoop.hbase.util.TestPoolMap$TestThreadLocalPoolType
Tests run: 3, Failures: 0, Errors: 0, Skipped: 0, Time elapsed: 0.175 sec - in org.apache.hadoop.hbase.util.TestPoolMap$TestThreadLocalPoolType
Running org.apache.hadoop.hbase.util.TestPoolMap$TestReusablePoolType
Tests run: 3, Failures: 0, Errors: 0, Skipped: 0, Time elapsed: 0.18 sec - in org.apache.hadoop.hbase.util.TestPoolMap$TestReusablePoolType
Running org.apache.hadoop.hbase.util.TestPoolMap$TestThreadLocalPoolType
Tests run: 3, Failures: 0, Errors: 0, Skipped: 0, Time elapsed: 0.503 sec - in org.apache.hadoop.hbase.util.TestPoolMap$TestThreadLocalPoolType
Running org.apache.hadoop.hbase.util.TestPoolMap$TestReusablePoolType
Tests run: 3, Failures: 0, Errors: 0, Skipped: 0, Time elapsed: 0.499 sec - in org.apache.hadoop.hbase.util.TestPoolMap$TestReusablePoolType
Running org.apache.hadoop.hbase.util.TestHBaseFsckComparator
Tests run: 6, Failures: 0, Errors: 0, Skipped: 0, Time elapsed: 0.605 sec - in org.apache.hadoop.hbase.util.TestHBaseFsckComparator
Running org.apache.hadoop.hbase.util.TestRegionSplitCalculator
Tests run: 15, Failures: 0, Errors: 0, Skipped: 0, Time elapsed: 1.142 sec - in org.apache.hadoop.hbase.util.TestRegionSplitCalculator
Running org.apache.hadoop.hbase.util.TestBoundedConcurrentLinkedQueue
Tests run: 4, Failures: 0, Errors: 0, Skipped: 0, Time elapsed: 5.56 sec - in org.apache.hadoop.hbase.util.TestBoundedConcurrentLinkedQueue
Running org.apache.hadoop.hbase.util.TestRootPath
Tests run: 1, Failures: 0, Errors: 0, Skipped: 0, Time elapsed: 0.316 sec - in org.apache.hadoop.hbase.util.TestRootPath
Running org.apache.hadoop.hbase.util.TestStealJobQueue
Tests run: 7, Failures: 0, Errors: 0, Skipped: 0, Time elapsed: 0.941 sec - in org.apache.hadoop.hbase.util.TestStealJobQueue
Running org.apache.hadoop.hbase.util.TestSortedCopyOnWriteSet
Tests run: 2, Failures: 0, Errors: 0, Skipped: 0, Time elapsed: 0.438 sec - in org.apache.hadoop.hbase.util.TestSortedCopyOnWriteSet
Running org.apache.hadoop.hbase.util.TestByteBufferUtils
Tests run: 12, Failures: 0, Errors: 0, Skipped: 0, Time elapsed: 1.322 sec - in org.apache.hadoop.hbase.util.TestByteBufferUtils
Running org.apache.hadoop.hbase.util.TestCompressionTest
Tests run: 2, Failures: 0, Errors: 0, Skipped: 0, Time elapsed: 0.616 sec - in org.apache.hadoop.hbase.util.TestCompressionTest
Running org.apache.hadoop.hbase.util.TestRegionSizeCalculator
Tests run: 3, Failures: 0, Errors: 0, Skipped: 0, Time elapsed: 0.896 sec - in org.apache.hadoop.hbase.util.TestRegionSizeCalculator
Running org.apache.hadoop.hbase.wal.TestWALMethods
Tests run: 3, Failures: 0, Errors: 0, Skipped: 0, Time elapsed: 1.07 sec - in org.apache.hadoop.hbase.wal.TestWALMethods
Running org.apache.hadoop.hbase.TestServerName
Tests run: 7, Failures: 0, Errors: 0, Skipped: 0, Time elapsed: 0.749 sec - in org.apache.hadoop.hbase.TestServerName
Running org.apache.hadoop.hbase.http.TestGlobalFilter
Tests run: 1, Failures: 0, Errors: 0, Skipped: 0, Time elapsed: 0.866 sec - in org.apache.hadoop.hbase.http.TestGlobalFilter
Running org.apache.hadoop.hbase.http.TestPathFilter
Tests run: 1, Failures: 0, Errors: 0, Skipped: 0, Time elapsed: 0.84 sec - in org.apache.hadoop.hbase.http.TestPathFilter
Running org.apache.hadoop.hbase.http.TestServletFilter
Tests run: 3, Failures: 0, Errors: 0, Skipped: 1, Time elapsed: 0.904 sec - in org.apache.hadoop.hbase.http.TestServletFilter
Running org.apache.hadoop.hbase.http.TestHttpRequestLogAppender
Tests run: 1, Failures: 0, Errors: 0, Skipped: 0, Time elapsed: 0.385 sec - in org.apache.hadoop.hbase.http.TestHttpRequestLogAppender
Running org.apache.hadoop.hbase.http.TestHttpServerLifecycle
Tests run: 6, Failures: 0, Errors: 0, Skipped: 0, Time elapsed: 1.664 sec - in org.apache.hadoop.hbase.http.TestHttpServerLifecycle
Running org.apache.hadoop.hbase.http.TestSSLHttpServer
Tests run: 1, Failures: 0, Errors: 0, Skipped: 0, Time elapsed: 0.466 sec - in org.apache.hadoop.hbase.http.TestSSLHttpServer
Running org.apache.hadoop.hbase.http.lib.TestStaticUserWebFilter
Tests run: 3, Failures: 0, Errors: 0, Skipped: 0, Time elapsed: 0.848 sec - in org.apache.hadoop.hbase.http.lib.TestStaticUserWebFilter
Running org.apache.hadoop.hbase.http.jmx.TestJMXJsonServlet
Tests run: 1, Failures: 0, Errors: 0, Skipped: 0, Time elapsed: 0.526 sec - in org.apache.hadoop.hbase.http.jmx.TestJMXJsonServlet
Running org.apache.hadoop.hbase.http.conf.TestConfServlet
Tests run: 3, Failures: 0, Errors: 0, Skipped: 0, Time elapsed: 0.74 sec - in org.apache.hadoop.hbase.http.conf.TestConfServlet
Running org.apache.hadoop.hbase.http.log.TestLogLevel
Tests run: 1, Failures: 0, Errors: 0, Skipped: 0, Time elapsed: 0.933 sec - in org.apache.hadoop.hbase.http.log.TestLogLevel
Running org.apache.hadoop.hbase.http.TestHttpRequestLog
Tests run: 2, Failures: 0, Errors: 0, Skipped: 0, Time elapsed: 0.436 sec - in org.apache.hadoop.hbase.http.TestHttpRequestLog
Running org.apache.hadoop.hbase.http.TestHtmlQuoting
Tests run: 4, Failures: 0, Errors: 0, Skipped: 0, Time elapsed: 0.763 sec - in org.apache.hadoop.hbase.http.TestHtmlQuoting
Running org.apache.hadoop.hbase.http.TestHttpServerWebapps
Tests run: 2, Failures: 0, Errors: 0, Skipped: 0, Time elapsed: 0.51 sec - in org.apache.hadoop.hbase.http.TestHttpServerWebapps
Running org.apache.hadoop.hbase.http.TestHttpServer
Tests run: 15, Failures: 0, Errors: 0, Skipped: 3, Time elapsed: 2.899 sec - in org.apache.hadoop.hbase.http.TestHttpServer
Running org.apache.hadoop.hbase.filter.TestColumnPrefixFilter
Tests run: 2, Failures: 0, Errors: 0, Skipped: 0, Time elapsed: 4.61 sec - in org.apache.hadoop.hbase.filter.TestColumnPrefixFilter
Running org.apache.hadoop.hbase.filter.TestPageFilter
Tests run: 2, Failures: 0, Errors: 0, Skipped: 0, Time elapsed: 0.446 sec - in org.apache.hadoop.hbase.filter.TestPageFilter
Running org.apache.hadoop.hbase.filter.TestFilter
Tests run: 21, Failures: 0, Errors: 0, Skipped: 0, Time elapsed: 6.011 sec - in org.apache.hadoop.hbase.filter.TestFilter
Running org.apache.hadoop.hbase.filter.TestComparatorSerialization
Tests run: 6, Failures: 0, Errors: 0, Skipped: 0, Time elapsed: 1.446 sec - in org.apache.hadoop.hbase.filter.TestComparatorSerialization
Running org.apache.hadoop.hbase.filter.TestDependentColumnFilter
Tests run: 4, Failures: 0, Errors: 0, Skipped: 0, Time elapsed: 2.22 sec - in org.apache.hadoop.hbase.filter.TestDependentColumnFilter
Running org.apache.hadoop.hbase.filter.TestParseFilter
Tests run: 34, Failures: 0, Errors: 0, Skipped: 0, Time elapsed: 2.355 sec - in org.apache.hadoop.hbase.filter.TestParseFilter
Running org.apache.hadoop.hbase.filter.TestNullComparator
Tests run: 3, Failures: 0, Errors: 0, Skipped: 0, Time elapsed: 0.5 sec - in org.apache.hadoop.hbase.filter.TestNullComparator
Running org.apache.hadoop.hbase.filter.TestFirstKeyValueMatchingQualifiersFilter
Tests run: 1, Failures: 0, Errors: 0, Skipped: 0, Time elapsed: 0.318 sec - in org.apache.hadoop.hbase.filter.TestFirstKeyValueMatchingQualifiersFilter
Running org.apache.hadoop.hbase.filter.TestRegexComparator
Tests run: 3, Failures: 0, Errors: 0, Skipped: 0, Time elapsed: 0.676 sec - in org.apache.hadoop.hbase.filter.TestRegexComparator
Running org.apache.hadoop.hbase.filter.TestSingleColumnValueExcludeFilter
Tests run: 1, Failures: 0, Errors: 0, Skipped: 0, Time elapsed: 0.329 sec - in org.apache.hadoop.hbase.filter.TestSingleColumnValueExcludeFilter
Running org.apache.hadoop.hbase.filter.TestMultipleColumnPrefixFilter
Tests run: 3, Failures: 0, Errors: 0, Skipped: 0, Time elapsed: 5.442 sec - in org.apache.hadoop.hbase.filter.TestMultipleColumnPrefixFilter
Running org.apache.hadoop.hbase.filter.TestSingleColumnValueFilter
Tests run: 3, Failures: 0, Errors: 0, Skipped: 0, Time elapsed: 1.103 sec - in org.apache.hadoop.hbase.filter.TestSingleColumnValueFilter
Running org.apache.hadoop.hbase.filter.TestFilterSerialization
Tests run: 26, Failures: 0, Errors: 0, Skipped: 0, Time elapsed: 2.66 sec - in org.apache.hadoop.hbase.filter.TestFilterSerialization
Running org.apache.hadoop.hbase.filter.TestPrefixFilter
Tests run: 3, Failures: 0, Errors: 0, Skipped: 0, Time elapsed: 0.43 sec - in org.apache.hadoop.hbase.filter.TestPrefixFilter
Running org.apache.hadoop.hbase.filter.TestBitComparator
Tests run: 6, Failures: 0, Errors: 0, Skipped: 0, Time elapsed: 0.678 sec - in org.apache.hadoop.hbase.filter.TestBitComparator
Running org.apache.hadoop.hbase.filter.TestRandomRowFilter
Tests run: 2, Failures: 0, Errors: 0, Skipped: 0, Time elapsed: 0.722 sec - in org.apache.hadoop.hbase.filter.TestRandomRowFilter
Running org.apache.hadoop.hbase.filter.TestFuzzyRowFilter
Tests run: 6, Failures: 0, Errors: 0, Skipped: 0, Time elapsed: 0.692 sec - in org.apache.hadoop.hbase.filter.TestFuzzyRowFilter
Running org.apache.hadoop.hbase.filter.TestColumnPaginationFilter
Tests run: 1, Failures: 0, Errors: 0, Skipped: 0, Time elapsed: 2.976 sec - in org.apache.hadoop.hbase.filter.TestColumnPaginationFilter
Running org.apache.hadoop.hbase.filter.TestInclusiveStopFilter
Tests run: 2, Failures: 0, Errors: 0, Skipped: 0, Time elapsed: 0.363 sec - in org.apache.hadoop.hbase.filter.TestInclusiveStopFilter
Running org.apache.hadoop.hbase.filter.TestFilterList
Tests run: 7, Failures: 0, Errors: 0, Skipped: 0, Time elapsed: 1.317 sec - in org.apache.hadoop.hbase.filter.TestFilterList
Running org.apache.hadoop.hbase.filter.TestInvocationRecordFilter
Tests run: 1, Failures: 0, Errors: 0, Skipped: 0, Time elapsed: 1.733 sec - in org.apache.hadoop.hbase.filter.TestInvocationRecordFilter

Results :


Tests in error: 
org.apache.hadoop.hbase.io.hfile.bucket.TestBucketCache.testCacheMultiThreadedSingleKey[0:
blockSize=8,192, bucketSizes=null](org.apache.hadoop.hbase.io.hfile.bucket.TestBucketCache)
  Run 1: TestBucketCache.testCacheMultiThreadedSingleKey:176 » OutOfMemory unable to cr...
  Run 2: TestBucketCache.testCacheMultiThreadedSingleKey:176 » OutOfMemory unable to cr...
  Run 3: TestBucketCache.testCacheMultiThreadedSingleKey:176 » OutOfMemory unable to cr...

  TestBucketCache.testCacheMultiThreadedSingleKey:176 » OutOfMemory unable to cr...


Tests run: 959, Failures: 0, Errors: 2, Skipped: 6

[INFO] ------------------------------------------------------------------------
[INFO] Reactor Summary:
[INFO] 
[INFO] Apache HBase ...................................... SUCCESS [1:34.852s]
[INFO] Apache HBase - Checkstyle ......................... SUCCESS [7.665s]
[INFO] Apache HBase - Resource Bundle .................... SUCCESS [0.214s]
[INFO] Apache HBase - Annotations ........................ SUCCESS [0.995s]
[INFO] Apache HBase - Protocol ........................... SUCCESS [15.580s]
[INFO] Apache HBase - Common ............................. SUCCESS [2:08.367s]
[INFO] Apache HBase - Procedure .......................... SUCCESS [1:52.825s]
[INFO] Apache HBase - Client ............................. SUCCESS [1:26.526s]
[INFO] Apache HBase - Hadoop Compatibility ............... SUCCESS [7.611s]
[INFO] Apache HBase - Hadoop Two Compatibility ........... SUCCESS [9.050s]
[INFO] Apache HBase - Prefix Tree ........................ SUCCESS [9.662s]
[INFO] Apache HBase - Server ............................. FAILURE [15:23.504s]
[INFO] Apache HBase - Testing Util ....................... SKIPPED
[INFO] Apache HBase - Thrift ............................. SKIPPED
[INFO] Apache HBase - Rest ............................... SKIPPED
[INFO] Apache HBase - Shell .............................. SKIPPED
[INFO] Apache HBase - Integration Tests .................. SKIPPED
[INFO] Apache HBase - Examples ........................... SKIPPED
[INFO] Apache HBase - Assembly ........................... SKIPPED
[INFO] Apache HBase - Shaded ............................. SKIPPED
[INFO] Apache HBase - Shaded - Client .................... SKIPPED
[INFO] Apache HBase - Shaded - Server .................... SKIPPED
[INFO] ------------------------------------------------------------------------
[INFO] BUILD FAILURE
[INFO] ------------------------------------------------------------------------
[INFO] Total time: 23:47.094s
[INFO] Finished at: Thu Aug 06 19:20:50 UTC 2015
[INFO] Final Memory: 95M/488M
[INFO] ------------------------------------------------------------------------
[ERROR] Failed to execute goal org.apache.maven.plugins:maven-surefire-plugin:2.18:test (default-test)
on project hbase-server: There are test failures.
[ERROR] 
[ERROR] Please refer to <https://builds.apache.org/job/HBase-1.3/jdk=latest1.7,label=Hadoop/ws/hbase-server/target/surefire-reports>
for the individual test results.
[ERROR] -> [Help 1]
[ERROR] 
[ERROR] To see the full stack trace of the errors, re-run Maven with the -e switch.
[ERROR] Re-run Maven using the -X switch to enable full debug logging.
[ERROR] 
[ERROR] For more information about the errors and possible solutions, please read the following
articles:
[ERROR] [Help 1] http://cwiki.apache.org/confluence/display/MAVEN/MojoFailureException
[ERROR] 
[ERROR] After correcting the problems, you can resume the build with the command
[ERROR]   mvn <goals> -rf :hbase-server
Build step 'Invoke top-level Maven targets' marked build as failure
Performing Post build task...
Match found for :.* : True
Logical operation result is TRUE
Running script  :   ZOMBIE_TESTS_COUNT=`jps | grep surefirebooter | wc -l`
  if [[ $ZOMBIE_TESTS_COUNT != 0 ]] ; then
    #It seems sometimes the tests are not dying immediately. Let's give them 10s
    echo "Suspicious java process found - waiting 10s to see if there are just slow to stop"
    sleep 10   
    ZOMBIE_TESTS_COUNT=`jps | grep surefirebooter | wc -l`
    if [[ $ZOMBIE_TESTS_COUNT != 0 ]] ; then
      echo "There are $ZOMBIE_TESTS_COUNT zombie tests, they should have been killed by surefire
but survived"
      echo "************ BEGIN zombies jstack extract"
      ZB_STACK=`jps | grep surefirebooter | cut -d ' ' -f 1 | xargs -n 1 jstack | grep ".test"
| grep "\.java"`
      jps | grep surefirebooter | cut -d ' ' -f 1 | xargs -n 1 jstack
      echo "************ END  zombies jstack extract"
      JIRA_COMMENT="$JIRA_COMMENT

     {color:red}-1 core zombie tests{color}.  There are ${ZOMBIE_TESTS_COUNT} zombie test(s):
${ZB_STACK}"
      BAD=1
      jps | grep surefirebooter | cut -d ' ' -f 1 | xargs kill -9
    else
      echo "We're ok: there is no zombie test, but some tests took some time to stop"
    fi
  else
    echo "We're ok: there is no zombie test"
  fi
[Hadoop] $ /bin/bash -xe /tmp/hudson996178797014214154.sh
++ jps
++ grep surefirebooter
++ wc -l
+ ZOMBIE_TESTS_COUNT=0
+ [[ 0 != 0 ]]
+ echo 'We'\''re ok: there is no zombie test'
We're ok: there is no zombie test
POST BUILD TASK : SUCCESS
END OF POST BUILD TASK : 0
Archiving artifacts
Sending artifact delta relative to HBase-1.3 » latest1.7,Hadoop #89
Archived 983 artifacts
Archive block size is 32768
Received 3 blocks and 37021217 bytes
Compression is 0.3%
Took 34 sec

Mime
View raw message