hbase-builds mailing list archives

Site index · List index
Message view « Date » · « Thread »
Top « Date » · « Thread »
From Apache Jenkins Server <jenk...@builds.apache.org>
Subject Build failed in Jenkins: HBase-1.3 » latest1.7,Hadoop #110
Date Fri, 14 Aug 2015 18:04:53 GMT
See <https://builds.apache.org/job/HBase-1.3/jdk=latest1.7,label=Hadoop/110/changes>

Changes:

[stack] HBASE-13966 Limit column width in table.jsp (Matt Warhaftig)

------------------------------------------
[...truncated 45416 lines...]
Running org.apache.hadoop.hbase.regionserver.TestReversibleScanners
Tests run: 5, Failures: 0, Errors: 0, Skipped: 0, Time elapsed: 4.553 sec - in org.apache.hadoop.hbase.regionserver.TestReversibleScanners
Tests run: 6, Failures: 0, Errors: 0, Skipped: 0, Time elapsed: 40.586 sec - in org.apache.hadoop.hbase.regionserver.TestAtomicOperation
Running org.apache.hadoop.hbase.procedure.TestZKProcedure
Running org.apache.hadoop.hbase.TestZooKeeper
Tests run: 4, Failures: 0, Errors: 0, Skipped: 0, Time elapsed: 2.199 sec - in org.apache.hadoop.hbase.procedure.TestZKProcedure
Running org.apache.hadoop.hbase.procedure.TestZKProcedureControllers
Tests run: 4, Failures: 0, Errors: 0, Skipped: 0, Time elapsed: 1.82 sec - in org.apache.hadoop.hbase.procedure.TestZKProcedureControllers
Running org.apache.hadoop.hbase.TestIOFencing
Tests run: 7, Failures: 0, Errors: 0, Skipped: 0, Time elapsed: 176.306 sec - in org.apache.hadoop.hbase.regionserver.TestRegionReplicas
Running org.apache.hadoop.hbase.master.TestDistributedLogSplitting
Tests run: 7, Failures: 0, Errors: 0, Skipped: 0, Time elapsed: 50.815 sec - in org.apache.hadoop.hbase.regionserver.TestMajorCompaction
Running org.apache.hadoop.hbase.master.TestMasterShutdown
Tests run: 2, Failures: 0, Errors: 0, Skipped: 0, Time elapsed: 16.681 sec - in org.apache.hadoop.hbase.master.TestMasterShutdown
Running org.apache.hadoop.hbase.master.normalizer.TestSimpleRegionNormalizerOnCluster
Tests run: 2, Failures: 0, Errors: 0, Skipped: 0, Time elapsed: 28.862 sec - in org.apache.hadoop.hbase.master.normalizer.TestSimpleRegionNormalizerOnCluster
Running org.apache.hadoop.hbase.master.TestOpenedRegionHandler
Tests run: 2, Failures: 0, Errors: 0, Skipped: 0, Time elapsed: 13.216 sec - in org.apache.hadoop.hbase.master.TestOpenedRegionHandler
Running org.apache.hadoop.hbase.master.TestRollingRestart
Tests run: 2, Failures: 0, Errors: 0, Skipped: 0, Time elapsed: 190.005 sec - in org.apache.hadoop.hbase.regionserver.TestCorruptedRegionStoreFile
Running org.apache.hadoop.hbase.master.TestMasterStatusServlet
Tests run: 4, Failures: 0, Errors: 0, Skipped: 0, Time elapsed: 1.604 sec - in org.apache.hadoop.hbase.master.TestMasterStatusServlet
Tests run: 1, Failures: 0, Errors: 0, Skipped: 0, Time elapsed: 26.123 sec - in org.apache.hadoop.hbase.master.TestRollingRestart
Running org.apache.hadoop.hbase.master.TestMasterMetricsWrapper
Tests run: 1, Failures: 0, Errors: 0, Skipped: 0, Time elapsed: 2.404 sec - in org.apache.hadoop.hbase.master.TestMasterMetricsWrapper
Running org.apache.hadoop.hbase.master.TestWarmupRegion
Running org.apache.hadoop.hbase.master.TestMaster
Tests run: 4, Failures: 0, Errors: 0, Skipped: 0, Time elapsed: 14.153 sec - in org.apache.hadoop.hbase.master.TestMaster
Tests run: 1, Failures: 0, Errors: 0, Skipped: 0, Time elapsed: 25.434 sec - in org.apache.hadoop.hbase.master.TestWarmupRegion
Running org.apache.hadoop.hbase.master.TestMasterFileSystem
Tests run: 2, Failures: 0, Errors: 0, Skipped: 0, Time elapsed: 1.164 sec - in org.apache.hadoop.hbase.master.TestMasterFileSystem
Running org.apache.hadoop.hbase.master.handler.TestTableDeleteFamilyHandler
Running org.apache.hadoop.hbase.master.handler.TestTableDescriptorModification
Tests run: 12, Failures: 0, Errors: 0, Skipped: 0, Time elapsed: 170.499 sec - in org.apache.hadoop.hbase.TestZooKeeper
Running org.apache.hadoop.hbase.master.handler.TestCreateTableHandler
Tests run: 2, Failures: 0, Errors: 0, Skipped: 0, Time elapsed: 18.226 sec - in org.apache.hadoop.hbase.master.handler.TestTableDeleteFamilyHandler
Running org.apache.hadoop.hbase.master.handler.TestEnableTableHandler
Tests run: 3, Failures: 0, Errors: 0, Skipped: 0, Time elapsed: 25.706 sec - in org.apache.hadoop.hbase.master.handler.TestCreateTableHandler
Running org.apache.hadoop.hbase.master.TestTableLockManager
Tests run: 7, Failures: 0, Errors: 0, Skipped: 0, Time elapsed: 36.3 sec - in org.apache.hadoop.hbase.master.handler.TestTableDescriptorModification
Running org.apache.hadoop.hbase.master.TestGetInfoPort
Tests run: 1, Failures: 0, Errors: 0, Skipped: 0, Time elapsed: 9.038 sec - in org.apache.hadoop.hbase.master.TestGetInfoPort
Tests run: 3, Failures: 0, Errors: 0, Skipped: 0, Time elapsed: 39.19 sec - in org.apache.hadoop.hbase.master.handler.TestEnableTableHandler
Running org.apache.hadoop.hbase.master.TestAssignmentManager
Tests run: 2, Failures: 0, Errors: 0, Skipped: 0, Time elapsed: 216.443 sec - in org.apache.hadoop.hbase.TestIOFencing
Running org.apache.hadoop.hbase.master.TestRegionPlacement
Tests run: 24, Failures: 0, Errors: 0, Skipped: 0, Time elapsed: 11.033 sec - in org.apache.hadoop.hbase.master.TestAssignmentManager
Running org.apache.hadoop.hbase.master.snapshot.TestSnapshotFileCache
Running org.apache.hadoop.hbase.master.TestHMasterRPCException
Tests run: 1, Failures: 0, Errors: 0, Skipped: 0, Time elapsed: 3.226 sec - in org.apache.hadoop.hbase.master.TestHMasterRPCException
Running org.apache.hadoop.hbase.master.TestMasterFailover
Tests run: 2, Failures: 0, Errors: 0, Skipped: 0, Time elapsed: 19.568 sec - in org.apache.hadoop.hbase.master.TestRegionPlacement
Running org.apache.hadoop.hbase.master.TestMetaShutdownHandler
Tests run: 18, Failures: 0, Errors: 0, Skipped: 0, Time elapsed: 244.983 sec - in org.apache.hadoop.hbase.master.TestDistributedLogSplitting
Running org.apache.hadoop.hbase.master.TestMasterFailoverBalancerPersistence
Tests run: 5, Failures: 0, Errors: 0, Skipped: 0, Time elapsed: 32.751 sec - in org.apache.hadoop.hbase.master.snapshot.TestSnapshotFileCache
Running org.apache.hadoop.hbase.master.TestZKLessAMOnCluster
Tests run: 1, Failures: 0, Errors: 0, Skipped: 0, Time elapsed: 13.942 sec - in org.apache.hadoop.hbase.master.TestMasterFailoverBalancerPersistence
Running org.apache.hadoop.hbase.master.procedure.TestMasterFailoverWithProcedures
Tests run: 4, Failures: 0, Errors: 0, Skipped: 0, Time elapsed: 78.841 sec - in org.apache.hadoop.hbase.master.TestTableLockManager
Running org.apache.hadoop.hbase.master.procedure.TestCreateTableProcedure
Tests run: 1, Failures: 0, Errors: 0, Skipped: 0, Time elapsed: 31.744 sec - in org.apache.hadoop.hbase.master.TestMetaShutdownHandler
Running org.apache.hadoop.hbase.master.procedure.TestCreateTableProcedure2
Tests run: 1, Failures: 0, Errors: 0, Skipped: 0, Time elapsed: 9.67 sec - in org.apache.hadoop.hbase.master.procedure.TestCreateTableProcedure2
Running org.apache.hadoop.hbase.master.procedure.TestTruncateTableProcedure
Tests run: 7, Failures: 0, Errors: 0, Skipped: 0, Time elapsed: 24.448 sec - in org.apache.hadoop.hbase.master.procedure.TestCreateTableProcedure
Tests run: 7, Failures: 0, Errors: 0, Skipped: 0, Time elapsed: 76.874 sec - in org.apache.hadoop.hbase.master.TestMasterFailover
Running org.apache.hadoop.hbase.master.procedure.TestServerCrashProcedure
Running org.apache.hadoop.hbase.master.procedure.TestModifyTableProcedure
Tests run: 6, Failures: 0, Errors: 0, Skipped: 0, Time elapsed: 28.762 sec - in org.apache.hadoop.hbase.master.procedure.TestTruncateTableProcedure
Running org.apache.hadoop.hbase.master.procedure.TestDeleteTableProcedure
Tests run: 2, Failures: 0, Errors: 0, Skipped: 0, Time elapsed: 31.658 sec - in org.apache.hadoop.hbase.master.procedure.TestServerCrashProcedure
Tests run: 8, Failures: 0, Errors: 0, Skipped: 0, Time elapsed: 33.437 sec - in org.apache.hadoop.hbase.master.procedure.TestModifyTableProcedure
Running org.apache.hadoop.hbase.master.procedure.TestDisableTableProcedure
Tests run: 7, Failures: 0, Errors: 0, Skipped: 0, Time elapsed: 12.335 sec - in org.apache.hadoop.hbase.master.procedure.TestDeleteTableProcedure
Running org.apache.hadoop.hbase.master.procedure.TestEnableTableProcedure
Running org.apache.hadoop.hbase.master.procedure.TestDeleteColumnFamilyProcedure
Tests run: 4, Failures: 0, Errors: 0, Skipped: 0, Time elapsed: 9.555 sec - in org.apache.hadoop.hbase.master.procedure.TestDisableTableProcedure
Running org.apache.hadoop.hbase.master.procedure.TestAddColumnFamilyProcedure
Tests run: 5, Failures: 0, Errors: 0, Skipped: 0, Time elapsed: 18.21 sec - in org.apache.hadoop.hbase.master.procedure.TestEnableTableProcedure
Tests run: 21, Failures: 0, Errors: 0, Skipped: 0, Time elapsed: 113.591 sec - in org.apache.hadoop.hbase.master.TestZKLessAMOnCluster
Running org.apache.hadoop.hbase.master.procedure.TestWALProcedureStoreOnHDFS
Tests run: 8, Failures: 0, Errors: 0, Skipped: 0, Time elapsed: 21.513 sec - in org.apache.hadoop.hbase.master.procedure.TestDeleteColumnFamilyProcedure
Running org.apache.hadoop.hbase.master.procedure.TestModifyColumnFamilyProcedure
Running org.apache.hadoop.hbase.master.TestActiveMasterManager
Tests run: 2, Failures: 0, Errors: 0, Skipped: 0, Time elapsed: 1.249 sec - in org.apache.hadoop.hbase.master.TestActiveMasterManager
Tests run: 6, Failures: 0, Errors: 0, Skipped: 0, Time elapsed: 18.766 sec - in org.apache.hadoop.hbase.master.procedure.TestAddColumnFamilyProcedure
Running org.apache.hadoop.hbase.master.TestGetLastFlushedSequenceId
Running org.apache.hadoop.hbase.master.TestRegionPlacement2
Tests run: 2, Failures: 0, Errors: 0, Skipped: 0, Time elapsed: 2.377 sec - in org.apache.hadoop.hbase.master.TestRegionPlacement2
Tests run: 5, Failures: 0, Errors: 0, Skipped: 0, Time elapsed: 16.79 sec - in org.apache.hadoop.hbase.master.procedure.TestModifyColumnFamilyProcedure
Running org.apache.hadoop.hbase.master.TestSplitLogManager
Running org.apache.hadoop.hbase.master.TestDeadServer
Tests run: 3, Failures: 0, Errors: 0, Skipped: 0, Time elapsed: 0.369 sec - in org.apache.hadoop.hbase.master.TestDeadServer
Running org.apache.hadoop.hbase.master.balancer.TestBaseLoadBalancer
Tests run: 7, Failures: 0, Errors: 0, Skipped: 0, Time elapsed: 0.646 sec - in org.apache.hadoop.hbase.master.balancer.TestBaseLoadBalancer
Tests run: 1, Failures: 0, Errors: 0, Skipped: 0, Time elapsed: 15.906 sec - in org.apache.hadoop.hbase.master.TestGetLastFlushedSequenceId
Running org.apache.hadoop.hbase.master.balancer.TestDefaultLoadBalancer
Tests run: 1, Failures: 0, Errors: 0, Skipped: 0, Time elapsed: 3.614 sec - in org.apache.hadoop.hbase.master.balancer.TestDefaultLoadBalancer
Running org.apache.hadoop.hbase.master.balancer.TestStochasticLoadBalancer2
Tests run: 3, Failures: 0, Errors: 0, Skipped: 0, Time elapsed: 31.371 sec - in org.apache.hadoop.hbase.master.procedure.TestWALProcedureStoreOnHDFS
Running org.apache.hadoop.hbase.master.TestMasterRestartAfterDisablingTable
Running org.apache.hadoop.hbase.master.balancer.TestStochasticLoadBalancer
Tests run: 8, Failures: 0, Errors: 0, Skipped: 0, Time elapsed: 162.818 sec - in org.apache.hadoop.hbase.master.procedure.TestMasterFailoverWithProcedures
Tests run: 1, Failures: 0, Errors: 0, Skipped: 0, Time elapsed: 18.832 sec - in org.apache.hadoop.hbase.master.TestMasterRestartAfterDisablingTable
Running org.apache.hadoop.hbase.master.TestMasterNoCluster
Running org.apache.hadoop.hbase.master.TestClusterStatusPublisher
Tests run: 3, Failures: 0, Errors: 0, Skipped: 0, Time elapsed: 0.496 sec - in org.apache.hadoop.hbase.master.TestClusterStatusPublisher
Running org.apache.hadoop.hbase.master.TestZKBasedOpenCloseRegion
Tests run: 3, Failures: 0, Errors: 0, Skipped: 0, Time elapsed: 13.449 sec - in org.apache.hadoop.hbase.master.TestMasterNoCluster
Tests run: 3, Failures: 0, Errors: 0, Skipped: 0, Time elapsed: 3.583 sec - in org.apache.hadoop.hbase.master.TestZKBasedOpenCloseRegion
Running org.apache.hadoop.hbase.master.TestMasterPriorityRpc
Tests run: 3, Failures: 0, Errors: 0, Skipped: 0, Time elapsed: 2.761 sec - in org.apache.hadoop.hbase.master.TestMasterPriorityRpc
Running org.apache.hadoop.hbase.master.TestAssignmentManagerOnCluster
Running org.apache.hadoop.hbase.master.TestMasterTransitions
Tests run: 3, Failures: 0, Errors: 0, Skipped: 3, Time elapsed: 1.963 sec - in org.apache.hadoop.hbase.master.TestMasterTransitions
Running org.apache.hadoop.hbase.master.TestMasterOperationsForRegionReplicas
Tests run: 2, Failures: 0, Errors: 0, Skipped: 0, Time elapsed: 24.355 sec - in org.apache.hadoop.hbase.master.TestMasterOperationsForRegionReplicas
Running org.apache.hadoop.hbase.master.TestRestartCluster
Tests run: 15, Failures: 0, Errors: 0, Skipped: 0, Time elapsed: 133.84 sec - in org.apache.hadoop.hbase.master.TestSplitLogManager
Running org.apache.hadoop.hbase.master.cleaner.TestSnapshotFromMaster
Tests run: 3, Failures: 0, Errors: 0, Skipped: 0, Time elapsed: 52.579 sec - in org.apache.hadoop.hbase.master.TestRestartCluster
Running org.apache.hadoop.hbase.master.cleaner.TestLogsCleaner
Tests run: 1, Failures: 0, Errors: 0, Skipped: 0, Time elapsed: 11.421 sec - in org.apache.hadoop.hbase.master.cleaner.TestLogsCleaner
Running org.apache.hadoop.hbase.master.cleaner.TestHFileCleaner
Tests run: 4, Failures: 0, Errors: 0, Skipped: 0, Time elapsed: 29.836 sec - in org.apache.hadoop.hbase.master.cleaner.TestSnapshotFromMaster
Tests run: 3, Failures: 0, Errors: 0, Skipped: 0, Time elapsed: 1.064 sec - in org.apache.hadoop.hbase.master.cleaner.TestHFileCleaner
Tests run: 21, Failures: 0, Errors: 0, Skipped: 0, Time elapsed: 120.02 sec - in org.apache.hadoop.hbase.master.TestAssignmentManagerOnCluster
Running org.apache.hadoop.hbase.TestLocalHBaseCluster
Running org.apache.hadoop.hbase.master.TestAssignmentListener
Running org.apache.hadoop.hbase.master.TestMasterMetrics
Tests run: 2, Failures: 0, Errors: 0, Skipped: 0, Time elapsed: 1.075 sec - in org.apache.hadoop.hbase.master.TestMasterMetrics
Tests run: 1, Failures: 0, Errors: 0, Skipped: 0, Time elapsed: 9.586 sec - in org.apache.hadoop.hbase.TestLocalHBaseCluster
Tests run: 2, Failures: 0, Errors: 0, Skipped: 0, Time elapsed: 9.429 sec - in org.apache.hadoop.hbase.master.TestAssignmentListener
Running org.apache.hadoop.hbase.io.encoding.TestLoadAndSwitchEncodeOnDisk
Running org.apache.hadoop.hbase.trace.TestHTraceHooks
Tests run: 1, Failures: 0, Errors: 0, Skipped: 0, Time elapsed: 3.328 sec - in org.apache.hadoop.hbase.trace.TestHTraceHooks
Running org.apache.hadoop.hbase.TestPartialResultsFromClientSide
Running org.apache.hadoop.hbase.io.encoding.TestChangingEncoding
Tests run: 1, Failures: 0, Errors: 0, Skipped: 0, Time elapsed: 30.029 sec - in org.apache.hadoop.hbase.io.encoding.TestLoadAndSwitchEncodeOnDisk
Running org.apache.hadoop.hbase.io.encoding.TestEncodedSeekers
Tests run: 13, Failures: 0, Errors: 0, Skipped: 0, Time elapsed: 47.116 sec - in org.apache.hadoop.hbase.TestPartialResultsFromClientSide
Running org.apache.hadoop.hbase.io.encoding.TestDataBlockEncoders

Results :

Failed tests: 
  TestSnapshotCloneIndependence.testOnlineSnapshotDeleteIndependent:182->runTestSnapshotDeleteIndependent:425
expected:<17576> but was:<14046>

Tests in error: 
  TestHFileOutputFormat2.testMRIncrementalLoadWithSplit:383->doIncrementalLoadTest:466
» IO


Tests run: 2240, Failures: 1, Errors: 1, Skipped: 19

[INFO] ------------------------------------------------------------------------
[INFO] Reactor Summary:
[INFO] 
[INFO] Apache HBase ...................................... SUCCESS [1:42.111s]
[INFO] Apache HBase - Checkstyle ......................... SUCCESS [10.157s]
[INFO] Apache HBase - Resource Bundle .................... SUCCESS [0.173s]
[INFO] Apache HBase - Annotations ........................ SUCCESS [0.992s]
[INFO] Apache HBase - Protocol ........................... SUCCESS [15.830s]
[INFO] Apache HBase - Common ............................. SUCCESS [2:07.977s]
[INFO] Apache HBase - Procedure .......................... SUCCESS [1:51.649s]
[INFO] Apache HBase - Client ............................. SUCCESS [1:25.306s]
[INFO] Apache HBase - Hadoop Compatibility ............... SUCCESS [8.763s]
[INFO] Apache HBase - Hadoop Two Compatibility ........... SUCCESS [9.384s]
[INFO] Apache HBase - Prefix Tree ........................ SUCCESS [8.953s]
[INFO] Apache HBase - Server ............................. FAILURE [1:25:06.456s]
[INFO] Apache HBase - Testing Util ....................... SKIPPED
[INFO] Apache HBase - Thrift ............................. SKIPPED
[INFO] Apache HBase - Rest ............................... SKIPPED
[INFO] Apache HBase - Shell .............................. SKIPPED
[INFO] Apache HBase - Integration Tests .................. SKIPPED
[INFO] Apache HBase - Examples ........................... SKIPPED
[INFO] Apache HBase - Assembly ........................... SKIPPED
[INFO] Apache HBase - Shaded ............................. SKIPPED
[INFO] Apache HBase - Shaded - Client .................... SKIPPED
[INFO] Apache HBase - Shaded - Server .................... SKIPPED
[INFO] ------------------------------------------------------------------------
[INFO] BUILD FAILURE
[INFO] ------------------------------------------------------------------------
[INFO] Total time: 1:33:36.963s
[INFO] Finished at: Fri Aug 14 18:00:56 UTC 2015
[INFO] Final Memory: 489M/632M
[INFO] ------------------------------------------------------------------------
[ERROR] Failed to execute goal org.apache.maven.plugins:maven-surefire-plugin:2.18:test (secondPartTestsExecution)
on project hbase-server: ExecutionException: java.lang.RuntimeException: java.lang.RuntimeException:
org.apache.maven.surefire.report.ReporterException: When writing xml report stdout/stderr:
/tmp/stderr89526310517017027deferred (No such file or directory) -> [Help 1]
[ERROR] 
[ERROR] To see the full stack trace of the errors, re-run Maven with the -e switch.
[ERROR] Re-run Maven using the -X switch to enable full debug logging.
[ERROR] 
[ERROR] For more information about the errors and possible solutions, please read the following
articles:
[ERROR] [Help 1] http://cwiki.apache.org/confluence/display/MAVEN/MojoFailureException
[ERROR] 
[ERROR] After correcting the problems, you can resume the build with the command
[ERROR]   mvn <goals> -rf :hbase-server
Build step 'Invoke top-level Maven targets' marked build as failure
Performing Post build task...
Match found for :.* : True
Logical operation result is TRUE
Running script  :   ZOMBIE_TESTS_COUNT=`jps | grep surefirebooter | wc -l`
  if [[ $ZOMBIE_TESTS_COUNT != 0 ]] ; then
    #It seems sometimes the tests are not dying immediately. Let's give them 10s
    echo "Suspicious java process found - waiting 10s to see if there are just slow to stop"
    sleep 10   
    ZOMBIE_TESTS_COUNT=`jps | grep surefirebooter | wc -l`
    if [[ $ZOMBIE_TESTS_COUNT != 0 ]] ; then
      echo "There are $ZOMBIE_TESTS_COUNT zombie tests, they should have been killed by surefire
but survived"
      echo "************ BEGIN zombies jstack extract"
      ZB_STACK=`jps | grep surefirebooter | cut -d ' ' -f 1 | xargs -n 1 jstack | grep ".test"
| grep "\.java"`
      jps | grep surefirebooter | cut -d ' ' -f 1 | xargs -n 1 jstack
      echo "************ END  zombies jstack extract"
      JIRA_COMMENT="$JIRA_COMMENT

     {color:red}-1 core zombie tests{color}.  There are ${ZOMBIE_TESTS_COUNT} zombie test(s):
${ZB_STACK}"
      BAD=1
      jps | grep surefirebooter | cut -d ' ' -f 1 | xargs kill -9
    else
      echo "We're ok: there is no zombie test, but some tests took some time to stop"
    fi
  else
    echo "We're ok: there is no zombie test"
  fi
[Hadoop] $ /bin/bash -xe /tmp/hudson4900891334398246880.sh
++ jps
++ grep surefirebooter
++ wc -l
+ ZOMBIE_TESTS_COUNT=1
+ [[ 1 != 0 ]]
+ echo 'Suspicious java process found - waiting 10s to see if there are just slow to stop'
Suspicious java process found - waiting 10s to see if there are just slow to stop
+ sleep 10
++ jps
++ grep surefirebooter
++ wc -l
+ ZOMBIE_TESTS_COUNT=0
+ [[ 0 != 0 ]]
+ echo 'We'\''re ok: there is no zombie test, but some tests took some time to stop'
We're ok: there is no zombie test, but some tests took some time to stop
POST BUILD TASK : SUCCESS
END OF POST BUILD TASK : 0
Archiving artifacts
Sending artifact delta relative to HBase-1.3 » latest1.7,Hadoop #108
Archived 1990 artifacts
Archive block size is 32768
Received 15 blocks and 617819898 bytes
Compression is 0.1%
Took 4 min 27 sec

Mime
View raw message