hbase-builds mailing list archives

Site index · List index
Message view « Date » · « Thread »
Top « Date » · « Thread »
From Apache Jenkins Server <jenk...@builds.apache.org>
Subject Build failed in Jenkins: HBase-1.2-IT » IntegrationTestBigLinkedList,latest1.7,Hadoop #97
Date Tue, 18 Aug 2015 21:47:12 GMT
See <https://builds.apache.org/job/HBase-1.2-IT/it.test=IntegrationTestBigLinkedList,jdk=latest1.7,label=Hadoop/97/changes>

Changes:

[jerryjch] HBASE-14228 Close BufferedMutator and connection in MultiTableOutputFormat

------------------------------------------
[...truncated 19081 lines...]
181/181 KB   211/227 KB   57/57 KB   
181/181 KB   215/227 KB   57/57 KB   
181/181 KB   219/227 KB   57/57 KB   
181/181 KB   223/227 KB   57/57 KB   
181/181 KB   227/227 KB   57/57 KB   
                                     
Downloaded: http://repo.maven.apache.org/maven2/org/codehaus/plexus/plexus-io/2.0.4/plexus-io-2.0.4.jar
(57 KB at 1034.8 KB/sec)
                                     
Downloaded: http://repo.maven.apache.org/maven2/org/codehaus/plexus/plexus-archiver/2.2/plexus-archiver-2.2.jar
(181 KB at 3225.7 KB/sec)
                                     
Downloaded: http://repo.maven.apache.org/maven2/org/codehaus/plexus/plexus-utils/3.0.8/plexus-utils-3.0.8.jar
(227 KB at 4042.7 KB/sec)
[INFO] Building jar: <https://builds.apache.org/job/HBase-1.2-IT/it.test=IntegrationTestBigLinkedList,jdk=latest1.7,label=Hadoop/ws/hbase-protocol/target/hbase-protocol-1.2.0-SNAPSHOT-sources.jar>
[INFO] 
[INFO] --- maven-jar-plugin:2.4:test-jar (default) @ hbase-protocol ---
[INFO] Building jar: <https://builds.apache.org/job/HBase-1.2-IT/it.test=IntegrationTestBigLinkedList,jdk=latest1.7,label=Hadoop/ws/hbase-protocol/target/hbase-protocol-1.2.0-SNAPSHOT-tests.jar>
[INFO] 
[INFO] --- maven-jar-plugin:2.4:jar (default-jar) @ hbase-protocol ---
[INFO] Building jar: <https://builds.apache.org/job/HBase-1.2-IT/it.test=IntegrationTestBigLinkedList,jdk=latest1.7,label=Hadoop/ws/hbase-protocol/target/hbase-protocol-1.2.0-SNAPSHOT.jar>
[INFO] 
[INFO] --- maven-enforcer-plugin:1.0.1:enforce (enforce) @ hbase-protocol ---
[INFO] 
[INFO] --- buildnumber-maven-plugin:1.3:create-timestamp (default) @ hbase-protocol ---
[INFO] 
[INFO] --- jacoco-maven-plugin:0.7.5.201505241946:prepare-agent (prepare-agent) @ hbase-protocol
---
[INFO] Skipping JaCoCo execution because property jacoco.skip is set.
[INFO] argLine set to empty
[INFO] 
[INFO] --- maven-remote-resources-plugin:1.5:process (default) @ hbase-protocol ---
[INFO] 
[INFO] --- maven-resources-plugin:2.6:resources (default-resources) @ hbase-protocol ---
[INFO] Using 'UTF-8' encoding to copy filtered resources.
[INFO] skip non existing resourceDirectory <https://builds.apache.org/job/HBase-1.2-IT/it.test=IntegrationTestBigLinkedList,jdk=latest1.7,label=Hadoop/ws/hbase-protocol/src/main/resources>
[INFO] Copying 3 resources
[INFO] Copying 3 resources
[INFO] 
[INFO] --- maven-compiler-plugin:2.5.1:compile (default-compile) @ hbase-protocol ---
[INFO] Nothing to compile - all classes are up to date
[INFO] 
[INFO] --- maven-resources-plugin:2.6:testResources (default-testResources) @ hbase-protocol
---
[INFO] Using 'UTF-8' encoding to copy filtered resources.
[INFO] skip non existing resourceDirectory <https://builds.apache.org/job/HBase-1.2-IT/it.test=IntegrationTestBigLinkedList,jdk=latest1.7,label=Hadoop/ws/hbase-protocol/src/test/resources>
[INFO] Copying 3 resources
[INFO] Copying 3 resources
[INFO] 
[INFO] --- maven-compiler-plugin:2.5.1:testCompile (default-testCompile) @ hbase-protocol
---
[INFO] No sources to compile
[INFO] 
[INFO] --- maven-surefire-plugin:2.18:test (default-test) @ hbase-protocol ---
[INFO] Skipping execution of surefire because it has already been run for this configuration
[INFO] 
[INFO] --- maven-surefire-plugin:2.18:test (secondPartTestsExecution) @ hbase-protocol ---
[INFO] Tests are skipped.
[INFO] 
[INFO] --- jacoco-maven-plugin:0.7.5.201505241946:report (report) @ hbase-protocol ---
[INFO] Skipping JaCoCo execution because property jacoco.skip is set.
[INFO] 
[INFO] --- maven-source-plugin:2.2.1:jar-no-fork (attach-sources) @ hbase-protocol ---
[INFO] Building jar: <https://builds.apache.org/job/HBase-1.2-IT/it.test=IntegrationTestBigLinkedList,jdk=latest1.7,label=Hadoop/ws/hbase-protocol/target/hbase-protocol-1.2.0-SNAPSHOT-sources.jar>
[WARNING] Artifact org.apache.hbase:hbase-protocol:java-source:sources:1.2.0-SNAPSHOT already
attached to project, ignoring duplicate
[INFO] 
[INFO] --- maven-jar-plugin:2.4:test-jar (default) @ hbase-protocol ---
[INFO] Building jar: <https://builds.apache.org/job/HBase-1.2-IT/it.test=IntegrationTestBigLinkedList,jdk=latest1.7,label=Hadoop/ws/hbase-protocol/target/hbase-protocol-1.2.0-SNAPSHOT-tests.jar>
[WARNING] Artifact org.apache.hbase:hbase-protocol:test-jar:tests:1.2.0-SNAPSHOT already attached
to project, ignoring duplicate
[INFO] 
[INFO] --- maven-jar-plugin:2.4:jar (default-jar) @ hbase-protocol ---
[INFO]                                                                         
[INFO] ------------------------------------------------------------------------
[INFO] Building Apache HBase - Common 1.2.0-SNAPSHOT
[INFO] ------------------------------------------------------------------------
Downloading: http://repository.apache.org/snapshots/org/apache/maven/plugins/maven-antrun-plugin/1.6/maven-antrun-plugin-1.6.pom
                                     
Downloading: http://repo.maven.apache.org/maven2/org/apache/maven/plugins/maven-antrun-plugin/1.6/maven-antrun-plugin-1.6.pom
2/5 KB                               
5/5 KB   
         
Downloaded: http://repo.maven.apache.org/maven2/org/apache/maven/plugins/maven-antrun-plugin/1.6/maven-antrun-plugin-1.6.pom
(5 KB at 77.3 KB/sec)
Downloading: http://repository.apache.org/snapshots/org/apache/maven/plugins/maven-plugins/18/maven-plugins-18.pom
         
Downloading: http://repo.maven.apache.org/maven2/org/apache/maven/plugins/maven-plugins/18/maven-plugins-18.pom
4/13 KB   
8/13 KB   
12/13 KB   
13/13 KB   
           
Downloaded: http://repo.maven.apache.org/maven2/org/apache/maven/plugins/maven-plugins/18/maven-plugins-18.pom
(13 KB at 244.2 KB/sec)
Downloading: http://repository.apache.org/snapshots/org/apache/maven/plugins/maven-antrun-plugin/1.6/maven-antrun-plugin-1.6.jar
           
Downloading: http://repo.maven.apache.org/maven2/org/apache/maven/plugins/maven-antrun-plugin/1.6/maven-antrun-plugin-1.6.jar
4/29 KB    
8/29 KB   
12/29 KB   
16/29 KB   
20/29 KB   
24/29 KB   
28/29 KB   
29/29 KB   
           
Downloaded: http://repo.maven.apache.org/maven2/org/apache/maven/plugins/maven-antrun-plugin/1.6/maven-antrun-plugin-1.6.jar
(29 KB at 557.0 KB/sec)
Downloading: http://repository.apache.org/snapshots/org/codehaus/mojo/build-helper-maven-plugin/1.9.1/build-helper-maven-plugin-1.9.1.pom
           
Downloading: http://repo.maven.apache.org/maven2/org/codehaus/mojo/build-helper-maven-plugin/1.9.1/build-helper-maven-plugin-1.9.1.pom
2/7 KB     
6/7 KB   
7/7 KB   
         
Downloaded: http://repo.maven.apache.org/maven2/org/codehaus/mojo/build-helper-maven-plugin/1.9.1/build-helper-maven-plugin-1.9.1.pom
(7 KB at 130.6 KB/sec)
Downloading: http://repository.apache.org/snapshots/org/codehaus/mojo/build-helper-maven-plugin/1.9.1/build-helper-maven-plugin-1.9.1.jar
         
Downloading: http://repo.maven.apache.org/maven2/org/codehaus/mojo/build-helper-maven-plugin/1.9.1/build-helper-maven-plugin-1.9.1.jar
4/47 KB   
8/47 KB   
12/47 KB   
16/47 KB   
20/47 KB   
24/47 KB   
28/47 KB   
32/47 KB   
36/47 KB   
40/47 KB   
44/47 KB   
47/47 KB   
           
Downloaded: http://repo.maven.apache.org/maven2/org/codehaus/mojo/build-helper-maven-plugin/1.9.1/build-helper-maven-plugin-1.9.1.jar
(47 KB at 902.5 KB/sec)
Downloading: http://repository.apache.org/snapshots/org/apache/maven/plugins/maven-dependency-plugin/2.1/maven-dependency-plugin-2.1.pom
           
Downloading: http://repo.maven.apache.org/maven2/org/apache/maven/plugins/maven-dependency-plugin/2.1/maven-dependency-plugin-2.1.pom
4/8 KB     
8/8 KB   
8/8 KB   
         
Downloaded: http://repo.maven.apache.org/maven2/org/apache/maven/plugins/maven-dependency-plugin/2.1/maven-dependency-plugin-2.1.pom
(8 KB at 155.9 KB/sec)
Downloading: http://repository.apache.org/snapshots/org/apache/maven/plugins/maven-plugins/12/maven-plugins-12.pom
         
Downloading: http://repo.maven.apache.org/maven2/org/apache/maven/plugins/maven-plugins/12/maven-plugins-12.pom
4/12 KB   
8/12 KB   
12/12 KB   
           
Downloaded: http://repo.maven.apache.org/maven2/org/apache/maven/plugins/maven-plugins/12/maven-plugins-12.pom
(12 KB at 225.0 KB/sec)
Downloading: http://repository.apache.org/snapshots/org/apache/maven/plugins/maven-dependency-plugin/2.1/maven-dependency-plugin-2.1.jar
           
Downloading: http://repo.maven.apache.org/maven2/org/apache/maven/plugins/maven-dependency-plugin/2.1/maven-dependency-plugin-2.1.jar
4/104 KB   
8/104 KB   
12/104 KB   
16/104 KB   
20/104 KB   
24/104 KB   
28/104 KB   
32/104 KB   
36/104 KB   
40/104 KB   
44/104 KB   
48/104 KB   
52/104 KB   
56/104 KB   
60/104 KB   
64/104 KB   
68/104 KB   
72/104 KB   
76/104 KB   
80/104 KB   
84/104 KB   
88/104 KB   
92/104 KB   
96/104 KB   
100/104 KB   
104/104 KB   
104/104 KB   
             
Downloaded: http://repo.maven.apache.org/maven2/org/apache/maven/plugins/maven-dependency-plugin/2.1/maven-dependency-plugin-2.1.jar
(104 KB at 1883.6 KB/sec)
Downloading: https://repository.apache.org/content/repositories/releases/com/google/guava/guava/12.0.1/guava-12.0.1.pom
             
Downloading: http://download.java.net/maven/2/com/google/guava/guava/12.0.1/guava-12.0.1.pom
             
Downloading: http://repository.jboss.org/nexus/content/groups/public-jboss/com/google/guava/guava/12.0.1/guava-12.0.1.pom
1/6 KB       
5/6 KB   
6/6 KB   
         
Downloaded: http://repository.jboss.org/nexus/content/groups/public-jboss/com/google/guava/guava/12.0.1/guava-12.0.1.pom
(6 KB at 35.6 KB/sec)
Downloading: https://repository.apache.org/content/repositories/releases/com/google/guava/guava-parent/12.0.1/guava-parent-12.0.1.pom
         
Downloading: http://download.java.net/maven/2/com/google/guava/guava-parent/12.0.1/guava-parent-12.0.1.pom
         
Downloading: http://repository.jboss.org/nexus/content/groups/public-jboss/com/google/guava/guava-parent/12.0.1/guava-parent-12.0.1.pom
3/3 KB   
         
Downloaded: http://repository.jboss.org/nexus/content/groups/public-jboss/com/google/guava/guava-parent/12.0.1/guava-parent-12.0.1.pom
(3 KB at 24.1 KB/sec)
Downloading: https://repository.apache.org/content/repositories/releases/com/google/code/findbugs/jsr305/1.3.9/jsr305-1.3.9.pom
         
Downloading: http://download.java.net/maven/2/com/google/code/findbugs/jsr305/1.3.9/jsr305-1.3.9.pom
         
Downloading: http://repository.jboss.org/nexus/content/groups/public-jboss/com/google/code/findbugs/jsr305/1.3.9/jsr305-1.3.9.pom
965/965 B   
            
Downloaded: http://repository.jboss.org/nexus/content/groups/public-jboss/com/google/code/findbugs/jsr305/1.3.9/jsr305-1.3.9.pom
(965 B at 9.3 KB/sec)
Downloading: https://repository.apache.org/content/repositories/releases/commons-codec/commons-codec/1.9/commons-codec-1.9.pom
4/12 KB     
8/12 KB   
8/12 KB   
12/12 KB   
           
Downloaded: https://repository.apache.org/content/repositories/releases/commons-codec/commons-codec/1.9/commons-codec-1.9.pom
(12 KB at 49.2 KB/sec)
[ERROR] unable to create new native thread -> [Help 1]
[ERROR] 
[ERROR] To see the full stack trace of the errors, re-run Maven with the -e switch.
[ERROR] Re-run Maven using the -X switch to enable full debug logging.
[ERROR] 
[ERROR] For more information about the errors and possible solutions, please read the following
articles:
[ERROR] [Help 1] http://cwiki.apache.org/confluence/display/MAVEN/OutOfMemoryError
Build step 'Invoke top-level Maven targets' marked build as failure
Performing Post build task...
Match found for :.* : True
Logical operation result is TRUE
Running script  :   ZOMBIE_TESTS_COUNT=`jps | grep surefirebooter | wc -l`
  if [[ $ZOMBIE_TESTS_COUNT != 0 ]] ; then
    #It seems sometimes the tests are not dying immediately. Let's give them 10s
    echo "Suspicious java process found - waiting 10s to see if there are just slow to stop"
    sleep 10   
    ZOMBIE_TESTS_COUNT=`jps | grep surefirebooter | wc -l`
    if [[ $ZOMBIE_TESTS_COUNT != 0 ]] ; then
      echo "There are $ZOMBIE_TESTS_COUNT zombie tests, they should have been killed by surefire
but survived"
      echo "************ BEGIN zombies jstack extract"
      ZB_STACK=`jps | grep surefirebooter | cut -d ' ' -f 1 | xargs -n 1 jstack | grep ".test"
| grep "\.java"`
      jps | grep surefirebooter | cut -d ' ' -f 1 | xargs -n 1 jstack
      echo "************ END  zombies jstack extract"
      JIRA_COMMENT="$JIRA_COMMENT

     {color:red}-1 core zombie tests{color}.  There are ${ZOMBIE_TESTS_COUNT} zombie test(s):
${ZB_STACK}"
      BAD=1
      jps | grep surefirebooter | cut -d ' ' -f 1 | xargs kill -9
    else
      echo "We're ok: there is no zombie test, but some tests took some time to stop"
    fi
  else
    echo "We're ok: there is no zombie test"
  fi
[Hadoop] $ /bin/bash -xe /tmp/hudson1217058015866067577.sh
++ jps
++ wc -l
++ grep surefirebooter
+ ZOMBIE_TESTS_COUNT=0
+ [[ 0 != 0 ]]
+ echo 'We'\''re ok: there is no zombie test'
We're ok: there is no zombie test
POST BUILD TASK : SUCCESS
END OF POST BUILD TASK : 0
Archiving artifacts

Mime
View raw message