hbase-builds mailing list archives

Site index · List index
Message view « Date » · « Thread »
Top « Date » · « Thread »
From Apache Jenkins Server <jenk...@builds.apache.org>
Subject Build failed in Jenkins: HBase-1.0 #1019
Date Wed, 19 Aug 2015 02:42:12 GMT
See <https://builds.apache.org/job/HBase-1.0/1019/changes>

Changes:

[apurtell] HBASE-14210 Create test for cell level ACLs involving user group

------------------------------------------
Started by an SCM change
Started by an SCM change
Building remotely on H4 (Mapreduce zookeeper Hadoop Pig falcon Hdfs) in workspace <https://builds.apache.org/job/HBase-1.0/ws/>
Cloning the remote Git repository
Cloning repository https://git-wip-us.apache.org/repos/asf/hbase.git
 > git init <https://builds.apache.org/job/HBase-1.0/ws/> # timeout=10
Fetching upstream changes from https://git-wip-us.apache.org/repos/asf/hbase.git
 > git --version # timeout=10
 > git fetch --tags --progress https://git-wip-us.apache.org/repos/asf/hbase.git +refs/heads/*:refs/remotes/origin/*
 > git config remote.origin.url https://git-wip-us.apache.org/repos/asf/hbase.git # timeout=10
 > git config remote.origin.fetch +refs/heads/*:refs/remotes/origin/* # timeout=10
 > git config remote.origin.url https://git-wip-us.apache.org/repos/asf/hbase.git # timeout=10
Cleaning workspace
 > git rev-parse --verify HEAD # timeout=10
No valid HEAD. Skipping the resetting
 > git clean -fdx # timeout=10
Fetching upstream changes from https://git-wip-us.apache.org/repos/asf/hbase.git
 > git fetch --tags --progress https://git-wip-us.apache.org/repos/asf/hbase.git +refs/heads/*:refs/remotes/origin/*
 > git rev-parse refs/remotes/origin/branch-1.0^{commit} # timeout=10
 > git rev-parse refs/remotes/origin/origin/branch-1.0^{commit} # timeout=10
Checking out Revision 7cde21a0a8b058c329b700b828504326dde6ff3b (refs/remotes/origin/branch-1.0)
 > git config core.sparsecheckout # timeout=10
 > git checkout -f 7cde21a0a8b058c329b700b828504326dde6ff3b
 > git rev-list 1f7bd03716b292b7bc662b1602d984c820572f30 # timeout=10
[HBase-1.0] $ /bin/bash -xe /tmp/hudson1051900818194782439.sh
+ ulimit -a
core file size          (blocks, -c) 0
data seg size           (kbytes, -d) unlimited
scheduling priority             (-e) 0
file size               (blocks, -f) unlimited
pending signals                 (-i) 386178
max locked memory       (kbytes, -l) 64
max memory size         (kbytes, -m) unlimited
open files                      (-n) 60000
pipe size            (512 bytes, -p) 8
POSIX message queues     (bytes, -q) 819200
real-time priority              (-r) 0
stack size              (kbytes, -s) 8192
cpu time               (seconds, -t) unlimited
max user processes              (-u) 10240
virtual memory          (kbytes, -v) unlimited
file locks                      (-x) unlimited
+ rm -rf /tmp/hbase-jenkins/hbase
[HBase-1.0] $ /home/jenkins/jenkins-slave/tools/hudson.tasks.Maven_MavenInstallation/Maven_3.0.3/bin/mvn
-PrunAllTests -DreuseForks=false install -Dmaven.test.redirectTestOutputToFile=true -Dit.test=noItTest
[INFO] Scanning for projects...
[INFO] ------------------------------------------------------------------------
[INFO] Reactor Build Order:
[INFO] 
[INFO] Apache HBase
[INFO] Apache HBase - Checkstyle
[INFO] Apache HBase - Resource Bundle
[INFO] Apache HBase - Annotations
[INFO] Apache HBase - Common
[INFO] Apache HBase - Protocol
[INFO] Apache HBase - Client
[INFO] Apache HBase - Hadoop Compatibility
[INFO] Apache HBase - Hadoop Two Compatibility
[INFO] Apache HBase - Prefix Tree
[INFO] Apache HBase - Server
[INFO] Apache HBase - Testing Util
[INFO] Apache HBase - Thrift
[INFO] Apache HBase - Rest
[INFO] Apache HBase - Shell
[INFO] Apache HBase - Integration Tests
[INFO] Apache HBase - Examples
[INFO] Apache HBase - Assembly
[INFO]                                                                         
[INFO] ------------------------------------------------------------------------
[INFO] Building Apache HBase 1.0.2
[INFO] ------------------------------------------------------------------------
[INFO] 
[INFO] --- maven-enforcer-plugin:1.0.1:enforce (enforce) @ hbase ---
[INFO] 
[INFO] --- buildnumber-maven-plugin:1.3:create-timestamp (default) @ hbase ---
[INFO] 
[INFO] --- jacoco-maven-plugin:0.6.2.201302030002:prepare-agent (prepare-agent) @ hbase ---
[INFO] Skipping JaCoCo for project with packaging type 'pom'
[INFO] argLine set to 
[INFO] 
[INFO] --- maven-remote-resources-plugin:1.5:process (default) @ hbase ---
[INFO] 
[INFO] --- findbugs-maven-plugin:3.0.0:findbugs (default) @ hbase ---
[INFO] 
[INFO] --- jacoco-maven-plugin:0.6.2.201302030002:report (report) @ hbase ---
[INFO] Skipping JaCoCo for project with packaging type 'pom'
[INFO] 
[INFO] --- maven-site-plugin:3.4:attach-descriptor (attach-descriptor) @ hbase ---
[INFO] 
[INFO] --- maven-install-plugin:2.3.1:install (default-install) @ hbase ---
[INFO] Installing <https://builds.apache.org/job/HBase-1.0/ws/pom.xml> to /home/jenkins/.m2/repository/org/apache/hbase/hbase/1.0.2/hbase-1.0.2.pom
[INFO] Installing <https://builds.apache.org/job/HBase-1.0/ws/target/hbase-1.0.2-site.xml>
to /home/jenkins/.m2/repository/org/apache/hbase/hbase/1.0.2/hbase-1.0.2-site.xml
[INFO]                                                                         
[INFO] ------------------------------------------------------------------------
[INFO] Building Apache HBase - Checkstyle 1.0.2
[INFO] ------------------------------------------------------------------------
[INFO] 
[INFO] --- maven-enforcer-plugin:1.0.1:enforce (enforce) @ hbase-checkstyle ---
[INFO] 
[INFO] --- buildnumber-maven-plugin:1.3:create-timestamp (default) @ hbase-checkstyle ---
[INFO] 
[INFO] --- jacoco-maven-plugin:0.6.2.201302030002:prepare-agent (prepare-agent) @ hbase-checkstyle
---
[INFO] Skipping JaCoCo execution
[INFO] argLine set to 
[INFO] 
[INFO] --- maven-remote-resources-plugin:1.5:process (default) @ hbase-checkstyle ---
[ERROR] unable to create new native thread -> [Help 1]
[ERROR] 
[ERROR] To see the full stack trace of the errors, re-run Maven with the -e switch.
[ERROR] Re-run Maven using the -X switch to enable full debug logging.
[ERROR] 
[ERROR] For more information about the errors and possible solutions, please read the following
articles:
[ERROR] [Help 1] http://cwiki.apache.org/confluence/display/MAVEN/OutOfMemoryError
Build step 'Invoke top-level Maven targets' marked build as failure
Performing Post build task...
Match found for :.* : True
Logical operation result is TRUE
Running script  :   ZOMBIE_TESTS_COUNT=`jps | grep surefirebooter | wc -l`
  if [[ $ZOMBIE_TESTS_COUNT != 0 ]] ; then
    #It seems sometimes the tests are not dying immediately. Let's give them 10s
    echo "Suspicious java process found - waiting 10s to see if there are just slow to stop"
    sleep 10   
    ZOMBIE_TESTS_COUNT=`jps | grep surefirebooter | wc -l`
    if [[ $ZOMBIE_TESTS_COUNT != 0 ]] ; then
      echo "There are $ZOMBIE_TESTS_COUNT zombie tests, they should have been killed by surefire
but survived"
      echo "************ BEGIN zombies jstack extract"
      ZB_STACK=`jps | grep surefirebooter | cut -d ' ' -f 1 | xargs -n 1 jstack | grep ".test"
| grep "\.java"`
      jps | grep surefirebooter | cut -d ' ' -f 1 | xargs -n 1 jstack
      echo "************ END  zombies jstack extract"
      JIRA_COMMENT="$JIRA_COMMENT

     {color:red}-1 core zombie tests{color}.  There are ${ZOMBIE_TESTS_COUNT} zombie test(s):
${ZB_STACK}"
      BAD=1
      jps | grep surefirebooter | cut -d ' ' -f 1 | xargs kill -9
    else
      echo "We're ok: there is no zombie test, but some tests took some time to stop"
    fi
  else
    echo "We're ok: there is no zombie test"
  fi
[HBase-1.0] $ /bin/bash -xe /tmp/hudson953367857514689871.sh
++ jps
++ grep surefirebooter
++ wc -l
+ ZOMBIE_TESTS_COUNT=18
+ [[ 18 != 0 ]]
+ echo 'Suspicious java process found - waiting 10s to see if there are just slow to stop'
Suspicious java process found - waiting 10s to see if there are just slow to stop
+ sleep 10
++ jps
++ grep surefirebooter
++ wc -l
+ ZOMBIE_TESTS_COUNT=18
+ [[ 18 != 0 ]]
+ echo 'There are 18 zombie tests, they should have been killed by surefire but survived'
There are 18 zombie tests, they should have been killed by surefire but survived
+ echo '************ BEGIN zombies jstack extract'
************ BEGIN zombies jstack extract
++ jps
++ cut -d ' ' -f 1
++ grep .test
++ grep surefirebooter
++ grep '\.java'
++ xargs -n 1 jstack
+ ZB_STACK=
POST BUILD TASK : FAILURE
END OF POST BUILD TASK : 0
Archiving artifacts
Sending artifact delta relative to HBase-1.0 #1014
Archived 13 artifacts
Archive block size is 32768
Received 4 blocks and 81540 bytes
Compression is 61.6%
Took 22 sec
Recording test results
Updating HBASE-14210

Mime
View raw message