hbase-builds mailing list archives

Site index · List index
Message view « Date » · « Thread »
Top « Date » · « Thread »
From Apache Jenkins Server <jenk...@builds.apache.org>
Subject Build failed in Jenkins: HBase-1.2 » latest1.7,Hadoop #113
Date Mon, 17 Aug 2015 19:41:11 GMT
See <https://builds.apache.org/job/HBase-1.2/jdk=latest1.7,label=Hadoop/113/changes>

Changes:

[eclark] HBASE-14166 Per-Region metrics can be stale

------------------------------------------
[...truncated 44234 lines...]
20/20 KB   27/264 KB   82/246 KB   5/5 KB   
20/20 KB   31/264 KB   82/246 KB   5/5 KB   
20/20 KB   35/264 KB   82/246 KB   5/5 KB   
20/20 KB   39/264 KB   82/246 KB   5/5 KB   
20/20 KB   43/264 KB   82/246 KB   5/5 KB   
20/20 KB   43/264 KB   86/246 KB   5/5 KB   
20/20 KB   47/264 KB   86/246 KB   5/5 KB   
20/20 KB   47/264 KB   90/246 KB   5/5 KB   
20/20 KB   51/264 KB   90/246 KB   5/5 KB   
20/20 KB   51/264 KB   91/246 KB   5/5 KB   
20/20 KB   55/264 KB   91/246 KB   5/5 KB   
20/20 KB   59/264 KB   91/246 KB   5/5 KB   
20/20 KB   59/264 KB   95/246 KB   5/5 KB   
20/20 KB   63/264 KB   95/246 KB   5/5 KB   
20/20 KB   63/264 KB   99/246 KB   5/5 KB   
20/20 KB   67/264 KB   99/246 KB   5/5 KB   
20/20 KB   67/264 KB   99/246 KB   5/5 KB   
20/20 KB   67/264 KB   102/246 KB   5/5 KB   
20/20 KB   71/264 KB   102/246 KB   5/5 KB   
20/20 KB   75/264 KB   102/246 KB   5/5 KB   
20/20 KB   79/264 KB   102/246 KB   5/5 KB   
20/20 KB   79/264 KB   106/246 KB   5/5 KB   
20/20 KB   83/264 KB   106/246 KB   5/5 KB   
20/20 KB   83/264 KB   110/246 KB   5/5 KB   
20/20 KB   87/264 KB   110/246 KB   5/5 KB   
20/20 KB   87/264 KB   110/246 KB   5/5 KB   
20/20 KB   91/264 KB   110/246 KB   5/5 KB   
20/20 KB   91/264 KB   114/246 KB   5/5 KB   
20/20 KB   95/264 KB   114/246 KB   5/5 KB   
20/20 KB   95/264 KB   118/246 KB   5/5 KB   
20/20 KB   99/264 KB   118/246 KB   5/5 KB   
20/20 KB   99/264 KB   122/246 KB   5/5 KB   
20/20 KB   103/264 KB   122/246 KB   5/5 KB   
20/20 KB   103/264 KB   126/246 KB   5/5 KB   
20/20 KB   107/264 KB   130/246 KB   5/5 KB   
20/20 KB   107/264 KB   130/246 KB   5/5 KB   
20/20 KB   111/264 KB   130/246 KB   5/5 KB   
20/20 KB   111/264 KB   134/246 KB   5/5 KB   
20/20 KB   111/264 KB   138/246 KB   5/5 KB   
20/20 KB   115/264 KB   138/246 KB   5/5 KB   
20/20 KB   115/264 KB   142/246 KB   5/5 KB   
20/20 KB   115/264 KB   146/246 KB   5/5 KB   
20/20 KB   119/264 KB   146/246 KB   5/5 KB   
20/20 KB   119/264 KB   150/246 KB   5/5 KB   
20/20 KB   123/264 KB   150/246 KB   5/5 KB   
20/20 KB   123/264 KB   154/246 KB   5/5 KB   
20/20 KB   127/264 KB   158/246 KB   5/5 KB   
20/20 KB   127/264 KB   158/246 KB   5/5 KB   
20/20 KB   131/264 KB   158/246 KB   5/5 KB   
20/20 KB   131/264 KB   162/246 KB   5/5 KB   
20/20 KB   135/264 KB   162/246 KB   5/5 KB   
20/20 KB   135/264 KB   166/246 KB   5/5 KB   
20/20 KB   135/264 KB   170/246 KB   5/5 KB   
20/20 KB   139/264 KB   170/246 KB   5/5 KB   
20/20 KB   139/264 KB   174/246 KB   5/5 KB   
20/20 KB   143/264 KB   174/246 KB   5/5 KB   
20/20 KB   143/264 KB   178/246 KB   5/5 KB   
20/20 KB   147/264 KB   178/246 KB   5/5 KB   
20/20 KB   147/264 KB   182/246 KB   5/5 KB   
20/20 KB   147/264 KB   186/246 KB   5/5 KB   
20/20 KB   151/264 KB   186/246 KB   5/5 KB   
20/20 KB   151/264 KB   190/246 KB   5/5 KB   
20/20 KB   155/264 KB   190/246 KB   5/5 KB   
20/20 KB   155/264 KB   194/246 KB   5/5 KB   
20/20 KB   155/264 KB   198/246 KB   5/5 KB   
20/20 KB   159/264 KB   198/246 KB   5/5 KB   
20/20 KB   159/264 KB   202/246 KB   5/5 KB   
20/20 KB   163/264 KB   202/246 KB   5/5 KB   
20/20 KB   163/264 KB   206/246 KB   5/5 KB   
20/20 KB   163/264 KB   210/246 KB   5/5 KB   
20/20 KB   167/264 KB   210/246 KB   5/5 KB   
20/20 KB   167/264 KB   214/246 KB   5/5 KB   
20/20 KB   171/264 KB   214/246 KB   5/5 KB   
20/20 KB   171/264 KB   218/246 KB   5/5 KB   
20/20 KB   171/264 KB   222/246 KB   5/5 KB   
20/20 KB   175/264 KB   222/246 KB   5/5 KB   
20/20 KB   175/264 KB   226/246 KB   5/5 KB   
20/20 KB   179/264 KB   226/246 KB   5/5 KB   
20/20 KB   179/264 KB   230/246 KB   5/5 KB   
20/20 KB   179/264 KB   234/246 KB   5/5 KB   
20/20 KB   183/264 KB   234/246 KB   5/5 KB   
20/20 KB   183/264 KB   238/246 KB   5/5 KB   
20/20 KB   187/264 KB   238/246 KB   5/5 KB   
20/20 KB   187/264 KB   242/246 KB   5/5 KB   
20/20 KB   187/264 KB   246/246 KB   5/5 KB   
20/20 KB   191/264 KB   246/246 KB   5/5 KB   
20/20 KB   195/264 KB   246/246 KB   5/5 KB   
20/20 KB   199/264 KB   246/246 KB   5/5 KB   
20/20 KB   203/264 KB   246/246 KB   5/5 KB   
20/20 KB   207/264 KB   246/246 KB   5/5 KB   
20/20 KB   211/264 KB   246/246 KB   5/5 KB   
20/20 KB   215/264 KB   246/246 KB   5/5 KB   
20/20 KB   219/264 KB   246/246 KB   5/5 KB   
20/20 KB   223/264 KB   246/246 KB   5/5 KB   
20/20 KB   227/264 KB   246/246 KB   5/5 KB   
20/20 KB   231/264 KB   246/246 KB   5/5 KB   
20/20 KB   235/264 KB   246/246 KB   5/5 KB   
20/20 KB   239/264 KB   246/246 KB   5/5 KB   
20/20 KB   243/264 KB   246/246 KB   5/5 KB   
20/20 KB   247/264 KB   246/246 KB   5/5 KB   
20/20 KB   251/264 KB   246/246 KB   5/5 KB   
20/20 KB   255/264 KB   246/246 KB   5/5 KB   
20/20 KB   259/264 KB   246/246 KB   5/5 KB   
20/20 KB   263/264 KB   246/246 KB   5/5 KB   
20/20 KB   264/264 KB   246/246 KB   5/5 KB   
                                              
Downloaded: http://repo.maven.apache.org/maven2/org/codehaus/plexus/plexus-compiler-api/1.8.1/plexus-compiler-api-1.8.1.jar
(20 KB at 382.2 KB/sec)
                                              
Downloaded: http://repo.maven.apache.org/maven2/org/jamon/jamon-api/2.3.0/jamon-api-2.3.0.jar
(5 KB at 88.1 KB/sec)
                                              
Downloaded: http://repo.maven.apache.org/maven2/org/jamon/jamon-processor/2.3.4/jamon-processor-2.3.4.jar
(264 KB at 4118.5 KB/sec)
                                              
Downloaded: http://repo.maven.apache.org/maven2/org/codehaus/plexus/plexus-utils/1.5.5/plexus-utils-1.5.5.jar
(246 KB at 3718.0 KB/sec)
[INFO] Translating 10 templates from <https://builds.apache.org/job/HBase-1.2/jdk=latest1.7,label=Hadoop/ws/hbase-server/src/main/jamon>
to <https://builds.apache.org/job/HBase-1.2/jdk=latest1.7,label=Hadoop/ws/hbase-server/target/generated-jamon>
[INFO] 
[INFO] --- maven-antrun-plugin:1.6:run (generate) @ hbase-server ---
[INFO] Executing tasks

main:
    [mkdir] Created dir: <https://builds.apache.org/job/HBase-1.2/jdk=latest1.7,label=Hadoop/ws/hbase-server/target/hbase-webapps>
     [copy] Copying 20 files to <https://builds.apache.org/job/HBase-1.2/jdk=latest1.7,label=Hadoop/ws/hbase-server/target/hbase-webapps>
log4j:WARN No appenders could be found for logger (org.mortbay.log).
log4j:WARN Please initialize the log4j system properly.
log4j:WARN See http://logging.apache.org/log4j/1.2/faq.html#noconfig for more info.
    [mkdir] Created dir: <https://builds.apache.org/job/HBase-1.2/jdk=latest1.7,label=Hadoop/ws/hbase-server/target/hbase-webapps/master/WEB-INF>
    [mkdir] Created dir: <https://builds.apache.org/job/HBase-1.2/jdk=latest1.7,label=Hadoop/ws/hbase-server/target/hbase-webapps/regionserver/WEB-INF>
[INFO] Executed tasks
[INFO] 
[INFO] --- maven-remote-resources-plugin:1.5:process (default) @ hbase-server ---
[INFO] 
[INFO] --- maven-resources-plugin:2.6:resources (default-resources) @ hbase-server ---
[INFO] Using 'UTF-8' encoding to copy filtered resources.
[INFO] Copying 22 resources
[INFO] Copying 2 resources
[INFO] 
[INFO] --- maven-compiler-plugin:2.5.1:compile (default-compile) @ hbase-server ---
[INFO] Compiling 782 source files to <https://builds.apache.org/job/HBase-1.2/jdk=latest1.7,label=Hadoop/ws/hbase-server/target/classes>
[INFO] 
[INFO] --- maven-dependency-plugin:2.1:build-classpath (create-mrapp-generated-classpath)
@ hbase-server ---
[INFO] Wrote classpath file '<https://builds.apache.org/job/HBase-1.2/jdk=latest1.7,label=Hadoop/ws/hbase-server/target/test-classes/mrapp-generated-classpath'.>
[INFO] 
[INFO] --- maven-resources-plugin:2.6:testResources (default-testResources) @ hbase-server
---
[INFO] Using 'UTF-8' encoding to copy filtered resources.
[INFO] Copying 1 resource to META-INF/
[INFO] Copying 14 resources
[INFO] Copying 2 resources
[INFO] 
[INFO] --- maven-compiler-plugin:2.5.1:testCompile (default-testCompile) @ hbase-server ---
[INFO] Compiling 728 source files to <https://builds.apache.org/job/HBase-1.2/jdk=latest1.7,label=Hadoop/ws/hbase-server/target/test-classes>
[INFO] -------------------------------------------------------------
[ERROR] COMPILATION ERROR : 
[INFO] -------------------------------------------------------------
[ERROR] <https://builds.apache.org/job/HBase-1.2/jdk=latest1.7,label=Hadoop/ws/hbase-server/src/test/java/org/apache/hadoop/hbase/regionserver/TestRemoveRegionMetrics.java>:[35,49]
error: cannot find symbol
[ERROR]   symbol:   class RegionServerTests
  location: package org.apache.hadoop.hbase.testclassification
<https://builds.apache.org/job/HBase-1.2/jdk=latest1.7,label=Hadoop/ws/hbase-server/src/test/java/org/apache/hadoop/hbase/regionserver/TestRemoveRegionMetrics.java>:[44,11]
error: cannot find symbol
[INFO] 2 errors 
[INFO] -------------------------------------------------------------
[INFO] ------------------------------------------------------------------------
[INFO] Reactor Summary:
[INFO] 
[INFO] Apache HBase ...................................... SUCCESS [1:25.468s]
[INFO] Apache HBase - Checkstyle ......................... SUCCESS [6.742s]
[INFO] Apache HBase - Resource Bundle .................... SUCCESS [0.179s]
[INFO] Apache HBase - Annotations ........................ SUCCESS [1.257s]
[INFO] Apache HBase - Protocol ........................... SUCCESS [16.533s]
[INFO] Apache HBase - Common ............................. SUCCESS [5:17.051s]
[INFO] Apache HBase - Procedure .......................... SUCCESS [1:52.246s]
[INFO] Apache HBase - Client ............................. SUCCESS [1:37.673s]
[INFO] Apache HBase - Hadoop Compatibility ............... SUCCESS [8.187s]
[INFO] Apache HBase - Hadoop Two Compatibility ........... SUCCESS [12.196s]
[INFO] Apache HBase - Prefix Tree ........................ SUCCESS [8.950s]
[INFO] Apache HBase - Server ............................. FAILURE [1:40.230s]
[INFO] Apache HBase - Testing Util ....................... SKIPPED
[INFO] Apache HBase - Thrift ............................. SKIPPED
[INFO] Apache HBase - Rest ............................... SKIPPED
[INFO] Apache HBase - Shell .............................. SKIPPED
[INFO] Apache HBase - Integration Tests .................. SKIPPED
[INFO] Apache HBase - Examples ........................... SKIPPED
[INFO] Apache HBase - Assembly ........................... SKIPPED
[INFO] Apache HBase - Shaded ............................. SKIPPED
[INFO] Apache HBase - Shaded - Client .................... SKIPPED
[INFO] Apache HBase - Shaded - Server .................... SKIPPED
[INFO] ------------------------------------------------------------------------
[INFO] BUILD FAILURE
[INFO] ------------------------------------------------------------------------
[INFO] Total time: 13:10.675s
[INFO] Finished at: Mon Aug 17 19:41:39 UTC 2015
[INFO] Final Memory: 100M/899M
[INFO] ------------------------------------------------------------------------
[ERROR] Failed to execute goal org.apache.maven.plugins:maven-compiler-plugin:2.5.1:testCompile
(default-testCompile) on project hbase-server: Compilation failure: Compilation failure:
[ERROR] <https://builds.apache.org/job/HBase-1.2/jdk=latest1.7,label=Hadoop/ws/hbase-server/src/test/java/org/apache/hadoop/hbase/regionserver/TestRemoveRegionMetrics.java>:[35,49]
error: cannot find symbol
[ERROR] symbol:   class RegionServerTests
[ERROR] location: package org.apache.hadoop.hbase.testclassification
[ERROR] <https://builds.apache.org/job/HBase-1.2/jdk=latest1.7,label=Hadoop/ws/hbase-server/src/test/java/org/apache/hadoop/hbase/regionserver/TestRemoveRegionMetrics.java>:[44,11]
error: cannot find symbol
[ERROR] -> [Help 1]
[ERROR] 
[ERROR] To see the full stack trace of the errors, re-run Maven with the -e switch.
[ERROR] Re-run Maven using the -X switch to enable full debug logging.
[ERROR] 
[ERROR] For more information about the errors and possible solutions, please read the following
articles:
[ERROR] [Help 1] http://cwiki.apache.org/confluence/display/MAVEN/MojoFailureException
[ERROR] 
[ERROR] After correcting the problems, you can resume the build with the command
[ERROR]   mvn <goals> -rf :hbase-server
Build step 'Invoke top-level Maven targets' marked build as failure
Performing Post build task...
Match found for :.* : True
Logical operation result is TRUE
Running script  :   ZOMBIE_TESTS_COUNT=`jps | grep surefirebooter | wc -l`
  if [[ $ZOMBIE_TESTS_COUNT != 0 ]] ; then
    #It seems sometimes the tests are not dying immediately. Let's give them 10s
    echo "Suspicious java process found - waiting 10s to see if there are just slow to stop"
    sleep 10   
    ZOMBIE_TESTS_COUNT=`jps | grep surefirebooter | wc -l`
    if [[ $ZOMBIE_TESTS_COUNT != 0 ]] ; then
      echo "There are $ZOMBIE_TESTS_COUNT zombie tests, they should have been killed by surefire
but survived"
      echo "************ BEGIN zombies jstack extract"
      ZB_STACK=`jps | grep surefirebooter | cut -d ' ' -f 1 | xargs -n 1 jstack | grep ".test"
| grep "\.java"`
      jps | grep surefirebooter | cut -d ' ' -f 1 | xargs -n 1 jstack
      echo "************ END  zombies jstack extract"
      JIRA_COMMENT="$JIRA_COMMENT

     {color:red}-1 core zombie tests{color}.  There are ${ZOMBIE_TESTS_COUNT} zombie test(s):
${ZB_STACK}"
      BAD=1
      jps | grep surefirebooter | cut -d ' ' -f 1 | xargs kill -9
    else
      echo "We're ok: there is no zombie test, but some tests took some time to stop"
    fi
  else
    echo "We're ok: there is no zombie test"
  fi
[Hadoop] $ /bin/bash -xe /tmp/hudson5266639377295662104.sh
++ jps
++ grep surefirebooter
++ wc -l
+ ZOMBIE_TESTS_COUNT=0
+ [[ 0 != 0 ]]
+ echo 'We'\''re ok: there is no zombie test'
We're ok: there is no zombie test
POST BUILD TASK : SUCCESS
END OF POST BUILD TASK : 0
Archiving artifacts
Sending artifact delta relative to HBase-1.2 » latest1.7,Hadoop #112
Archived 314 artifacts
Archive block size is 32768
Received 3 blocks and 1005750 bytes
Compression is 8.9%
Took 21 sec

Mime
View raw message