hbase-builds mailing list archives

Site index · List index
Message view « Date » · « Thread »
Top « Date » · « Thread »
From Apache Jenkins Server <jenk...@builds.apache.org>
Subject Build failed in Jenkins: HBase-1.2-IT » IntegrationTestAcidGuarantees,latest1.7,Hadoop #104
Date Fri, 21 Aug 2015 06:33:01 GMT
See <https://builds.apache.org/job/HBase-1.2-IT/it.test=IntegrationTestAcidGuarantees,jdk=latest1.7,label=Hadoop/104/changes>

Changes:

[busbey] HBASE-14260 skip javadoc generation for the hbase-protocol generated classes

------------------------------------------
[...truncated 2445 lines...]
[INFO] Copying 2 resources
[INFO] 
[INFO] --- maven-compiler-plugin:2.5.1:compile (default-compile) @ hbase-shaded-client ---
[INFO] No sources to compile
[INFO] 
[INFO] --- maven-resources-plugin:2.6:testResources (default-testResources) @ hbase-shaded-client
---
[INFO] Not copying test resources
[INFO] 
[INFO] --- maven-compiler-plugin:2.5.1:testCompile (default-testCompile) @ hbase-shaded-client
---
[INFO] Not compiling test sources
[INFO] 
[INFO] --- maven-surefire-plugin:2.18:test (default-test) @ hbase-shaded-client ---
[INFO] No tests to run.
[INFO] Skipping execution of surefire because it has already been run for this configuration
[INFO] 
[INFO] --- maven-surefire-plugin:2.18:test (secondPartTestsExecution) @ hbase-shaded-client
---
[INFO] Tests are skipped.
[INFO] 
[INFO] --- jacoco-maven-plugin:0.7.5.201505241946:report (report) @ hbase-shaded-client ---
[INFO] Skipping JaCoCo execution because property jacoco.skip is set.
[INFO] 
[INFO] --- maven-jar-plugin:2.4:test-jar (default) @ hbase-shaded-client ---
[INFO] Skipping packaging of the test-jar
[INFO] 
[INFO] --- maven-jar-plugin:2.4:jar (default-jar) @ hbase-shaded-client ---
[INFO]                                                                         
[INFO] ------------------------------------------------------------------------
[INFO] Building Apache HBase - Shaded - Server 1.2.0-SNAPSHOT
[INFO] ------------------------------------------------------------------------
[INFO] 
[INFO] --- maven-clean-plugin:2.5:clean (default-clean) @ hbase-shaded-server ---
[INFO] Deleting <https://builds.apache.org/job/HBase-1.2-IT/it.test=IntegrationTestAcidGuarantees,jdk=latest1.7,label=Hadoop/ws/hbase-shaded/hbase-shaded-server/target>
[INFO] 
[INFO] --- maven-enforcer-plugin:1.0.1:enforce (enforce) @ hbase-shaded-server ---
[INFO] 
[INFO] --- buildnumber-maven-plugin:1.3:create-timestamp (default) @ hbase-shaded-server ---
[INFO] 
[INFO] --- jacoco-maven-plugin:0.7.5.201505241946:prepare-agent (prepare-agent) @ hbase-shaded-server
---
[INFO] Skipping JaCoCo execution because property jacoco.skip is set.
[INFO] argLine set to empty
[INFO] 
[INFO] --- maven-remote-resources-plugin:1.5:process (default) @ hbase-shaded-server ---
[INFO] 
[INFO] --- maven-resources-plugin:2.6:resources (default-resources) @ hbase-shaded-server
---
[INFO] Using 'UTF-8' encoding to copy filtered resources.
[INFO] skip non existing resourceDirectory <https://builds.apache.org/job/HBase-1.2-IT/it.test=IntegrationTestAcidGuarantees,jdk=latest1.7,label=Hadoop/ws/hbase-shaded/hbase-shaded-server/src/main/resources>
[INFO] Copying 2 resources
[INFO] 
[INFO] --- maven-compiler-plugin:2.5.1:compile (default-compile) @ hbase-shaded-server ---
[INFO] No sources to compile
[INFO] 
[INFO] --- maven-resources-plugin:2.6:testResources (default-testResources) @ hbase-shaded-server
---
[INFO] Not copying test resources
[INFO] 
[INFO] --- maven-compiler-plugin:2.5.1:testCompile (default-testCompile) @ hbase-shaded-server
---
[INFO] Not compiling test sources
[INFO] 
[INFO] --- maven-surefire-plugin:2.18:test (default-test) @ hbase-shaded-server ---
[INFO] No tests to run.
[INFO] 
[INFO] --- maven-surefire-plugin:2.18:test (secondPartTestsExecution) @ hbase-shaded-server
---
[INFO] Tests are skipped.
[INFO] 
[INFO] --- jacoco-maven-plugin:0.7.5.201505241946:report (report) @ hbase-shaded-server ---
[INFO] Skipping JaCoCo execution because property jacoco.skip is set.
[INFO] 
[INFO] --- maven-jar-plugin:2.4:test-jar (default) @ hbase-shaded-server ---
[INFO] Skipping packaging of the test-jar
[INFO] 
[INFO] --- maven-jar-plugin:2.4:jar (default-jar) @ hbase-shaded-server ---
[INFO] Building jar: <https://builds.apache.org/job/HBase-1.2-IT/it.test=IntegrationTestAcidGuarantees,jdk=latest1.7,label=Hadoop/ws/hbase-shaded/hbase-shaded-server/target/hbase-shaded-server-1.2.0-SNAPSHOT.jar>
[INFO] 
[INFO] --- maven-enforcer-plugin:1.0.1:enforce (enforce) @ hbase-shaded-server ---
[INFO] 
[INFO] --- buildnumber-maven-plugin:1.3:create-timestamp (default) @ hbase-shaded-server ---
[INFO] 
[INFO] --- jacoco-maven-plugin:0.7.5.201505241946:prepare-agent (prepare-agent) @ hbase-shaded-server
---
[INFO] Skipping JaCoCo execution because property jacoco.skip is set.
[INFO] argLine set to empty
[INFO] 
[INFO] --- maven-remote-resources-plugin:1.5:process (default) @ hbase-shaded-server ---
[INFO] 
[INFO] --- maven-resources-plugin:2.6:resources (default-resources) @ hbase-shaded-server
---
[INFO] Using 'UTF-8' encoding to copy filtered resources.
[INFO] skip non existing resourceDirectory <https://builds.apache.org/job/HBase-1.2-IT/it.test=IntegrationTestAcidGuarantees,jdk=latest1.7,label=Hadoop/ws/hbase-shaded/hbase-shaded-server/src/main/resources>
[INFO] Copying 2 resources
[INFO] Copying 2 resources
[INFO] 
[INFO] --- maven-compiler-plugin:2.5.1:compile (default-compile) @ hbase-shaded-server ---
[INFO] No sources to compile
[INFO] 
[INFO] --- maven-resources-plugin:2.6:testResources (default-testResources) @ hbase-shaded-server
---
[INFO] Not copying test resources
[INFO] 
[INFO] --- maven-compiler-plugin:2.5.1:testCompile (default-testCompile) @ hbase-shaded-server
---
[INFO] Not compiling test sources
[INFO] 
[INFO] --- maven-surefire-plugin:2.18:test (default-test) @ hbase-shaded-server ---
[INFO] No tests to run.
[INFO] Skipping execution of surefire because it has already been run for this configuration
[INFO] 
[INFO] --- maven-surefire-plugin:2.18:test (secondPartTestsExecution) @ hbase-shaded-server
---
[INFO] Tests are skipped.
[INFO] 
[INFO] --- jacoco-maven-plugin:0.7.5.201505241946:report (report) @ hbase-shaded-server ---
[INFO] Skipping JaCoCo execution because property jacoco.skip is set.
[INFO] 
[INFO] --- maven-jar-plugin:2.4:test-jar (default) @ hbase-shaded-server ---
[INFO] Skipping packaging of the test-jar
[INFO] 
[INFO] --- maven-jar-plugin:2.4:jar (default-jar) @ hbase-shaded-server ---
[INFO] Building jar: <https://builds.apache.org/job/HBase-1.2-IT/it.test=IntegrationTestAcidGuarantees,jdk=latest1.7,label=Hadoop/ws/hbase-shaded/hbase-shaded-server/target/hbase-shaded-server-1.2.0-SNAPSHOT.jar>
[INFO] ------------------------------------------------------------------------
[INFO] Reactor Summary:
[INFO] 
[INFO] Apache HBase ...................................... SUCCESS [3.816s]
[INFO] Apache HBase - Checkstyle ......................... SUCCESS [0.661s]
[INFO] Apache HBase - Resource Bundle .................... SUCCESS [0.343s]
[INFO] Apache HBase - Annotations ........................ SUCCESS [1.047s]
[INFO] Apache HBase - Protocol ........................... SUCCESS [14.145s]
[INFO] Apache HBase - Common ............................. SUCCESS [9.062s]
[INFO] Apache HBase - Procedure .......................... SUCCESS [1.333s]
[INFO] Apache HBase - Client ............................. SUCCESS [5.386s]
[INFO] Apache HBase - Hadoop Compatibility ............... SUCCESS [0.380s]
[INFO] Apache HBase - Hadoop Two Compatibility ........... SUCCESS [1.332s]
[INFO] Apache HBase - Prefix Tree ........................ SUCCESS [1.409s]
[INFO] Apache HBase - Server ............................. SUCCESS [23.614s]
[INFO] Apache HBase - Testing Util ....................... SUCCESS [1.517s]
[INFO] Apache HBase - Thrift ............................. SUCCESS [5.892s]
[INFO] Apache HBase - Rest ............................... SUCCESS [2.763s]
[INFO] Apache HBase - Shell .............................. SUCCESS [1.108s]
[INFO] Apache HBase - Integration Tests .................. SUCCESS [10:51.844s]
[INFO] Apache HBase - Examples ........................... SUCCESS [1.485s]
[INFO] Apache HBase - Assembly ........................... SUCCESS [9.297s]
[INFO] Apache HBase - Shaded ............................. SUCCESS [0.114s]
[INFO] Apache HBase - Shaded - Client .................... SUCCESS [0.478s]
[INFO] Apache HBase - Shaded - Server .................... SUCCESS [0.789s]
[INFO] ------------------------------------------------------------------------
[INFO] BUILD SUCCESS
[INFO] ------------------------------------------------------------------------
[INFO] Total time: 12:19.960s
[INFO] Finished at: Fri Aug 21 06:33:59 UTC 2015
[INFO] Final Memory: 182M/3433M
[INFO] ------------------------------------------------------------------------
Performing Post build task...
Match found for :.* : True
Logical operation result is TRUE
Running script  :   ZOMBIE_TESTS_COUNT=`jps | grep surefirebooter | wc -l`
  if [[ $ZOMBIE_TESTS_COUNT != 0 ]] ; then
    #It seems sometimes the tests are not dying immediately. Let's give them 10s
    echo "Suspicious java process found - waiting 10s to see if there are just slow to stop"
    sleep 10   
    ZOMBIE_TESTS_COUNT=`jps | grep surefirebooter | wc -l`
    if [[ $ZOMBIE_TESTS_COUNT != 0 ]] ; then
      echo "There are $ZOMBIE_TESTS_COUNT zombie tests, they should have been killed by surefire
but survived"
      echo "************ BEGIN zombies jstack extract"
      ZB_STACK=`jps | grep surefirebooter | cut -d ' ' -f 1 | xargs -n 1 jstack | grep ".test"
| grep "\.java"`
      jps | grep surefirebooter | cut -d ' ' -f 1 | xargs -n 1 jstack
      echo "************ END  zombies jstack extract"
      JIRA_COMMENT="$JIRA_COMMENT

     {color:red}-1 core zombie tests{color}.  There are ${ZOMBIE_TESTS_COUNT} zombie test(s):
${ZB_STACK}"
      BAD=1
      jps | grep surefirebooter | cut -d ' ' -f 1 | xargs kill -9
    else
      echo "We're ok: there is no zombie test, but some tests took some time to stop"
    fi
  else
    echo "We're ok: there is no zombie test"
  fi
[Hadoop] $ /bin/bash -xe /tmp/hudson6464599638417715360.sh
++ jps
++ grep surefirebooter
++ wc -l
+ ZOMBIE_TESTS_COUNT=0
+ [[ 0 != 0 ]]
+ echo 'We'\''re ok: there is no zombie test'
We're ok: there is no zombie test
POST BUILD TASK : SUCCESS
END OF POST BUILD TASK : 0
Archiving artifacts
ERROR: Publisher hudson.tasks.ArtifactArchiver aborted due to exception
java.lang.RuntimeException: Failed to serialize hudson.model.Actionable#actions for class
hudson.matrix.MatrixRun
	at hudson.util.RobustReflectionConverter$2.writeField(RobustReflectionConverter.java:214)
	at hudson.util.RobustReflectionConverter$2.visit(RobustReflectionConverter.java:182)
	at com.thoughtworks.xstream.converters.reflection.PureJavaReflectionProvider.visitSerializableFields(PureJavaReflectionProvider.java:138)
	at hudson.util.RobustReflectionConverter.doMarshal(RobustReflectionConverter.java:167)
	at hudson.util.RobustReflectionConverter.marshal(RobustReflectionConverter.java:108)
	at com.thoughtworks.xstream.core.AbstractReferenceMarshaller.convert(AbstractReferenceMarshaller.java:69)
	at com.thoughtworks.xstream.core.TreeMarshaller.convertAnother(TreeMarshaller.java:58)
	at com.thoughtworks.xstream.core.TreeMarshaller.convertAnother(TreeMarshaller.java:43)
	at com.thoughtworks.xstream.core.TreeMarshaller.start(TreeMarshaller.java:82)
	at com.thoughtworks.xstream.core.AbstractTreeMarshallingStrategy.marshal(AbstractTreeMarshallingStrategy.java:37)
	at com.thoughtworks.xstream.XStream.marshal(XStream.java:1026)
	at com.thoughtworks.xstream.XStream.marshal(XStream.java:1015)
	at com.thoughtworks.xstream.XStream.toXML(XStream.java:988)
	at hudson.XmlFile.write(XmlFile.java:178)
	at hudson.model.Run.save(Run.java:1876)
	at hudson.model.Run.pickArtifactManager(Run.java:1033)
	at hudson.tasks.ArtifactArchiver.perform(ArtifactArchiver.java:140)
	at hudson.tasks.BuildStepMonitor$1.perform(BuildStepMonitor.java:20)
	at hudson.model.AbstractBuild$AbstractBuildExecution.perform(AbstractBuild.java:756)
	at hudson.model.AbstractBuild$AbstractBuildExecution.performAllBuildSteps(AbstractBuild.java:720)
	at hudson.model.Build$BuildExecution.post2(Build.java:182)
	at hudson.model.AbstractBuild$AbstractBuildExecution.post(AbstractBuild.java:669)
	at hudson.model.Run.execute(Run.java:1731)
	at hudson.matrix.MatrixRun.run(MatrixRun.java:146)
	at hudson.model.ResourceController.execute(ResourceController.java:88)
	at hudson.model.Executor.run(Executor.java:232)
Caused by: java.lang.RuntimeException: Failed to serialize hudson.plugins.git.util.BuildData#buildsByBranchName
for class hudson.plugins.git.util.BuildData
	at hudson.util.RobustReflectionConverter$2.writeField(RobustReflectionConverter.java:214)
	at hudson.util.RobustReflectionConverter$2.visit(RobustReflectionConverter.java:182)
	at com.thoughtworks.xstream.converters.reflection.PureJavaReflectionProvider.visitSerializableFields(PureJavaReflectionProvider.java:138)
	at hudson.util.RobustReflectionConverter.doMarshal(RobustReflectionConverter.java:167)
	at hudson.util.RobustReflectionConverter.marshal(RobustReflectionConverter.java:108)
	at com.thoughtworks.xstream.core.AbstractReferenceMarshaller.convert(AbstractReferenceMarshaller.java:69)
	at com.thoughtworks.xstream.core.TreeMarshaller.convertAnother(TreeMarshaller.java:58)
	at com.thoughtworks.xstream.core.TreeMarshaller.convertAnother(TreeMarshaller.java:43)
	at com.thoughtworks.xstream.core.AbstractReferenceMarshaller$1.convertAnother(AbstractReferenceMarshaller.java:88)
	at com.thoughtworks.xstream.converters.collections.AbstractCollectionConverter.writeItem(AbstractCollectionConverter.java:64)
	at com.thoughtworks.xstream.converters.collections.CollectionConverter.marshal(CollectionConverter.java:74)
	at com.thoughtworks.xstream.core.AbstractReferenceMarshaller.convert(AbstractReferenceMarshaller.java:69)
	at com.thoughtworks.xstream.core.TreeMarshaller.convertAnother(TreeMarshaller.java:58)
	at com.thoughtworks.xstream.core.AbstractReferenceMarshaller$1.convertAnother(AbstractReferenceMarshaller.java:84)
	at hudson.util.RobustReflectionConverter.marshallField(RobustReflectionConverter.java:223)
	at hudson.util.RobustReflectionConverter$2.writeField(RobustReflectionConverter.java:210)
	... 25 more
Caused by: com.thoughtworks.xstream.io.StreamException:  : No space left on device
	at com.thoughtworks.xstream.core.util.QuickWriter.flush(QuickWriter.java:77)
	at com.thoughtworks.xstream.core.util.QuickWriter.write(QuickWriter.java:37)
	at com.thoughtworks.xstream.io.xml.PrettyPrintWriter.startNode(PrettyPrintWriter.java:197)
	at com.thoughtworks.xstream.io.xml.PrettyPrintWriter.startNode(PrettyPrintWriter.java:206)
	at com.thoughtworks.xstream.io.WriterWrapper.startNode(WriterWrapper.java:33)
	at com.thoughtworks.xstream.io.path.PathTrackingWriter.startNode(PathTrackingWriter.java:44)
	at com.thoughtworks.xstream.io.ExtendedHierarchicalStreamWriterHelper.startNode(ExtendedHierarchicalStreamWriterHelper.java:17)
	at hudson.util.RobustReflectionConverter$2.writeField(RobustReflectionConverter.java:193)
	... 40 more
Caused by: java.io.IOException: No space left on device
	at java.io.FileOutputStream.writeBytes(Native Method)
	at java.io.FileOutputStream.write(FileOutputStream.java:345)
	at sun.nio.cs.StreamEncoder.writeBytes(StreamEncoder.java:221)
	at sun.nio.cs.StreamEncoder.implFlushBuffer(StreamEncoder.java:291)
	at sun.nio.cs.StreamEncoder.implFlush(StreamEncoder.java:295)
	at sun.nio.cs.StreamEncoder.flush(StreamEncoder.java:141)
	at java.io.OutputStreamWriter.flush(OutputStreamWriter.java:229)
	at java.io.BufferedWriter.flush(BufferedWriter.java:254)
	at hudson.util.AtomicFileWriter.flush(AtomicFileWriter.java:90)
	at com.thoughtworks.xstream.core.util.QuickWriter.flush(QuickWriter.java:75)
	... 47 more

Mime
View raw message