hbase-builds mailing list archives

Site index · List index
Message view « Date » · « Thread »
Top « Date » · « Thread »
From Apache Jenkins Server <jenk...@builds.apache.org>
Subject Build failed in Jenkins: HBase-1.3 » latest1.8,Hadoop #45
Date Thu, 09 Jul 2015 17:18:28 GMT
See <https://builds.apache.org/job/HBase-1.3/jdk=latest1.8,label=Hadoop/45/changes>

Changes:

[matteo.bertozzi] Procedure v2 - Use nonces for double submits from client (Stephen Yuan Jiang)

------------------------------------------
[...truncated 43901 lines...]
Java HotSpot(TM) 64-Bit Server VM warning: ignoring option MaxPermSize=256m; support was removed
in 8.0
Java HotSpot(TM) 64-Bit Server VM warning: ignoring option MaxPermSize=256m; support was removed
in 8.0
Java HotSpot(TM) 64-Bit Server VM warning: ignoring option MaxPermSize=256m; support was removed
in 8.0
Java HotSpot(TM) 64-Bit Server VM warning: ignoring option MaxPermSize=256m; support was removed
in 8.0
Running org.apache.hadoop.hbase.util.TestCompressionTest
Tests run: 2, Failures: 0, Errors: 0, Skipped: 0, Time elapsed: 0.399 sec - in org.apache.hadoop.hbase.util.TestCompressionTest
Java HotSpot(TM) 64-Bit Server VM warning: ignoring option MaxPermSize=256m; support was removed
in 8.0
Running org.apache.hadoop.hbase.util.TestRegionSizeCalculator
Tests run: 3, Failures: 0, Errors: 0, Skipped: 0, Time elapsed: 0.598 sec - in org.apache.hadoop.hbase.util.TestRegionSizeCalculator
Java HotSpot(TM) 64-Bit Server VM warning: ignoring option MaxPermSize=256m; support was removed
in 8.0
Java HotSpot(TM) 64-Bit Server VM warning: ignoring option MaxPermSize=256m; support was removed
in 8.0
Running org.apache.hadoop.hbase.wal.TestWALMethods
Tests run: 3, Failures: 0, Errors: 0, Skipped: 0, Time elapsed: 0.686 sec - in org.apache.hadoop.hbase.wal.TestWALMethods
Java HotSpot(TM) 64-Bit Server VM warning: ignoring option MaxPermSize=256m; support was removed
in 8.0
Java HotSpot(TM) 64-Bit Server VM warning: ignoring option MaxPermSize=256m; support was removed
in 8.0
Java HotSpot(TM) 64-Bit Server VM warning: ignoring option MaxPermSize=256m; support was removed
in 8.0
Java HotSpot(TM) 64-Bit Server VM warning: ignoring option MaxPermSize=256m; support was removed
in 8.0
Java HotSpot(TM) 64-Bit Server VM warning: ignoring option MaxPermSize=256m; support was removed
in 8.0
Java HotSpot(TM) 64-Bit Server VM warning: ignoring option MaxPermSize=256m; support was removed
in 8.0
Java HotSpot(TM) 64-Bit Server VM warning: ignoring option MaxPermSize=256m; support was removed
in 8.0
Java HotSpot(TM) 64-Bit Server VM warning: ignoring option MaxPermSize=256m; support was removed
in 8.0
Java HotSpot(TM) 64-Bit Server VM warning: ignoring option MaxPermSize=256m; support was removed
in 8.0
Java HotSpot(TM) 64-Bit Server VM warning: ignoring option MaxPermSize=256m; support was removed
in 8.0
Java HotSpot(TM) 64-Bit Server VM warning: ignoring option MaxPermSize=256m; support was removed
in 8.0
Running org.apache.hadoop.hbase.TestServerName
Tests run: 7, Failures: 0, Errors: 0, Skipped: 0, Time elapsed: 0.491 sec - in org.apache.hadoop.hbase.TestServerName
Java HotSpot(TM) 64-Bit Server VM warning: ignoring option MaxPermSize=256m; support was removed
in 8.0
Java HotSpot(TM) 64-Bit Server VM warning: ignoring option MaxPermSize=256m; support was removed
in 8.0
Running org.apache.hadoop.hbase.http.TestGlobalFilter
Tests run: 1, Failures: 0, Errors: 0, Skipped: 0, Time elapsed: 0.805 sec - in org.apache.hadoop.hbase.http.TestGlobalFilter
Java HotSpot(TM) 64-Bit Server VM warning: ignoring option MaxPermSize=256m; support was removed
in 8.0
Running org.apache.hadoop.hbase.http.TestPathFilter
Tests run: 1, Failures: 0, Errors: 0, Skipped: 0, Time elapsed: 0.753 sec - in org.apache.hadoop.hbase.http.TestPathFilter
Java HotSpot(TM) 64-Bit Server VM warning: ignoring option MaxPermSize=256m; support was removed
in 8.0
Running org.apache.hadoop.hbase.http.TestServletFilter
Tests run: 3, Failures: 0, Errors: 0, Skipped: 1, Time elapsed: 0.747 sec - in org.apache.hadoop.hbase.http.TestServletFilter
Java HotSpot(TM) 64-Bit Server VM warning: ignoring option MaxPermSize=256m; support was removed
in 8.0
Running org.apache.hadoop.hbase.http.TestHttpRequestLogAppender
Tests run: 1, Failures: 0, Errors: 0, Skipped: 0, Time elapsed: 0.289 sec - in org.apache.hadoop.hbase.http.TestHttpRequestLogAppender
Java HotSpot(TM) 64-Bit Server VM warning: ignoring option MaxPermSize=256m; support was removed
in 8.0
Running org.apache.hadoop.hbase.http.TestHttpServerLifecycle
Java HotSpot(TM) 64-Bit Server VM warning: ignoring option MaxPermSize=256m; support was removed
in 8.0
Running org.apache.hadoop.hbase.http.TestSSLHttpServer
Tests run: 1, Failures: 0, Errors: 0, Skipped: 0, Time elapsed: 0.377 sec - in org.apache.hadoop.hbase.http.TestSSLHttpServer
Java HotSpot(TM) 64-Bit Server VM warning: ignoring option MaxPermSize=256m; support was removed
in 8.0
Running org.apache.hadoop.hbase.http.lib.TestStaticUserWebFilter
Tests run: 3, Failures: 0, Errors: 0, Skipped: 0, Time elapsed: 0.599 sec - in org.apache.hadoop.hbase.http.lib.TestStaticUserWebFilter
Java HotSpot(TM) 64-Bit Server VM warning: ignoring option MaxPermSize=256m; support was removed
in 8.0
Running org.apache.hadoop.hbase.http.jmx.TestJMXJsonServlet
Tests run: 1, Failures: 0, Errors: 0, Skipped: 0, Time elapsed: 0.481 sec - in org.apache.hadoop.hbase.http.jmx.TestJMXJsonServlet
Java HotSpot(TM) 64-Bit Server VM warning: ignoring option MaxPermSize=256m; support was removed
in 8.0
Running org.apache.hadoop.hbase.http.conf.TestConfServlet
Tests run: 3, Failures: 0, Errors: 0, Skipped: 0, Time elapsed: 0.488 sec - in org.apache.hadoop.hbase.http.conf.TestConfServlet
Java HotSpot(TM) 64-Bit Server VM warning: ignoring option MaxPermSize=256m; support was removed
in 8.0
Running org.apache.hadoop.hbase.http.log.TestLogLevel
Tests run: 1, Failures: 0, Errors: 0, Skipped: 0, Time elapsed: 0.86 sec - in org.apache.hadoop.hbase.http.log.TestLogLevel
Java HotSpot(TM) 64-Bit Server VM warning: ignoring option MaxPermSize=256m; support was removed
in 8.0
Running org.apache.hadoop.hbase.http.TestHttpRequestLog
Tests run: 2, Failures: 0, Errors: 0, Skipped: 0, Time elapsed: 0.324 sec - in org.apache.hadoop.hbase.http.TestHttpRequestLog
Java HotSpot(TM) 64-Bit Server VM warning: ignoring option MaxPermSize=256m; support was removed
in 8.0
Running org.apache.hadoop.hbase.http.TestHtmlQuoting
Tests run: 4, Failures: 0, Errors: 0, Skipped: 0, Time elapsed: 0.553 sec - in org.apache.hadoop.hbase.http.TestHtmlQuoting
Java HotSpot(TM) 64-Bit Server VM warning: ignoring option MaxPermSize=256m; support was removed
in 8.0
Running org.apache.hadoop.hbase.http.TestHttpServerWebapps
Tests run: 2, Failures: 0, Errors: 0, Skipped: 0, Time elapsed: 0.366 sec - in org.apache.hadoop.hbase.http.TestHttpServerWebapps
Java HotSpot(TM) 64-Bit Server VM warning: ignoring option MaxPermSize=256m; support was removed
in 8.0
Running org.apache.hadoop.hbase.http.TestHttpServer
Tests run: 15, Failures: 0, Errors: 0, Skipped: 3, Time elapsed: 2.186 sec - in org.apache.hadoop.hbase.http.TestHttpServer
Java HotSpot(TM) 64-Bit Server VM warning: ignoring option MaxPermSize=256m; support was removed
in 8.0
Java HotSpot(TM) 64-Bit Server VM warning: ignoring option MaxPermSize=256m; support was removed
in 8.0
Running org.apache.hadoop.hbase.filter.TestColumnPrefixFilter
Tests run: 2, Failures: 0, Errors: 0, Skipped: 0, Time elapsed: 2.937 sec - in org.apache.hadoop.hbase.filter.TestColumnPrefixFilter
Java HotSpot(TM) 64-Bit Server VM warning: ignoring option MaxPermSize=256m; support was removed
in 8.0
Running org.apache.hadoop.hbase.filter.TestPageFilter
Tests run: 2, Failures: 0, Errors: 0, Skipped: 0, Time elapsed: 0.334 sec - in org.apache.hadoop.hbase.filter.TestPageFilter
Java HotSpot(TM) 64-Bit Server VM warning: ignoring option MaxPermSize=256m; support was removed
in 8.0
Running org.apache.hadoop.hbase.filter.TestFilter
Tests run: 21, Failures: 0, Errors: 0, Skipped: 0, Time elapsed: 4.086 sec - in org.apache.hadoop.hbase.filter.TestFilter
Java HotSpot(TM) 64-Bit Server VM warning: ignoring option MaxPermSize=256m; support was removed
in 8.0
Running org.apache.hadoop.hbase.filter.TestComparatorSerialization
Tests run: 6, Failures: 0, Errors: 0, Skipped: 0, Time elapsed: 0.922 sec - in org.apache.hadoop.hbase.filter.TestComparatorSerialization
Java HotSpot(TM) 64-Bit Server VM warning: ignoring option MaxPermSize=256m; support was removed
in 8.0
Java HotSpot(TM) 64-Bit Server VM warning: ignoring option MaxPermSize=256m; support was removed
in 8.0
Running org.apache.hadoop.hbase.filter.TestDependentColumnFilter
Tests run: 4, Failures: 0, Errors: 0, Skipped: 0, Time elapsed: 1.564 sec - in org.apache.hadoop.hbase.filter.TestDependentColumnFilter
Java HotSpot(TM) 64-Bit Server VM warning: ignoring option MaxPermSize=256m; support was removed
in 8.0
Java HotSpot(TM) 64-Bit Server VM warning: ignoring option MaxPermSize=256m; support was removed
in 8.0
Running org.apache.hadoop.hbase.filter.TestParseFilter
Tests run: 34, Failures: 0, Errors: 0, Skipped: 0, Time elapsed: 1.4 sec - in org.apache.hadoop.hbase.filter.TestParseFilter
Java HotSpot(TM) 64-Bit Server VM warning: ignoring option MaxPermSize=256m; support was removed
in 8.0
Running org.apache.hadoop.hbase.filter.TestNullComparator
Tests run: 3, Failures: 0, Errors: 0, Skipped: 0, Time elapsed: 0.344 sec - in org.apache.hadoop.hbase.filter.TestNullComparator
Java HotSpot(TM) 64-Bit Server VM warning: ignoring option MaxPermSize=256m; support was removed
in 8.0
Running org.apache.hadoop.hbase.filter.TestFirstKeyValueMatchingQualifiersFilter
Tests run: 1, Failures: 0, Errors: 0, Skipped: 0, Time elapsed: 0.218 sec - in org.apache.hadoop.hbase.filter.TestFirstKeyValueMatchingQualifiersFilter
Java HotSpot(TM) 64-Bit Server VM warning: ignoring option MaxPermSize=256m; support was removed
in 8.0
Running org.apache.hadoop.hbase.filter.TestRegexComparator
Tests run: 3, Failures: 0, Errors: 0, Skipped: 0, Time elapsed: 0.486 sec - in org.apache.hadoop.hbase.filter.TestRegexComparator
Java HotSpot(TM) 64-Bit Server VM warning: ignoring option MaxPermSize=256m; support was removed
in 8.0
Java HotSpot(TM) 64-Bit Server VM warning: ignoring option MaxPermSize=256m; support was removed
in 8.0
Java HotSpot(TM) 64-Bit Server VM warning: ignoring option MaxPermSize=256m; support was removed
in 8.0
Java HotSpot(TM) 64-Bit Server VM warning: ignoring option MaxPermSize=256m; support was removed
in 8.0
Running org.apache.hadoop.hbase.filter.TestSingleColumnValueExcludeFilter
Tests run: 1, Failures: 0, Errors: 0, Skipped: 0, Time elapsed: 0.228 sec - in org.apache.hadoop.hbase.filter.TestSingleColumnValueExcludeFilter
Java HotSpot(TM) 64-Bit Server VM warning: ignoring option MaxPermSize=256m; support was removed
in 8.0
Java HotSpot(TM) 64-Bit Server VM warning: ignoring option MaxPermSize=256m; support was removed
in 8.0
Running org.apache.hadoop.hbase.filter.TestMultipleColumnPrefixFilter
Tests run: 3, Failures: 0, Errors: 0, Skipped: 0, Time elapsed: 3.819 sec - in org.apache.hadoop.hbase.filter.TestMultipleColumnPrefixFilter
Java HotSpot(TM) 64-Bit Server VM warning: ignoring option MaxPermSize=256m; support was removed
in 8.0
Running org.apache.hadoop.hbase.filter.TestSingleColumnValueFilter
Tests run: 3, Failures: 0, Errors: 0, Skipped: 0, Time elapsed: 0.713 sec - in org.apache.hadoop.hbase.filter.TestSingleColumnValueFilter
Java HotSpot(TM) 64-Bit Server VM warning: ignoring option MaxPermSize=256m; support was removed
in 8.0
Running org.apache.hadoop.hbase.filter.TestFilterSerialization
Tests run: 26, Failures: 0, Errors: 0, Skipped: 0, Time elapsed: 1.61 sec - in org.apache.hadoop.hbase.filter.TestFilterSerialization
Java HotSpot(TM) 64-Bit Server VM warning: ignoring option MaxPermSize=256m; support was removed
in 8.0
Running org.apache.hadoop.hbase.filter.TestPrefixFilter
Tests run: 3, Failures: 0, Errors: 0, Skipped: 0, Time elapsed: 0.291 sec - in org.apache.hadoop.hbase.filter.TestPrefixFilter
Java HotSpot(TM) 64-Bit Server VM warning: ignoring option MaxPermSize=256m; support was removed
in 8.0
Running org.apache.hadoop.hbase.filter.TestBitComparator
Tests run: 6, Failures: 0, Errors: 0, Skipped: 0, Time elapsed: 0.43 sec - in org.apache.hadoop.hbase.filter.TestBitComparator
Java HotSpot(TM) 64-Bit Server VM warning: ignoring option MaxPermSize=256m; support was removed
in 8.0
Java HotSpot(TM) 64-Bit Server VM warning: ignoring option MaxPermSize=256m; support was removed
in 8.0
Running org.apache.hadoop.hbase.filter.TestRandomRowFilter
Tests run: 2, Failures: 0, Errors: 0, Skipped: 0, Time elapsed: 0.54 sec - in org.apache.hadoop.hbase.filter.TestRandomRowFilter
Java HotSpot(TM) 64-Bit Server VM warning: ignoring option MaxPermSize=256m; support was removed
in 8.0
Running org.apache.hadoop.hbase.filter.TestFuzzyRowFilter
Tests run: 6, Failures: 0, Errors: 0, Skipped: 0, Time elapsed: 0.487 sec - in org.apache.hadoop.hbase.filter.TestFuzzyRowFilter
Java HotSpot(TM) 64-Bit Server VM warning: ignoring option MaxPermSize=256m; support was removed
in 8.0
Running org.apache.hadoop.hbase.filter.TestColumnPaginationFilter
Tests run: 1, Failures: 0, Errors: 0, Skipped: 0, Time elapsed: 0.633 sec - in org.apache.hadoop.hbase.filter.TestColumnPaginationFilter
Java HotSpot(TM) 64-Bit Server VM warning: ignoring option MaxPermSize=256m; support was removed
in 8.0
Running org.apache.hadoop.hbase.filter.TestInclusiveStopFilter
Tests run: 2, Failures: 0, Errors: 0, Skipped: 0, Time elapsed: 0.259 sec - in org.apache.hadoop.hbase.filter.TestInclusiveStopFilter
Java HotSpot(TM) 64-Bit Server VM warning: ignoring option MaxPermSize=256m; support was removed
in 8.0
Running org.apache.hadoop.hbase.filter.TestFilterList
Tests run: 7, Failures: 0, Errors: 0, Skipped: 0, Time elapsed: 0.906 sec - in org.apache.hadoop.hbase.filter.TestFilterList
Java HotSpot(TM) 64-Bit Server VM warning: ignoring option MaxPermSize=256m; support was removed
in 8.0
Running org.apache.hadoop.hbase.filter.TestInvocationRecordFilter
Tests run: 1, Failures: 0, Errors: 0, Skipped: 0, Time elapsed: 1.281 sec - in org.apache.hadoop.hbase.filter.TestInvocationRecordFilter

Results :




Tests run: 951, Failures: 0, Errors: 0, Skipped: 6

[INFO] ------------------------------------------------------------------------
[INFO] Reactor Summary:
[INFO] 
[INFO] HBase ............................................. SUCCESS [57.787s]
[INFO] HBase - Checkstyle ................................ SUCCESS [4.876s]
[INFO] HBase - Annotations ............................... SUCCESS [0.983s]
[INFO] HBase - Protocol .................................. SUCCESS [17.101s]
[INFO] HBase - Common .................................... SUCCESS [2:19.326s]
[INFO] HBase - Procedure ................................. SUCCESS [1:49.533s]
[INFO] HBase - Client .................................... SUCCESS [1:28.681s]
[INFO] HBase - Hadoop Compatibility ...................... SUCCESS [8.786s]
[INFO] HBase - Hadoop Two Compatibility .................. SUCCESS [10.535s]
[INFO] HBase - Prefix Tree ............................... SUCCESS [7.071s]
[INFO] HBase - Server .................................... FAILURE [28:14.852s]
[INFO] HBase - Testing Util .............................. SKIPPED
[INFO] HBase - Thrift .................................... SKIPPED
[INFO] HBase - Rest ...................................... SKIPPED
[INFO] HBase - Shell ..................................... SKIPPED
[INFO] HBase - Integration Tests ......................... SKIPPED
[INFO] HBase - Examples .................................. SKIPPED
[INFO] HBase - Assembly .................................. SKIPPED
[INFO] HBase - Shaded .................................... SKIPPED
[INFO] HBase - Shaded - Client ........................... SKIPPED
[INFO] HBase - Shaded - Server ........................... SKIPPED
[INFO] ------------------------------------------------------------------------
[INFO] BUILD FAILURE
[INFO] ------------------------------------------------------------------------
[INFO] Total time: 35:55.628s
[INFO] Finished at: Thu Jul 09 17:18:02 UTC 2015
[INFO] Final Memory: 97M/1639M
[INFO] ------------------------------------------------------------------------
[ERROR] Failed to execute goal org.apache.maven.plugins:maven-surefire-plugin:2.18:test (default-test)
on project hbase-server: There was a timeout or other error in the fork -> [Help 1]
[ERROR] 
[ERROR] To see the full stack trace of the errors, re-run Maven with the -e switch.
[ERROR] Re-run Maven using the -X switch to enable full debug logging.
[ERROR] 
[ERROR] For more information about the errors and possible solutions, please read the following
articles:
[ERROR] [Help 1] http://cwiki.apache.org/confluence/display/MAVEN/MojoFailureException
[ERROR] 
[ERROR] After correcting the problems, you can resume the build with the command
[ERROR]   mvn <goals> -rf :hbase-server
Build step 'Invoke top-level Maven targets' marked build as failure
Performing Post build task...
Match found for :.* : True
Logical operation result is TRUE
Running script  :   ZOMBIE_TESTS_COUNT=`jps | grep surefirebooter | wc -l`
  if [[ $ZOMBIE_TESTS_COUNT != 0 ]] ; then
    #It seems sometimes the tests are not dying immediately. Let's give them 10s
    echo "Suspicious java process found - waiting 10s to see if there are just slow to stop"
    sleep 10   
    ZOMBIE_TESTS_COUNT=`jps | grep surefirebooter | wc -l`
    if [[ $ZOMBIE_TESTS_COUNT != 0 ]] ; then
      echo "There are $ZOMBIE_TESTS_COUNT zombie tests, they should have been killed by surefire
but survived"
      echo "************ BEGIN zombies jstack extract"
      ZB_STACK=`jps | grep surefirebooter | cut -d ' ' -f 1 | xargs -n 1 jstack | grep ".test"
| grep "\.java"`
      jps | grep surefirebooter | cut -d ' ' -f 1 | xargs -n 1 jstack
      echo "************ END  zombies jstack extract"
      JIRA_COMMENT="$JIRA_COMMENT

     {color:red}-1 core zombie tests{color}.  There are ${ZOMBIE_TESTS_COUNT} zombie test(s):
${ZB_STACK}"
      BAD=1
      jps | grep surefirebooter | cut -d ' ' -f 1 | xargs kill -9
    else
      echo "We're ok: there is no zombie test, but some tests took some time to stop"
    fi
  else
    echo "We're ok: there is no zombie test"
  fi
[Hadoop] $ /bin/bash -xe /tmp/hudson5477503893214906430.sh
++ jps
++ grep surefirebooter
++ wc -l
+ ZOMBIE_TESTS_COUNT=1
+ [[ 1 != 0 ]]
+ echo 'Suspicious java process found - waiting 10s to see if there are just slow to stop'
Suspicious java process found - waiting 10s to see if there are just slow to stop
+ sleep 10
++ jps
++ wc -l
++ grep surefirebooter
+ ZOMBIE_TESTS_COUNT=1
+ [[ 1 != 0 ]]
+ echo 'There are 1 zombie tests, they should have been killed by surefire but survived'
There are 1 zombie tests, they should have been killed by surefire but survived
+ echo '************ BEGIN zombies jstack extract'
************ BEGIN zombies jstack extract
++ jps
++ grep surefirebooter
++ cut -d ' ' -f 1
++ xargs -n 1 jstack
++ grep .test
++ grep '\.java'
+ ZB_STACK=
POST BUILD TASK : FAILURE
END OF POST BUILD TASK : 0
Archiving artifacts
Sending artifact delta relative to HBase-1.3 » latest1.8,Hadoop #43
Archived 979 artifacts
Archive block size is 32768
Received 2 blocks and 35430145 bytes
Compression is 0.2%
Took 21 sec

Mime
View raw message