hbase-builds mailing list archives

Site index · List index
Message view « Date » · « Thread »
Top « Date » · « Thread »
From Apache Jenkins Server <jenk...@builds.apache.org>
Subject Build failed in Jenkins: HBase-1.2-IT » IntegrationTestBigLinkedList,latest1.8,Hadoop #34
Date Thu, 02 Jul 2015 04:29:58 GMT
See <https://builds.apache.org/job/HBase-1.2-IT/it.test=IntegrationTestBigLinkedList,jdk=latest1.8,label=Hadoop/34/changes>

Changes:

[stack] HBASE-13895 DATALOSS: Region assigned before WAL replay when abort (Enis Soztutar)

------------------------------------------
[...truncated 880 lines...]
[INFO] --- maven-source-plugin:2.2.1:jar-no-fork (attach-sources) @ hbase-hadoop2-compat ---
[WARNING] Artifact org.apache.hbase:hbase-hadoop2-compat:java-source:sources:1.2.0-SNAPSHOT
already attached to project, ignoring duplicate
[INFO] 
[INFO] --- maven-jar-plugin:2.4:test-jar (default) @ hbase-hadoop2-compat ---
[WARNING] Artifact org.apache.hbase:hbase-hadoop2-compat:test-jar:tests:1.2.0-SNAPSHOT already
attached to project, ignoring duplicate
[INFO] 
[INFO] --- maven-jar-plugin:2.4:jar (default-jar) @ hbase-hadoop2-compat ---
[INFO]                                                                         
[INFO] ------------------------------------------------------------------------
[INFO] Building HBase - Prefix Tree 1.2.0-SNAPSHOT
[INFO] ------------------------------------------------------------------------
[INFO] 
[INFO] --- maven-clean-plugin:2.5:clean (default-clean) @ hbase-prefix-tree ---
[INFO] Deleting <https://builds.apache.org/job/HBase-1.2-IT/it.test=IntegrationTestBigLinkedList,jdk=latest1.8,label=Hadoop/ws/hbase-prefix-tree/target>
[INFO] 
[INFO] --- maven-enforcer-plugin:1.0.1:enforce (enforce) @ hbase-prefix-tree ---
[INFO] 
[INFO] --- jacoco-maven-plugin:0.7.5.201505241946:prepare-agent (prepare-agent) @ hbase-prefix-tree
---
[INFO] Skipping JaCoCo execution because property jacoco.skip is set.
[INFO] argLine set to empty
[INFO] 
[INFO] --- maven-remote-resources-plugin:1.4:process (default) @ hbase-prefix-tree ---
[INFO] 
[INFO] --- maven-resources-plugin:2.6:resources (default-resources) @ hbase-prefix-tree ---
[INFO] Using 'UTF-8' encoding to copy filtered resources.
[INFO] skip non existing resourceDirectory <https://builds.apache.org/job/HBase-1.2-IT/it.test=IntegrationTestBigLinkedList,jdk=latest1.8,label=Hadoop/ws/hbase-prefix-tree/src/main/resources>
[INFO] Copying 3 resources
[INFO] 
[INFO] --- maven-compiler-plugin:2.5.1:compile (default-compile) @ hbase-prefix-tree ---
[INFO] Compiling 39 source files to <https://builds.apache.org/job/HBase-1.2-IT/it.test=IntegrationTestBigLinkedList,jdk=latest1.8,label=Hadoop/ws/hbase-prefix-tree/target/classes>
[INFO] 
[INFO] --- maven-resources-plugin:2.6:testResources (default-testResources) @ hbase-prefix-tree
---
[INFO] Using 'UTF-8' encoding to copy filtered resources.
[INFO] skip non existing resourceDirectory <https://builds.apache.org/job/HBase-1.2-IT/it.test=IntegrationTestBigLinkedList,jdk=latest1.8,label=Hadoop/ws/hbase-prefix-tree/src/test/resources>
[INFO] Copying 3 resources
[INFO] 
[INFO] --- maven-compiler-plugin:2.5.1:testCompile (default-testCompile) @ hbase-prefix-tree
---
[INFO] Compiling 47 source files to <https://builds.apache.org/job/HBase-1.2-IT/it.test=IntegrationTestBigLinkedList,jdk=latest1.8,label=Hadoop/ws/hbase-prefix-tree/target/test-classes>
[INFO] 
[INFO] --- maven-surefire-plugin:2.18:test (default-test) @ hbase-prefix-tree ---
[INFO] 
[INFO] --- maven-surefire-plugin:2.18:test (secondPartTestsExecution) @ hbase-prefix-tree
---
[INFO] Tests are skipped.
[INFO] 
[INFO] --- jacoco-maven-plugin:0.7.5.201505241946:report (report) @ hbase-prefix-tree ---
[INFO] Skipping JaCoCo execution because property jacoco.skip is set.
[INFO] 
[INFO] --- maven-source-plugin:2.2.1:jar-no-fork (attach-sources) @ hbase-prefix-tree ---
[INFO] Building jar: <https://builds.apache.org/job/HBase-1.2-IT/it.test=IntegrationTestBigLinkedList,jdk=latest1.8,label=Hadoop/ws/hbase-prefix-tree/target/hbase-prefix-tree-1.2.0-SNAPSHOT-sources.jar>
[INFO] 
[INFO] --- maven-jar-plugin:2.4:test-jar (default) @ hbase-prefix-tree ---
[INFO] Building jar: <https://builds.apache.org/job/HBase-1.2-IT/it.test=IntegrationTestBigLinkedList,jdk=latest1.8,label=Hadoop/ws/hbase-prefix-tree/target/hbase-prefix-tree-1.2.0-SNAPSHOT-tests.jar>
[INFO] 
[INFO] --- maven-jar-plugin:2.4:jar (default-jar) @ hbase-prefix-tree ---
[INFO] Building jar: <https://builds.apache.org/job/HBase-1.2-IT/it.test=IntegrationTestBigLinkedList,jdk=latest1.8,label=Hadoop/ws/hbase-prefix-tree/target/hbase-prefix-tree-1.2.0-SNAPSHOT.jar>
[INFO] 
[INFO] --- maven-enforcer-plugin:1.0.1:enforce (enforce) @ hbase-prefix-tree ---
[INFO] 
[INFO] --- jacoco-maven-plugin:0.7.5.201505241946:prepare-agent (prepare-agent) @ hbase-prefix-tree
---
[INFO] Skipping JaCoCo execution because property jacoco.skip is set.
[INFO] argLine set to empty
[INFO] 
[INFO] --- maven-remote-resources-plugin:1.4:process (default) @ hbase-prefix-tree ---
[INFO] 
[INFO] --- maven-resources-plugin:2.6:resources (default-resources) @ hbase-prefix-tree ---
[INFO] Using 'UTF-8' encoding to copy filtered resources.
[INFO] skip non existing resourceDirectory <https://builds.apache.org/job/HBase-1.2-IT/it.test=IntegrationTestBigLinkedList,jdk=latest1.8,label=Hadoop/ws/hbase-prefix-tree/src/main/resources>
[INFO] Copying 3 resources
[INFO] Copying 3 resources
[INFO] 
[INFO] --- maven-compiler-plugin:2.5.1:compile (default-compile) @ hbase-prefix-tree ---
[INFO] Nothing to compile - all classes are up to date
[INFO] 
[INFO] --- maven-resources-plugin:2.6:testResources (default-testResources) @ hbase-prefix-tree
---
[INFO] Using 'UTF-8' encoding to copy filtered resources.
[INFO] skip non existing resourceDirectory <https://builds.apache.org/job/HBase-1.2-IT/it.test=IntegrationTestBigLinkedList,jdk=latest1.8,label=Hadoop/ws/hbase-prefix-tree/src/test/resources>
[INFO] Copying 3 resources
[INFO] Copying 3 resources
[INFO] 
[INFO] --- maven-compiler-plugin:2.5.1:testCompile (default-testCompile) @ hbase-prefix-tree
---
[INFO] Nothing to compile - all classes are up to date
[INFO] 
[INFO] --- maven-surefire-plugin:2.18:test (default-test) @ hbase-prefix-tree ---
[INFO] Skipping execution of surefire because it has already been run for this configuration
[INFO] 
[INFO] --- maven-surefire-plugin:2.18:test (secondPartTestsExecution) @ hbase-prefix-tree
---
[INFO] Tests are skipped.
[INFO] 
[INFO] --- jacoco-maven-plugin:0.7.5.201505241946:report (report) @ hbase-prefix-tree ---
[INFO] Skipping JaCoCo execution because property jacoco.skip is set.
[INFO] 
[INFO] --- maven-source-plugin:2.2.1:jar-no-fork (attach-sources) @ hbase-prefix-tree ---
[INFO] Building jar: <https://builds.apache.org/job/HBase-1.2-IT/it.test=IntegrationTestBigLinkedList,jdk=latest1.8,label=Hadoop/ws/hbase-prefix-tree/target/hbase-prefix-tree-1.2.0-SNAPSHOT-sources.jar>
[WARNING] Artifact org.apache.hbase:hbase-prefix-tree:java-source:sources:1.2.0-SNAPSHOT already
attached to project, ignoring duplicate
[INFO] 
[INFO] --- maven-jar-plugin:2.4:test-jar (default) @ hbase-prefix-tree ---
[INFO] Building jar: <https://builds.apache.org/job/HBase-1.2-IT/it.test=IntegrationTestBigLinkedList,jdk=latest1.8,label=Hadoop/ws/hbase-prefix-tree/target/hbase-prefix-tree-1.2.0-SNAPSHOT-tests.jar>
[WARNING] Artifact org.apache.hbase:hbase-prefix-tree:test-jar:tests:1.2.0-SNAPSHOT already
attached to project, ignoring duplicate
[INFO] 
[INFO] --- maven-jar-plugin:2.4:jar (default-jar) @ hbase-prefix-tree ---
[INFO] Building jar: <https://builds.apache.org/job/HBase-1.2-IT/it.test=IntegrationTestBigLinkedList,jdk=latest1.8,label=Hadoop/ws/hbase-prefix-tree/target/hbase-prefix-tree-1.2.0-SNAPSHOT.jar>
[INFO]                                                                         
[INFO] ------------------------------------------------------------------------
[INFO] Building HBase - Server 1.2.0-SNAPSHOT
[INFO] ------------------------------------------------------------------------
[INFO] 
[INFO] --- maven-clean-plugin:2.5:clean (default-clean) @ hbase-server ---
[INFO] Deleting <https://builds.apache.org/job/HBase-1.2-IT/it.test=IntegrationTestBigLinkedList,jdk=latest1.8,label=Hadoop/ws/hbase-server/target>
[INFO] 
[INFO] --- maven-enforcer-plugin:1.0.1:enforce (enforce) @ hbase-server ---
[INFO] 
[INFO] --- jacoco-maven-plugin:0.7.5.201505241946:prepare-agent (prepare-agent) @ hbase-server
---
[INFO] Skipping JaCoCo execution because property jacoco.skip is set.
[INFO] argLine set to empty
[INFO] 
[INFO] --- build-helper-maven-plugin:1.9.1:add-source (jspcSource-packageInfo-source) @ hbase-server
---
[INFO] Source directory: <https://builds.apache.org/job/HBase-1.2-IT/it.test=IntegrationTestBigLinkedList,jdk=latest1.8,label=Hadoop/ws/hbase-server/target/generated-jamon>
added.
[INFO] Source directory: <https://builds.apache.org/job/HBase-1.2-IT/it.test=IntegrationTestBigLinkedList,jdk=latest1.8,label=Hadoop/ws/hbase-server/target/generated-sources/java>
added.
[INFO] 
[INFO] --- jamon-maven-plugin:2.3.4:translate (default) @ hbase-server ---
[INFO] Translating 10 templates from <https://builds.apache.org/job/HBase-1.2-IT/it.test=IntegrationTestBigLinkedList,jdk=latest1.8,label=Hadoop/ws/hbase-server/src/main/jamon>
to <https://builds.apache.org/job/HBase-1.2-IT/it.test=IntegrationTestBigLinkedList,jdk=latest1.8,label=Hadoop/ws/hbase-server/target/generated-jamon>
[INFO] 
[INFO] --- maven-antrun-plugin:1.6:run (generate) @ hbase-server ---
[INFO] Executing tasks

main:
    [mkdir] Created dir: <https://builds.apache.org/job/HBase-1.2-IT/it.test=IntegrationTestBigLinkedList,jdk=latest1.8,label=Hadoop/ws/hbase-server/target/hbase-webapps>
     [copy] Copying 20 files to <https://builds.apache.org/job/HBase-1.2-IT/it.test=IntegrationTestBigLinkedList,jdk=latest1.8,label=Hadoop/ws/hbase-server/target/hbase-webapps>
log4j:WARN No appenders could be found for logger (org.mortbay.log).
log4j:WARN Please initialize the log4j system properly.
log4j:WARN See http://logging.apache.org/log4j/1.2/faq.html#noconfig for more info.
    [mkdir] Created dir: <https://builds.apache.org/job/HBase-1.2-IT/it.test=IntegrationTestBigLinkedList,jdk=latest1.8,label=Hadoop/ws/hbase-server/target/hbase-webapps/master/WEB-INF>
    [mkdir] Created dir: <https://builds.apache.org/job/HBase-1.2-IT/it.test=IntegrationTestBigLinkedList,jdk=latest1.8,label=Hadoop/ws/hbase-server/target/hbase-webapps/regionserver/WEB-INF>
[INFO] Executed tasks
[INFO] 
[INFO] --- maven-remote-resources-plugin:1.4:process (default) @ hbase-server ---
[INFO] 
[INFO] --- maven-resources-plugin:2.6:resources (default-resources) @ hbase-server ---
[INFO] Using 'UTF-8' encoding to copy filtered resources.
[INFO] Copying 22 resources
[INFO] Copying 3 resources
[INFO] 
[INFO] --- maven-compiler-plugin:2.5.1:compile (default-compile) @ hbase-server ---
[INFO] Compiling 782 source files to <https://builds.apache.org/job/HBase-1.2-IT/it.test=IntegrationTestBigLinkedList,jdk=latest1.8,label=Hadoop/ws/hbase-server/target/classes>
[INFO] -------------------------------------------------------------
[ERROR] COMPILATION ERROR : 
[INFO] -------------------------------------------------------------
[ERROR] <https://builds.apache.org/job/HBase-1.2-IT/it.test=IntegrationTestBigLinkedList,jdk=latest1.8,label=Hadoop/ws/hbase-server/src/main/java/org/apache/hadoop/hbase/master/AssignmentManager.java>:[94,43]
error: cannot find symbol
[ERROR]   symbol:   class RegionServerAbortedException
  location: package org.apache.hadoop.hbase.regionserver
<https://builds.apache.org/job/HBase-1.2-IT/it.test=IntegrationTestBigLinkedList,jdk=latest1.8,label=Hadoop/ws/hbase-server/src/main/java/org/apache/hadoop/hbase/master/AssignmentManager.java>:[1872,25]
error: cannot find symbol
[ERROR]   symbol:   class RegionServerAbortedException
  location: class AssignmentManager
<https://builds.apache.org/job/HBase-1.2-IT/it.test=IntegrationTestBigLinkedList,jdk=latest1.8,label=Hadoop/ws/hbase-server/src/main/java/org/apache/hadoop/hbase/regionserver/RSRpcServices.java>:[984,16]
error: cannot find symbol
[INFO] 3 errors 
[INFO] -------------------------------------------------------------
[INFO] ------------------------------------------------------------------------
[INFO] Reactor Summary:
[INFO] 
[INFO] HBase ............................................. SUCCESS [3.260s]
[INFO] HBase - Checkstyle ................................ SUCCESS [0.539s]
[INFO] HBase - Annotations ............................... SUCCESS [1.193s]
[INFO] HBase - Protocol .................................. SUCCESS [13.959s]
[INFO] HBase - Common .................................... SUCCESS [8.922s]
[INFO] HBase - Procedure ................................. SUCCESS [1.272s]
[INFO] HBase - Client .................................... SUCCESS [5.408s]
[INFO] HBase - Hadoop Compatibility ...................... SUCCESS [0.449s]
[INFO] HBase - Hadoop Two Compatibility .................. SUCCESS [1.392s]
[INFO] HBase - Prefix Tree ............................... SUCCESS [1.255s]
[INFO] HBase - Server .................................... FAILURE [7.631s]
[INFO] HBase - Testing Util .............................. SKIPPED
[INFO] HBase - Thrift .................................... SKIPPED
[INFO] HBase - Rest ...................................... SKIPPED
[INFO] HBase - Shell ..................................... SKIPPED
[INFO] HBase - Integration Tests ......................... SKIPPED
[INFO] HBase - Examples .................................. SKIPPED
[INFO] HBase - Assembly .................................. SKIPPED
[INFO] HBase - Shaded .................................... SKIPPED
[INFO] HBase - Shaded - Client ........................... SKIPPED
[INFO] HBase - Shaded - Server ........................... SKIPPED
[INFO] ------------------------------------------------------------------------
[INFO] BUILD FAILURE
[INFO] ------------------------------------------------------------------------
[INFO] Total time: 46.614s
[INFO] Finished at: Thu Jul 02 04:29:54 UTC 2015
[INFO] Final Memory: 118M/2277M
[INFO] ------------------------------------------------------------------------
[ERROR] Failed to execute goal org.apache.maven.plugins:maven-compiler-plugin:2.5.1:compile
(default-compile) on project hbase-server: Compilation failure: Compilation failure:
[ERROR] <https://builds.apache.org/job/HBase-1.2-IT/it.test=IntegrationTestBigLinkedList,jdk=latest1.8,label=Hadoop/ws/hbase-server/src/main/java/org/apache/hadoop/hbase/master/AssignmentManager.java>:[94,43]
error: cannot find symbol
[ERROR] symbol:   class RegionServerAbortedException
[ERROR] location: package org.apache.hadoop.hbase.regionserver
[ERROR] <https://builds.apache.org/job/HBase-1.2-IT/it.test=IntegrationTestBigLinkedList,jdk=latest1.8,label=Hadoop/ws/hbase-server/src/main/java/org/apache/hadoop/hbase/master/AssignmentManager.java>:[1872,25]
error: cannot find symbol
[ERROR] symbol:   class RegionServerAbortedException
[ERROR] location: class AssignmentManager
[ERROR] <https://builds.apache.org/job/HBase-1.2-IT/it.test=IntegrationTestBigLinkedList,jdk=latest1.8,label=Hadoop/ws/hbase-server/src/main/java/org/apache/hadoop/hbase/regionserver/RSRpcServices.java>:[984,16]
error: cannot find symbol
[ERROR] -> [Help 1]
[ERROR] 
[ERROR] To see the full stack trace of the errors, re-run Maven with the -e switch.
[ERROR] Re-run Maven using the -X switch to enable full debug logging.
[ERROR] 
[ERROR] For more information about the errors and possible solutions, please read the following
articles:
[ERROR] [Help 1] http://cwiki.apache.org/confluence/display/MAVEN/MojoFailureException
[ERROR] 
[ERROR] After correcting the problems, you can resume the build with the command
[ERROR]   mvn <goals> -rf :hbase-server
Build step 'Invoke top-level Maven targets' marked build as failure
Performing Post build task...
Match found for :.* : True
Logical operation result is TRUE
Running script  :   ZOMBIE_TESTS_COUNT=`jps | grep surefirebooter | wc -l`
  if [[ $ZOMBIE_TESTS_COUNT != 0 ]] ; then
    #It seems sometimes the tests are not dying immediately. Let's give them 10s
    echo "Suspicious java process found - waiting 10s to see if there are just slow to stop"
    sleep 10   
    ZOMBIE_TESTS_COUNT=`jps | grep surefirebooter | wc -l`
    if [[ $ZOMBIE_TESTS_COUNT != 0 ]] ; then
      echo "There are $ZOMBIE_TESTS_COUNT zombie tests, they should have been killed by surefire
but survived"
      echo "************ BEGIN zombies jstack extract"
      ZB_STACK=`jps | grep surefirebooter | cut -d ' ' -f 1 | xargs -n 1 jstack | grep ".test"
| grep "\.java"`
      jps | grep surefirebooter | cut -d ' ' -f 1 | xargs -n 1 jstack
      echo "************ END  zombies jstack extract"
      JIRA_COMMENT="$JIRA_COMMENT

     {color:red}-1 core zombie tests{color}.  There are ${ZOMBIE_TESTS_COUNT} zombie test(s):
${ZB_STACK}"
      BAD=1
      jps | grep surefirebooter | cut -d ' ' -f 1 | xargs kill -9
    else
      echo "We're ok: there is no zombie test, but some tests took some time to stop"
    fi
  else
    echo "We're ok: there is no zombie test"
  fi
[Hadoop] $ /bin/bash -xe /tmp/hudson1485727739290844118.sh
++ jps
++ grep surefirebooter
++ wc -l
+ ZOMBIE_TESTS_COUNT=0
+ [[ 0 != 0 ]]
+ echo 'We'\''re ok: there is no zombie test'
We're ok: there is no zombie test
POST BUILD TASK : SUCCESS
END OF POST BUILD TASK : 0
Archiving artifacts
Sending artifact delta relative to HBase-1.2-IT » IntegrationTestBigLinkedList,latest1.8,Hadoop
#33
Archived 67 artifacts
Archive block size is 32768
Received 0 blocks and 2318678 bytes
Compression is 0.0%
Took 1.6 sec

Mime
View raw message