hbase-builds mailing list archives

Site index · List index
Message view « Date » · « Thread »
Top « Date » · « Thread »
From Apache Jenkins Server <jenk...@builds.apache.org>
Subject Build failed in Jenkins: HBase-1.2 » latest1.8,Hadoop #49
Date Sat, 04 Jul 2015 12:06:35 GMT
See <https://builds.apache.org/job/HBase-1.2/jdk=latest1.8,label=Hadoop/49/changes>

Changes:

[zhangduo] HBASE-13970 NPE during compaction in trunk

[tedyu] HBASE-14005 Set permission to .top hfile in LoadIncrementalHFiles (Francesco MDE)

[stack] HBASE-14010 TestRegionRebalancing.testRebalanceOnRegionServerNumberChange fails; cluster
not balanced

[stack] HBASE-14013 Retry when RegionServerNotYetRunningException rather than go ahead with
assign so for sure we don't skip WAL replay

[stack] HBASE-14015 Allow setting a richer state value when toString a pv2

[stack] HBASE-14015 Allow setting a richer state value when toString a pv2 -- ADDENDUM on
branch-1 and derivatives

[apurtell] HBASE-13925 Use zookeeper multi to clear znodes in ZKProcedureUtil

[apurtell] HBASE-14002 Add --noReplicationSetup option to IntegrationTestReplication

------------------------------------------
[...truncated 46227 lines...]
128/177 KB   340/340 KB   340/345 KB   
128/177 KB   340/340 KB   342/345 KB   
132/177 KB   340/340 KB   342/345 KB   
132/177 KB   340/340 KB   344/345 KB   
133/177 KB   340/340 KB   344/345 KB   
133/177 KB   340/340 KB   345/345 KB   
136/177 KB   340/340 KB   345/345 KB   
140/177 KB   340/340 KB   345/345 KB   
141/177 KB   340/340 KB   345/345 KB   
144/177 KB   340/340 KB   345/345 KB   
148/177 KB   340/340 KB   345/345 KB   
149/177 KB   340/340 KB   345/345 KB   
152/177 KB   340/340 KB   345/345 KB   
156/177 KB   340/340 KB   345/345 KB   
160/177 KB   340/340 KB   345/345 KB   
160/177 KB   340/340 KB   345/345 KB   
164/177 KB   340/340 KB   345/345 KB   
168/177 KB   340/340 KB   345/345 KB   
168/177 KB   340/340 KB   345/345 KB   
172/177 KB   340/340 KB   345/345 KB   
176/177 KB   340/340 KB   345/345 KB   
176/177 KB   340/340 KB   345/345 KB   
177/177 KB   340/340 KB   345/345 KB   
                                       
Downloaded: https://repository.apache.org/content/repositories/releases/org/apache/httpcomponents/httpcore/4.1.3/httpcore-4.1.3.jar
(177 KB at 432.7 KB/sec)
                                       
Downloaded: https://repository.apache.org/content/repositories/releases/org/apache/httpcomponents/httpclient/4.1.3/httpclient-4.1.3.jar
(345 KB at 833.7 KB/sec)
                                       
Downloaded: https://repository.apache.org/content/repositories/releases/org/apache/thrift/libthrift/0.9.0/libthrift-0.9.0.jar
(340 KB at 798.6 KB/sec)
[INFO] 
[INFO] --- maven-enforcer-plugin:1.0.1:enforce (enforce) @ hbase-thrift ---
[INFO] 
[INFO] --- jacoco-maven-plugin:0.7.5.201505241946:prepare-agent (prepare-agent) @ hbase-thrift
---
[INFO] Skipping JaCoCo execution because property jacoco.skip is set.
[INFO] argLine set to empty
[INFO] 
[INFO] --- maven-antrun-plugin:1.6:run (generate) @ hbase-thrift ---
[INFO] Executing tasks

main:
    [mkdir] Created dir: <https://builds.apache.org/job/HBase-1.2/jdk=latest1.8,label=Hadoop/ws/hbase-thrift/target/hbase-webapps>
     [copy] Copying 17 files to <https://builds.apache.org/job/HBase-1.2/jdk=latest1.8,label=Hadoop/ws/hbase-thrift/target/hbase-webapps>
log4j:WARN No appenders could be found for logger (org.mortbay.log).
log4j:WARN Please initialize the log4j system properly.
log4j:WARN See http://logging.apache.org/log4j/1.2/faq.html#noconfig for more info.
    [mkdir] Created dir: <https://builds.apache.org/job/HBase-1.2/jdk=latest1.8,label=Hadoop/ws/hbase-thrift/target/hbase-webapps/thrift/WEB-INF>
[INFO] Executed tasks
[INFO] 
[INFO] --- build-helper-maven-plugin:1.9.1:add-source (jspcSource-packageInfo-source) @ hbase-thrift
---
[INFO] Source directory: <https://builds.apache.org/job/HBase-1.2/jdk=latest1.8,label=Hadoop/ws/hbase-thrift/target/generated-sources/java>
added.
[INFO] 
[INFO] --- maven-remote-resources-plugin:1.4:process (default) @ hbase-thrift ---
[INFO] 
[INFO] --- maven-resources-plugin:2.6:resources (default-resources) @ hbase-thrift ---
[INFO] Using 'UTF-8' encoding to copy filtered resources.
[INFO] Copying 18 resources
[INFO] Copying 3 resources
[INFO] 
[INFO] --- maven-compiler-plugin:2.5.1:compile (default-compile) @ hbase-thrift ---
[INFO] Compiling 53 source files to <https://builds.apache.org/job/HBase-1.2/jdk=latest1.8,label=Hadoop/ws/hbase-thrift/target/classes>
[INFO] 
[INFO] --- maven-dependency-plugin:2.1:build-classpath (create-mrapp-generated-classpath)
@ hbase-thrift ---
[INFO] Wrote classpath file '<https://builds.apache.org/job/HBase-1.2/jdk=latest1.8,label=Hadoop/ws/hbase-thrift/target/test-classes/mrapp-generated-classpath'.>
[INFO] 
[INFO] --- maven-resources-plugin:2.6:testResources (default-testResources) @ hbase-thrift
---
[INFO] Using 'UTF-8' encoding to copy filtered resources.
[INFO] skip non existing resourceDirectory <https://builds.apache.org/job/HBase-1.2/jdk=latest1.8,label=Hadoop/ws/hbase-thrift/src/test/resources>
[INFO] Copying 3 resources
[INFO] 
[INFO] --- maven-compiler-plugin:2.5.1:testCompile (default-testCompile) @ hbase-thrift ---
[INFO] Compiling 6 source files to <https://builds.apache.org/job/HBase-1.2/jdk=latest1.8,label=Hadoop/ws/hbase-thrift/target/test-classes>
[INFO] 
[INFO] --- maven-surefire-plugin:2.18:test (default-test) @ hbase-thrift ---
[INFO] Surefire report directory: <https://builds.apache.org/job/HBase-1.2/jdk=latest1.8,label=Hadoop/ws/hbase-thrift/target/surefire-reports>
[INFO] Using configured provider org.apache.maven.surefire.junitcore.JUnitCoreProvider
[INFO] parallel='none', perCoreThreadCount=true, threadCount=0, useUnlimitedThreads=false,
threadCountSuites=0, threadCountClasses=0, threadCountMethods=0, parallelOptimized=true

-------------------------------------------------------
 T E S T S
-------------------------------------------------------
Java HotSpot(TM) 64-Bit Server VM warning: ignoring option MaxPermSize=256m; support was removed
in 8.0
Running org.apache.hadoop.hbase.thrift.TestThriftHttpServer
Tests run: 1, Failures: 0, Errors: 0, Skipped: 0, Time elapsed: 9.064 sec - in org.apache.hadoop.hbase.thrift.TestThriftHttpServer
Java HotSpot(TM) 64-Bit Server VM warning: ignoring option MaxPermSize=256m; support was removed
in 8.0
Running org.apache.hadoop.hbase.thrift.TestThriftServerCmdLine
Tests run: 32, Failures: 0, Errors: 0, Skipped: 0, Time elapsed: 59.045 sec - in org.apache.hadoop.hbase.thrift.TestThriftServerCmdLine
Java HotSpot(TM) 64-Bit Server VM warning: ignoring option MaxPermSize=256m; support was removed
in 8.0
Running org.apache.hadoop.hbase.thrift.TestThriftServer
Tests run: 1, Failures: 0, Errors: 0, Skipped: 0, Time elapsed: 89.067 sec - in org.apache.hadoop.hbase.thrift.TestThriftServer
Java HotSpot(TM) 64-Bit Server VM warning: ignoring option MaxPermSize=256m; support was removed
in 8.0
Running org.apache.hadoop.hbase.thrift.TestCallQueue
Tests run: 18, Failures: 0, Errors: 0, Skipped: 0, Time elapsed: 0.282 sec - in org.apache.hadoop.hbase.thrift.TestCallQueue
Java HotSpot(TM) 64-Bit Server VM warning: ignoring option MaxPermSize=256m; support was removed
in 8.0
Running org.apache.hadoop.hbase.thrift2.TestThriftHBaseServiceHandler
Tests run: 1, Failures: 0, Errors: 1, Skipped: 0, Time elapsed: 0.006 sec <<< FAILURE!
- in org.apache.hadoop.hbase.thrift2.TestThriftHBaseServiceHandler
org.apache.hadoop.hbase.thrift2.TestThriftHBaseServiceHandler  Time elapsed: 0.006 sec  <<<
ERROR!
java.io.IOException: Shutting down
	at sun.nio.ch.Net.bind0(Native Method)
	at sun.nio.ch.Net.bind(Net.java:436)
	at sun.nio.ch.Net.bind(Net.java:428)
	at sun.nio.ch.ServerSocketChannelImpl.bind(ServerSocketChannelImpl.java:214)
	at sun.nio.ch.ServerSocketAdaptor.bind(ServerSocketAdaptor.java:74)
	at org.mortbay.jetty.nio.SelectChannelConnector.open(SelectChannelConnector.java:216)
	at org.apache.hadoop.hbase.http.HttpServer.openListeners(HttpServer.java:1008)
	at org.apache.hadoop.hbase.http.HttpServer.start(HttpServer.java:949)
	at org.apache.hadoop.hbase.http.InfoServer.start(InfoServer.java:91)
	at org.apache.hadoop.hbase.regionserver.HRegionServer.putUpWebUI(HRegionServer.java:1777)
	at org.apache.hadoop.hbase.regionserver.HRegionServer.<init>(HRegionServer.java:599)
	at org.apache.hadoop.hbase.master.HMaster.<init>(HMaster.java:353)
	at sun.reflect.NativeConstructorAccessorImpl.newInstance0(Native Method)
	at sun.reflect.NativeConstructorAccessorImpl.newInstance(NativeConstructorAccessorImpl.java:62)
	at sun.reflect.DelegatingConstructorAccessorImpl.newInstance(DelegatingConstructorAccessorImpl.java:45)
	at java.lang.reflect.Constructor.newInstance(Constructor.java:408)
	at org.apache.hadoop.hbase.util.JVMClusterUtil.createMasterThread(JVMClusterUtil.java:140)
	at org.apache.hadoop.hbase.LocalHBaseCluster.addMaster(LocalHBaseCluster.java:217)
	at org.apache.hadoop.hbase.LocalHBaseCluster.<init>(LocalHBaseCluster.java:153)
	at org.apache.hadoop.hbase.MiniHBaseCluster.init(MiniHBaseCluster.java:214)
	at org.apache.hadoop.hbase.MiniHBaseCluster.<init>(MiniHBaseCluster.java:94)
	at org.apache.hadoop.hbase.HBaseTestingUtility.startMiniHBaseCluster(HBaseTestingUtility.java:1013)
	at org.apache.hadoop.hbase.HBaseTestingUtility.startMiniCluster(HBaseTestingUtility.java:973)
	at org.apache.hadoop.hbase.HBaseTestingUtility.startMiniCluster(HBaseTestingUtility.java:845)
	at org.apache.hadoop.hbase.HBaseTestingUtility.startMiniCluster(HBaseTestingUtility.java:839)
	at org.apache.hadoop.hbase.HBaseTestingUtility.startMiniCluster(HBaseTestingUtility.java:783)
	at org.apache.hadoop.hbase.thrift2.TestThriftHBaseServiceHandler.beforeClass(TestThriftHBaseServiceHandler.java:136)

Java HotSpot(TM) 64-Bit Server VM warning: ignoring option MaxPermSize=256m; support was removed
in 8.0
Running org.apache.hadoop.hbase.thrift2.TestThriftHBaseServiceHandlerWithLabels
Tests run: 6, Failures: 0, Errors: 0, Skipped: 0, Time elapsed: 7.134 sec - in org.apache.hadoop.hbase.thrift2.TestThriftHBaseServiceHandlerWithLabels

Results :


Tests in error: 
  TestThriftHBaseServiceHandler.beforeClass:136 » IO Shutting down


Tests run: 59, Failures: 0, Errors: 1, Skipped: 0

[INFO] ------------------------------------------------------------------------
[INFO] Reactor Summary:
[INFO] 
[INFO] HBase ............................................. SUCCESS [1:06.565s]
[INFO] HBase - Checkstyle ................................ SUCCESS [6.928s]
[INFO] HBase - Annotations ............................... SUCCESS [1.021s]
[INFO] HBase - Protocol .................................. SUCCESS [19.098s]
[INFO] HBase - Common .................................... SUCCESS [2:41.647s]
[INFO] HBase - Procedure ................................. SUCCESS [1:49.824s]
[INFO] HBase - Client .................................... SUCCESS [1:29.335s]
[INFO] HBase - Hadoop Compatibility ...................... SUCCESS [9.463s]
[INFO] HBase - Hadoop Two Compatibility .................. SUCCESS [9.260s]
[INFO] HBase - Prefix Tree ............................... SUCCESS [7.558s]
[INFO] HBase - Server .................................... SUCCESS [1:48:25.415s]
[INFO] HBase - Testing Util .............................. SUCCESS [3.026s]
[INFO] HBase - Thrift .................................... FAILURE [3:38.518s]
[INFO] HBase - Rest ...................................... SKIPPED
[INFO] HBase - Shell ..................................... SKIPPED
[INFO] HBase - Integration Tests ......................... SKIPPED
[INFO] HBase - Examples .................................. SKIPPED
[INFO] HBase - Assembly .................................. SKIPPED
[INFO] HBase - Shaded .................................... SKIPPED
[INFO] HBase - Shaded - Client ........................... SKIPPED
[INFO] HBase - Shaded - Server ........................... SKIPPED
[INFO] ------------------------------------------------------------------------
[INFO] BUILD FAILURE
[INFO] ------------------------------------------------------------------------
[INFO] Total time: 2:00:27.763s
[INFO] Finished at: Sat Jul 04 12:03:57 UTC 2015
[INFO] Final Memory: 109M/695M
[INFO] ------------------------------------------------------------------------
[ERROR] Failed to execute goal org.apache.maven.plugins:maven-surefire-plugin:2.18:test (default-test)
on project hbase-thrift: ExecutionException: java.lang.RuntimeException: There was an error
in the forked process
[ERROR] java.lang.ArrayIndexOutOfBoundsException: 1
[ERROR] at org.apache.maven.surefire.common.junit4.JUnit4ProviderUtil.generateFailingTests(JUnit4ProviderUtil.java:64)
[ERROR] at org.apache.maven.surefire.junitcore.JUnitCoreProvider.invoke(JUnitCoreProvider.java:151)
[ERROR] at org.apache.maven.surefire.booter.ForkedBooter.invokeProviderInSameClassLoader(ForkedBooter.java:203)
[ERROR] at org.apache.maven.surefire.booter.ForkedBooter.runSuitesInProcess(ForkedBooter.java:155)
[ERROR] at org.apache.maven.surefire.booter.ForkedBooter.main(ForkedBooter.java:103)
[ERROR] -> [Help 1]
[ERROR] 
[ERROR] To see the full stack trace of the errors, re-run Maven with the -e switch.
[ERROR] Re-run Maven using the -X switch to enable full debug logging.
[ERROR] 
[ERROR] For more information about the errors and possible solutions, please read the following
articles:
[ERROR] [Help 1] http://cwiki.apache.org/confluence/display/MAVEN/MojoFailureException
[ERROR] 
[ERROR] After correcting the problems, you can resume the build with the command
[ERROR]   mvn <goals> -rf :hbase-thrift
Build step 'Invoke top-level Maven targets' marked build as failure
Performing Post build task...
Match found for :.* : True
Logical operation result is TRUE
Running script  :   ZOMBIE_TESTS_COUNT=`jps | grep surefirebooter | wc -l`
  if [[ $ZOMBIE_TESTS_COUNT != 0 ]] ; then
    #It seems sometimes the tests are not dying immediately. Let's give them 10s
    echo "Suspicious java process found - waiting 10s to see if there are just slow to stop"
    sleep 10   
    ZOMBIE_TESTS_COUNT=`jps | grep surefirebooter | wc -l`
    if [[ $ZOMBIE_TESTS_COUNT != 0 ]] ; then
      echo "There are $ZOMBIE_TESTS_COUNT zombie tests, they should have been killed by surefire
but survived"
      echo "************ BEGIN zombies jstack extract"
      ZB_STACK=`jps | grep surefirebooter | cut -d ' ' -f 1 | xargs -n 1 jstack | grep ".test"
| grep "\.java"`
      jps | grep surefirebooter | cut -d ' ' -f 1 | xargs -n 1 jstack
      echo "************ END  zombies jstack extract"
      JIRA_COMMENT="$JIRA_COMMENT

     {color:red}-1 core zombie tests{color}.  There are ${ZOMBIE_TESTS_COUNT} zombie test(s):
${ZB_STACK}"
      BAD=1
      jps | grep surefirebooter | cut -d ' ' -f 1 | xargs kill -9
    else
      echo "We're ok: there is no zombie test, but some tests took some time to stop"
    fi
  else
    echo "We're ok: there is no zombie test"
  fi
[Hadoop] $ /bin/bash -xe /tmp/hudson6832850319004771425.sh
++ jps
++ grep surefirebooter
++ wc -l
+ ZOMBIE_TESTS_COUNT=1
+ [[ 1 != 0 ]]
+ echo 'Suspicious java process found - waiting 10s to see if there are just slow to stop'
Suspicious java process found - waiting 10s to see if there are just slow to stop
+ sleep 10
++ jps
++ wc -l
++ grep surefirebooter
+ ZOMBIE_TESTS_COUNT=1
+ [[ 1 != 0 ]]
+ echo 'There are 1 zombie tests, they should have been killed by surefire but survived'
There are 1 zombie tests, they should have been killed by surefire but survived
+ echo '************ BEGIN zombies jstack extract'
************ BEGIN zombies jstack extract
++ jps
++ grep surefirebooter
++ cut -d ' ' -f 1
++ grep .test
++ grep '\.java'
++ xargs -n 1 jstack
10340: Unable to open socket file: target process not responding or HotSpot VM not loaded
The -F option can be used when the target process is not responding
+ ZB_STACK=
POST BUILD TASK : FAILURE
END OF POST BUILD TASK : 0
Archiving artifacts
Sending artifact delta relative to HBase-1.2 » latest1.8,Hadoop #45
Archived 2130 artifacts
Archive block size is 32768
Received 38 blocks and 518221579 bytes
Compression is 0.2%
Took 2 min 20 sec

Mime
View raw message