hbase-builds mailing list archives

Site index · List index
Message view « Date » · « Thread »
Top « Date » · « Thread »
From Apache Jenkins Server <jenk...@builds.apache.org>
Subject Build failed in Jenkins: HBase-0.98 #1021
Date Mon, 08 Jun 2015 16:55:56 GMT
See <https://builds.apache.org/job/HBase-0.98/1021/changes>

Changes:

[tedyu] HBASE-13854 TestTableLockManager#testLockTimeoutException fails in 0.98 and 1.0 branches

------------------------------------------
[...truncated 1506 lines...]
Tests run: 6, Failures: 0, Errors: 0, Skipped: 0, Time elapsed: 175.653 sec - in org.apache.hadoop.hbase.mapreduce.TestRowCounter
Running org.apache.hadoop.hbase.mapreduce.TestTableInputFormat
Tests run: 6, Failures: 0, Errors: 0, Skipped: 0, Time elapsed: 30.805 sec - in org.apache.hadoop.hbase.mapreduce.TestTableInputFormat
Running org.apache.hadoop.hbase.mapreduce.TestHFileOutputFormat2
Tests run: 13, Failures: 0, Errors: 0, Skipped: 1, Time elapsed: 216.817 sec - in org.apache.hadoop.hbase.mapreduce.TestHFileOutputFormat2
Running org.apache.hadoop.hbase.mapreduce.TestWALPlayer
Tests run: 3, Failures: 0, Errors: 0, Skipped: 0, Time elapsed: 47.277 sec - in org.apache.hadoop.hbase.mapreduce.TestWALPlayer
Running org.apache.hadoop.hbase.mapreduce.TestLoadIncrementalHFilesSplitRecovery
Tests run: 5, Failures: 0, Errors: 0, Skipped: 0, Time elapsed: 13.671 sec - in org.apache.hadoop.hbase.mapreduce.TestLoadIncrementalHFilesSplitRecovery
Running org.apache.hadoop.hbase.mapreduce.TestCopyTable
Tests run: 6, Failures: 0, Errors: 0, Skipped: 0, Time elapsed: 129.131 sec - in org.apache.hadoop.hbase.mapreduce.TestCopyTable
Running org.apache.hadoop.hbase.mapreduce.TestHFileOutputFormat
Tests run: 13, Failures: 0, Errors: 0, Skipped: 1, Time elapsed: 217.705 sec - in org.apache.hadoop.hbase.mapreduce.TestHFileOutputFormat
Running org.apache.hadoop.hbase.mapreduce.TestImportTSVWithVisibilityLabels
Tests run: 5, Failures: 0, Errors: 0, Skipped: 0, Time elapsed: 148.895 sec - in org.apache.hadoop.hbase.mapreduce.TestImportTSVWithVisibilityLabels
Running org.apache.hadoop.hbase.util.TestTableName
Tests run: 6, Failures: 0, Errors: 0, Skipped: 0, Time elapsed: 0.458 sec - in org.apache.hadoop.hbase.util.TestTableName
Running org.apache.hadoop.hbase.util.TestIdLock
Tests run: 1, Failures: 0, Errors: 0, Skipped: 0, Time elapsed: 15.322 sec - in org.apache.hadoop.hbase.util.TestIdLock
Running org.apache.hadoop.hbase.util.TestMergeTool
Tests run: 1, Failures: 0, Errors: 0, Skipped: 0, Time elapsed: 17.762 sec - in org.apache.hadoop.hbase.util.TestMergeTool
Running org.apache.hadoop.hbase.util.TestMiniClusterLoadEncoded
Tests run: 5, Failures: 0, Errors: 0, Skipped: 0, Time elapsed: 38.128 sec - in org.apache.hadoop.hbase.util.TestMiniClusterLoadEncoded
Running org.apache.hadoop.hbase.util.TestFSUtils
Tests run: 7, Failures: 0, Errors: 0, Skipped: 0, Time elapsed: 11.445 sec - in org.apache.hadoop.hbase.util.TestFSUtils
Running org.apache.hadoop.hbase.util.TestCoprocessorScanPolicy
Tests run: 4, Failures: 0, Errors: 0, Skipped: 0, Time elapsed: 3.549 sec - in org.apache.hadoop.hbase.util.TestCoprocessorScanPolicy
Running org.apache.hadoop.hbase.util.TestMiniClusterLoadParallel
Tests run: 4, Failures: 0, Errors: 0, Skipped: 0, Time elapsed: 35.897 sec - in org.apache.hadoop.hbase.util.TestMiniClusterLoadParallel
Running org.apache.hadoop.hbase.util.TestRegionSplitter
Tests run: 6, Failures: 0, Errors: 0, Skipped: 0, Time elapsed: 3.689 sec - in org.apache.hadoop.hbase.util.TestRegionSplitter
Running org.apache.hadoop.hbase.util.TestFSTableDescriptors
Tests run: 15, Failures: 0, Errors: 0, Skipped: 0, Time elapsed: 1.995 sec - in org.apache.hadoop.hbase.util.TestFSTableDescriptors
Running org.apache.hadoop.hbase.util.TestFSHDFSUtils
Tests run: 3, Failures: 0, Errors: 0, Skipped: 0, Time elapsed: 7.516 sec - in org.apache.hadoop.hbase.util.TestFSHDFSUtils
Running org.apache.hadoop.hbase.util.TestProcessBasedCluster
Tests run: 1, Failures: 0, Errors: 0, Skipped: 0, Time elapsed: 0.105 sec - in org.apache.hadoop.hbase.util.TestProcessBasedCluster
Running org.apache.hadoop.hbase.util.TestHBaseFsck
Tests run: 46, Failures: 0, Errors: 0, Skipped: 1, Time elapsed: 202.118 sec - in org.apache.hadoop.hbase.util.TestHBaseFsck
Running org.apache.hadoop.hbase.util.hbck.TestOfflineMetaRebuildOverlap
Tests run: 1, Failures: 0, Errors: 0, Skipped: 0, Time elapsed: 17.203 sec - in org.apache.hadoop.hbase.util.hbck.TestOfflineMetaRebuildOverlap
Running org.apache.hadoop.hbase.util.hbck.TestOfflineMetaRebuildHole
Tests run: 1, Failures: 0, Errors: 0, Skipped: 0, Time elapsed: 17.478 sec - in org.apache.hadoop.hbase.util.hbck.TestOfflineMetaRebuildHole
Running org.apache.hadoop.hbase.util.hbck.TestOfflineMetaRebuildBase
Tests run: 1, Failures: 0, Errors: 0, Skipped: 0, Time elapsed: 17.397 sec - in org.apache.hadoop.hbase.util.hbck.TestOfflineMetaRebuildBase
Running org.apache.hadoop.hbase.util.TestMergeTable
Tests run: 1, Failures: 0, Errors: 0, Skipped: 0, Time elapsed: 15.581 sec - in org.apache.hadoop.hbase.util.TestMergeTable
Running org.apache.hadoop.hbase.util.TestConnectionCache
Tests run: 1, Failures: 0, Errors: 0, Skipped: 0, Time elapsed: 14.491 sec - in org.apache.hadoop.hbase.util.TestConnectionCache
Running org.apache.hadoop.hbase.util.TestFSVisitor
Tests run: 3, Failures: 0, Errors: 0, Skipped: 0, Time elapsed: 3.218 sec - in org.apache.hadoop.hbase.util.TestFSVisitor
Running org.apache.hadoop.hbase.util.TestDefaultEnvironmentEdge
Tests run: 1, Failures: 0, Errors: 0, Skipped: 0, Time elapsed: 0.308 sec - in org.apache.hadoop.hbase.util.TestDefaultEnvironmentEdge
Running org.apache.hadoop.hbase.util.TestHBaseFsckEncryption
Tests run: 1, Failures: 0, Errors: 0, Skipped: 0, Time elapsed: 9.821 sec - in org.apache.hadoop.hbase.util.TestHBaseFsckEncryption
Running org.apache.hadoop.hbase.util.TestMiniClusterLoadSequential
Tests run: 4, Failures: 0, Errors: 0, Skipped: 0, Time elapsed: 38.735 sec - in org.apache.hadoop.hbase.util.TestMiniClusterLoadSequential
Running org.apache.hadoop.hbase.fs.TestBlockReorder
Tests run: 3, Failures: 0, Errors: 0, Skipped: 0, Time elapsed: 17.906 sec - in org.apache.hadoop.hbase.fs.TestBlockReorder
Running org.apache.hadoop.hbase.TestZooKeeper
Tests run: 10, Failures: 0, Errors: 0, Skipped: 0, Time elapsed: 71.28 sec - in org.apache.hadoop.hbase.TestZooKeeper
Running org.apache.hadoop.hbase.mapred.TestTableMapReduceUtil
Tests run: 4, Failures: 0, Errors: 0, Skipped: 0, Time elapsed: 80.888 sec - in org.apache.hadoop.hbase.mapred.TestTableMapReduceUtil
Running org.apache.hadoop.hbase.mapred.TestTableSnapshotInputFormat
Tests run: 6, Failures: 0, Errors: 0, Skipped: 0, Time elapsed: 232.655 sec - in org.apache.hadoop.hbase.mapred.TestTableSnapshotInputFormat
Running org.apache.hadoop.hbase.mapred.TestTableMapReduce
Tests run: 2, Failures: 0, Errors: 0, Skipped: 0, Time elapsed: 89.097 sec - in org.apache.hadoop.hbase.mapred.TestTableMapReduce
Running org.apache.hadoop.hbase.mapred.TestTableInputFormat
Tests run: 6, Failures: 0, Errors: 0, Skipped: 0, Time elapsed: 30.77 sec - in org.apache.hadoop.hbase.mapred.TestTableInputFormat
Running org.apache.hadoop.hbase.zookeeper.TestZKTable
Tests run: 1, Failures: 0, Errors: 0, Skipped: 0, Time elapsed: 0.64 sec - in org.apache.hadoop.hbase.zookeeper.TestZKTable
Running org.apache.hadoop.hbase.zookeeper.TestHQuorumPeer
Tests run: 3, Failures: 0, Errors: 0, Skipped: 0, Time elapsed: 1.242 sec - in org.apache.hadoop.hbase.zookeeper.TestHQuorumPeer
Running org.apache.hadoop.hbase.zookeeper.TestZooKeeperNodeTracker
Tests run: 3, Failures: 0, Errors: 0, Skipped: 0, Time elapsed: 0.793 sec - in org.apache.hadoop.hbase.zookeeper.TestZooKeeperNodeTracker
Running org.apache.hadoop.hbase.zookeeper.lock.TestZKInterProcessReadWriteLock
Tests run: 6, Failures: 0, Errors: 0, Skipped: 0, Time elapsed: 24.455 sec - in org.apache.hadoop.hbase.zookeeper.lock.TestZKInterProcessReadWriteLock
Running org.apache.hadoop.hbase.zookeeper.TestZooKeeperACL
Tests run: 6, Failures: 0, Errors: 0, Skipped: 0, Time elapsed: 0.243 sec - in org.apache.hadoop.hbase.zookeeper.TestZooKeeperACL
Running org.apache.hadoop.hbase.zookeeper.TestZKMulti
Tests run: 6, Failures: 0, Errors: 0, Skipped: 0, Time elapsed: 0.306 sec - in org.apache.hadoop.hbase.zookeeper.TestZKMulti
Running org.apache.hadoop.hbase.zookeeper.TestRecoverableZooKeeper
Tests run: 1, Failures: 0, Errors: 0, Skipped: 0, Time elapsed: 1.219 sec - in org.apache.hadoop.hbase.zookeeper.TestRecoverableZooKeeper
Running org.apache.hadoop.hbase.zookeeper.TestZKLeaderManager
Tests run: 1, Failures: 0, Errors: 0, Skipped: 0, Time elapsed: 0.121 sec - in org.apache.hadoop.hbase.zookeeper.TestZKLeaderManager
Running org.apache.hadoop.hbase.client.TestHTablePool$TestHTableThreadLocalPool
Tests run: 9, Failures: 0, Errors: 0, Skipped: 0, Time elapsed: 1.876 sec - in org.apache.hadoop.hbase.client.TestHTablePool$TestHTableThreadLocalPool
Running org.apache.hadoop.hbase.client.TestScannersFromClientSide
Tests run: 7, Failures: 0, Errors: 0, Skipped: 0, Time elapsed: 6.354 sec - in org.apache.hadoop.hbase.client.TestScannersFromClientSide
Running org.apache.hadoop.hbase.client.TestHCM
Tests run: 15, Failures: 0, Errors: 0, Skipped: 3, Time elapsed: 37.982 sec - in org.apache.hadoop.hbase.client.TestHCM
Running org.apache.hadoop.hbase.client.TestClientOperationInterrupt
Tests run: 1, Failures: 0, Errors: 0, Skipped: 0, Time elapsed: 53.789 sec - in org.apache.hadoop.hbase.client.TestClientOperationInterrupt
Running org.apache.hadoop.hbase.client.TestRestoreSnapshotFromClient
Tests run: 5, Failures: 0, Errors: 0, Skipped: 0, Time elapsed: 75.08 sec - in org.apache.hadoop.hbase.client.TestRestoreSnapshotFromClient
Running org.apache.hadoop.hbase.client.TestMultipleTimestamps
Tests run: 8, Failures: 0, Errors: 0, Skipped: 0, Time elapsed: 3.829 sec - in org.apache.hadoop.hbase.client.TestMultipleTimestamps
Running org.apache.hadoop.hbase.client.TestFromClientSide3
Tests run: 9, Failures: 0, Errors: 0, Skipped: 0, Time elapsed: 34.84 sec - in org.apache.hadoop.hbase.client.TestFromClientSide3
Running org.apache.hadoop.hbase.client.TestSnapshotMetadata
Tests run: 4, Failures: 0, Errors: 0, Skipped: 0, Time elapsed: 10.049 sec - in org.apache.hadoop.hbase.client.TestSnapshotMetadata
Running org.apache.hadoop.hbase.client.TestClientTimeouts
Tests run: 1, Failures: 0, Errors: 0, Skipped: 0, Time elapsed: 3.637 sec - in org.apache.hadoop.hbase.client.TestClientTimeouts
Running org.apache.hadoop.hbase.client.TestResultSizeEstimation
Tests run: 2, Failures: 0, Errors: 0, Skipped: 0, Time elapsed: 1.556 sec - in org.apache.hadoop.hbase.client.TestResultSizeEstimation
Running org.apache.hadoop.hbase.client.TestHTablePool$TestHTableReusablePool
Tests run: 9, Failures: 0, Errors: 0, Skipped: 0, Time elapsed: 5.579 sec - in org.apache.hadoop.hbase.client.TestHTablePool$TestHTableReusablePool
Running org.apache.hadoop.hbase.client.TestHTablePool$TestHTableThreadLocalPool
Tests run: 9, Failures: 0, Errors: 0, Skipped: 0, Time elapsed: 1.779 sec - in org.apache.hadoop.hbase.client.TestHTablePool$TestHTableThreadLocalPool
Running org.apache.hadoop.hbase.client.TestCheckAndMutate
Tests run: 1, Failures: 0, Errors: 0, Skipped: 0, Time elapsed: 1.254 sec - in org.apache.hadoop.hbase.client.TestCheckAndMutate
Running org.apache.hadoop.hbase.client.TestPutWithDelete
Tests run: 1, Failures: 0, Errors: 0, Skipped: 0, Time elapsed: 1.638 sec - in org.apache.hadoop.hbase.client.TestPutWithDelete
Running org.apache.hadoop.hbase.client.TestSizeFailures
Tests run: 2, Failures: 0, Errors: 0, Skipped: 0, Time elapsed: 32.232 sec - in org.apache.hadoop.hbase.client.TestSizeFailures
Running org.apache.hadoop.hbase.client.TestMultiParallel
Tests run: 12, Failures: 0, Errors: 0, Skipped: 0, Time elapsed: 18.08 sec - in org.apache.hadoop.hbase.client.TestMultiParallel
Running org.apache.hadoop.hbase.client.TestTableSnapshotScanner
Tests run: 3, Failures: 0, Errors: 0, Skipped: 0, Time elapsed: 34.057 sec - in org.apache.hadoop.hbase.client.TestTableSnapshotScanner
Running org.apache.hadoop.hbase.client.TestHTableMultiplexer
Tests run: 1, Failures: 0, Errors: 0, Skipped: 0, Time elapsed: 7.226 sec - in org.apache.hadoop.hbase.client.TestHTableMultiplexer
Running org.apache.hadoop.hbase.client.TestHTablePool$TestHTableReusablePool
Tests run: 9, Failures: 0, Errors: 0, Skipped: 0, Time elapsed: 2.011 sec - in org.apache.hadoop.hbase.client.TestHTablePool$TestHTableReusablePool
Running org.apache.hadoop.hbase.client.TestFromClientSideNoCodec
Tests run: 2, Failures: 0, Errors: 0, Skipped: 0, Time elapsed: 1.873 sec - in org.apache.hadoop.hbase.client.TestFromClientSideNoCodec
Running org.apache.hadoop.hbase.client.TestSnapshotFromClient
Tests run: 5, Failures: 0, Errors: 0, Skipped: 0, Time elapsed: 9.188 sec - in org.apache.hadoop.hbase.client.TestSnapshotFromClient
Running org.apache.hadoop.hbase.client.TestHTableUtil
Tests run: 2, Failures: 0, Errors: 0, Skipped: 0, Time elapsed: 1.638 sec - in org.apache.hadoop.hbase.client.TestHTableUtil
Running org.apache.hadoop.hbase.client.TestScannerTimeout
Tests run: 4, Failures: 0, Errors: 0, Skipped: 0, Time elapsed: 37.862 sec - in org.apache.hadoop.hbase.client.TestScannerTimeout
Running org.apache.hadoop.hbase.client.TestAdmin2
Tests run: 24, Failures: 0, Errors: 0, Skipped: 0, Time elapsed: 54.011 sec - in org.apache.hadoop.hbase.client.TestAdmin2
Running org.apache.hadoop.hbase.client.TestClientScannerRPCTimeout
Tests run: 1, Failures: 0, Errors: 0, Skipped: 0, Time elapsed: 20.598 sec - in org.apache.hadoop.hbase.client.TestClientScannerRPCTimeout
Running org.apache.hadoop.hbase.client.TestCloneSnapshotFromClient
Tests run: 5, Failures: 0, Errors: 0, Skipped: 0, Time elapsed: 44.551 sec - in org.apache.hadoop.hbase.client.TestCloneSnapshotFromClient
Running org.apache.hadoop.hbase.client.TestClientPushback
Tests run: 1, Failures: 0, Errors: 0, Skipped: 0, Time elapsed: 1.078 sec - in org.apache.hadoop.hbase.client.TestClientPushback
Running org.apache.hadoop.hbase.client.TestRpcControllerFactory
Tests run: 1, Failures: 0, Errors: 0, Skipped: 0, Time elapsed: 1.567 sec - in org.apache.hadoop.hbase.client.TestRpcControllerFactory
Running org.apache.hadoop.hbase.client.TestFromClientSide
Tests run: 80, Failures: 0, Errors: 0, Skipped: 4, Time elapsed: 78.661 sec - in org.apache.hadoop.hbase.client.TestFromClientSide
Running org.apache.hadoop.hbase.client.TestSnapshotCloneIndependence
Tests run: 8, Failures: 0, Errors: 0, Skipped: 0, Time elapsed: 43.405 sec - in org.apache.hadoop.hbase.client.TestSnapshotCloneIndependence
Running org.apache.hadoop.hbase.client.TestTimestampsFilter
Tests run: 3, Failures: 0, Errors: 0, Skipped: 0, Time elapsed: 3.656 sec - in org.apache.hadoop.hbase.client.TestTimestampsFilter
Running org.apache.hadoop.hbase.client.TestHTableMultiplexerFlushCache
Tests run: 1, Failures: 0, Errors: 0, Skipped: 0, Time elapsed: 4.908 sec - in org.apache.hadoop.hbase.client.TestHTableMultiplexerFlushCache
Running org.apache.hadoop.hbase.client.replication.TestReplicationAdminWithClusters
Tests run: 8, Failures: 0, Errors: 0, Skipped: 0, Time elapsed: 9.64 sec - in org.apache.hadoop.hbase.client.replication.TestReplicationAdminWithClusters
Running org.apache.hadoop.hbase.client.replication.TestReplicationAdmin
Tests run: 3, Failures: 0, Errors: 0, Skipped: 0, Time elapsed: 0.189 sec - in org.apache.hadoop.hbase.client.replication.TestReplicationAdmin
Running org.apache.hadoop.hbase.client.TestAdmin1

Results :

Failed tests: 
  TestLogRolling.testLogRollOnDatanodeDeath:432 New log file should have the default replication
instead of 1



Tests run: 1580, Failures: 1, Errors: 0, Skipped: 18

[INFO] ------------------------------------------------------------------------
[INFO] Reactor Summary:
[INFO] 
[INFO] HBase ............................................. SUCCESS [3.580s]
[INFO] HBase - Checkstyle ................................ SUCCESS [0.661s]
[INFO] HBase - Annotations ............................... SUCCESS [0.963s]
[INFO] HBase - Common .................................... SUCCESS [51.343s]
[INFO] HBase - Protocol .................................. SUCCESS [8.996s]
[INFO] HBase - Client .................................... SUCCESS [53.332s]
[INFO] HBase - Hadoop Compatibility ...................... SUCCESS [7.026s]
[INFO] HBase - Hadoop Two Compatibility .................. SUCCESS [6.541s]
[INFO] HBase - Prefix Tree ............................... SUCCESS [8.392s]
[INFO] HBase - Server .................................... FAILURE [2:46:13.885s]
[INFO] HBase - Testing Util .............................. SKIPPED
[INFO] HBase - Thrift .................................... SKIPPED
[INFO] HBase - Rest ...................................... SKIPPED
[INFO] HBase - Shell ..................................... SKIPPED
[INFO] HBase - Integration Tests ......................... SKIPPED
[INFO] HBase - Examples .................................. SKIPPED
[INFO] HBase - Assembly .................................. SKIPPED
[INFO] ------------------------------------------------------------------------
[INFO] BUILD FAILURE
[INFO] ------------------------------------------------------------------------
[INFO] Total time: 2:48:35.636s
[INFO] Finished at: Mon Jun 08 16:54:18 UTC 2015
[INFO] Final Memory: 223M/567M
[INFO] ------------------------------------------------------------------------
[ERROR] Failed to execute goal org.apache.maven.plugins:maven-surefire-plugin:2.18:test (secondPartTestsExecution)
on project hbase-server: ExecutionException: java.lang.RuntimeException: The forked VM terminated
without properly saying goodbye. VM crash or System.exit called?
[ERROR] Command was /bin/sh -c cd <https://builds.apache.org/job/HBase-0.98/ws/hbase-server>
&& /home/jenkins/tools/java/jdk1.7.0_25-32/jre/bin/java -enableassertions -XX:MaxDirectMemorySize=1G
-Xmx2800m -XX:MaxPermSize=256m -Djava.security.egd=file:/dev/./urandom -Djava.net.preferIPv4Stack=true
-Djava.awt.headless=true -jar <https://builds.apache.org/job/HBase-0.98/ws/hbase-server/target/surefire/surefirebooter6972882261621313527.jar>
<https://builds.apache.org/job/HBase-0.98/ws/hbase-server/target/surefire/surefire430754216482068351tmp>
<https://builds.apache.org/job/HBase-0.98/ws/hbase-server/target/surefire/surefire_8148214312432445134118tmp>
[ERROR] -> [Help 1]
[ERROR] 
[ERROR] To see the full stack trace of the errors, re-run Maven with the -e switch.
[ERROR] Re-run Maven using the -X switch to enable full debug logging.
[ERROR] 
[ERROR] For more information about the errors and possible solutions, please read the following
articles:
[ERROR] [Help 1] http://cwiki.apache.org/confluence/display/MAVEN/MojoFailureException
[ERROR] 
[ERROR] After correcting the problems, you can resume the build with the command
[ERROR]   mvn <goals> -rf :hbase-server
Build step 'Invoke top-level Maven targets' marked build as failure
Performing Post build task...
Match found for :.* : True
Logical operation result is TRUE
Running script  :   ZOMBIE_TESTS_COUNT=`jps | grep surefirebooter | wc -l`
  if [[ $ZOMBIE_TESTS_COUNT != 0 ]] ; then
    #It seems sometimes the tests are not dying immediately. Let's give them 10s
    echo "Suspicious java process found - waiting 10s to see if there are just slow to stop"
    sleep 10   
    ZOMBIE_TESTS_COUNT=`jps | grep surefirebooter | wc -l`
    if [[ $ZOMBIE_TESTS_COUNT != 0 ]] ; then
      echo "There are $ZOMBIE_TESTS_COUNT zombie tests, they should have been killed by surefire
but survived"
      echo "************ BEGIN zombies jstack extract"
      ZB_STACK=`jps | grep surefirebooter | cut -d ' ' -f 1 | xargs -n 1 jstack | grep ".test"
| grep "\.java"`
      jps | grep surefirebooter | cut -d ' ' -f 1 | xargs -n 1 jstack
      echo "************ END  zombies jstack extract"
      JIRA_COMMENT="$JIRA_COMMENT

     {color:red}-1 core zombie tests{color}.  There are ${ZOMBIE_TESTS_COUNT} zombie test(s):
${ZB_STACK}"
      BAD=1
      jps | grep surefirebooter | cut -d ' ' -f 1 | xargs kill -9
    else
      echo "We're ok: there is no zombie test, but some tests took some time to stop"
    fi
  else
    echo "We're ok: there is no zombie test"
  fi
[HBase-0.98] $ /bin/bash -xe /tmp/hudson5395400824399368369.sh
++ jps
++ wc -l
++ grep surefirebooter
+ ZOMBIE_TESTS_COUNT=0
+ [[ 0 != 0 ]]
+ echo 'We'\''re ok: there is no zombie test'
We're ok: there is no zombie test
POST BUILD TASK : SUCCESS
END OF POST BUILD TASK : 0
Archiving artifacts
Sending artifact delta relative to HBase-0.98 #1011
Archived 1440 artifacts
Archive block size is 32768
Received 4 blocks and 211920049 bytes
Compression is 0.1%
Took 1 min 26 sec
Recording test results
Updating HBASE-13854

Mime
View raw message