hbase-builds mailing list archives

Site index · List index
Message view « Date » · « Thread »
Top « Date » · « Thread »
From Apache Jenkins Server <jenk...@builds.apache.org>
Subject Build failed in Jenkins: HBase-1.1 #532
Date Tue, 09 Jun 2015 19:20:25 GMT
See <https://builds.apache.org/job/HBase-1.1/532/changes>

Changes:

[jerryjch] HBASE-13845 Expire of one region server carrying meta can bring down the master

------------------------------------------
[...truncated 2207 lines...]
[INFO] Building jar: <https://builds.apache.org/job/HBase-1.1/ws/hbase-testing-util/target/hbase-testing-util-1.1.1-SNAPSHOT.jar>
[INFO] 
[INFO] --- maven-install-plugin:2.3.1:install (default-install) @ hbase-testing-util ---
[INFO] Installing <https://builds.apache.org/job/HBase-1.1/ws/hbase-testing-util/target/hbase-testing-util-1.1.1-SNAPSHOT.jar>
to /home/jenkins/.m2/repository/org/apache/hbase/hbase-testing-util/1.1.1-SNAPSHOT/hbase-testing-util-1.1.1-SNAPSHOT.jar
[INFO] Installing <https://builds.apache.org/job/HBase-1.1/ws/hbase-testing-util/pom.xml>
to /home/jenkins/.m2/repository/org/apache/hbase/hbase-testing-util/1.1.1-SNAPSHOT/hbase-testing-util-1.1.1-SNAPSHOT.pom
[INFO] Installing <https://builds.apache.org/job/HBase-1.1/ws/hbase-testing-util/target/hbase-testing-util-1.1.1-SNAPSHOT-tests.jar>
to /home/jenkins/.m2/repository/org/apache/hbase/hbase-testing-util/1.1.1-SNAPSHOT/hbase-testing-util-1.1.1-SNAPSHOT-tests.jar
[INFO]                                                                         
[INFO] ------------------------------------------------------------------------
[INFO] Building HBase - Thrift 1.1.1-SNAPSHOT
[INFO] ------------------------------------------------------------------------
[INFO] 
[INFO] --- maven-enforcer-plugin:1.0.1:enforce (enforce) @ hbase-thrift ---
[INFO] 
[INFO] --- jacoco-maven-plugin:0.6.2.201302030002:prepare-agent (prepare-agent) @ hbase-thrift
---
[INFO] Skipping JaCoCo execution
[INFO] argLine set to 
[INFO] 
[INFO] --- maven-antrun-plugin:1.6:run (generate) @ hbase-thrift ---
[INFO] Executing tasks

main:
    [mkdir] Created dir: <https://builds.apache.org/job/HBase-1.1/ws/hbase-thrift/target/hbase-webapps>
     [copy] Copying 17 files to <https://builds.apache.org/job/HBase-1.1/ws/hbase-thrift/target/hbase-webapps>
log4j:WARN No appenders could be found for logger (org.mortbay.log).
log4j:WARN Please initialize the log4j system properly.
log4j:WARN See http://logging.apache.org/log4j/1.2/faq.html#noconfig for more info.
    [mkdir] Created dir: <https://builds.apache.org/job/HBase-1.1/ws/hbase-thrift/target/hbase-webapps/thrift/WEB-INF>
[INFO] Executed tasks
[INFO] 
[INFO] --- build-helper-maven-plugin:1.9.1:add-source (jspcSource-packageInfo-source) @ hbase-thrift
---
[INFO] Source directory: <https://builds.apache.org/job/HBase-1.1/ws/hbase-thrift/target/generated-sources/java>
added.
[INFO] 
[INFO] --- maven-remote-resources-plugin:1.4:process (default) @ hbase-thrift ---
[INFO] 
[INFO] --- maven-resources-plugin:2.6:resources (default-resources) @ hbase-thrift ---
[INFO] Using 'UTF-8' encoding to copy filtered resources.
[INFO] Copying 18 resources
[INFO] Copying 3 resources
[INFO] 
[INFO] --- maven-compiler-plugin:2.5.1:compile (default-compile) @ hbase-thrift ---
[INFO] Compiling 50 source files to <https://builds.apache.org/job/HBase-1.1/ws/hbase-thrift/target/classes>
[INFO] 
[INFO] --- maven-dependency-plugin:2.1:build-classpath (create-mrapp-generated-classpath)
@ hbase-thrift ---
[INFO] Wrote classpath file '<https://builds.apache.org/job/HBase-1.1/ws/hbase-thrift/target/test-classes/mrapp-generated-classpath'.>
[INFO] 
[INFO] --- maven-resources-plugin:2.6:testResources (default-testResources) @ hbase-thrift
---
[INFO] Using 'UTF-8' encoding to copy filtered resources.
[INFO] skip non existing resourceDirectory <https://builds.apache.org/job/HBase-1.1/ws/hbase-thrift/src/test/resources>
[INFO] Copying 3 resources
[INFO] 
[INFO] --- maven-compiler-plugin:2.5.1:testCompile (default-testCompile) @ hbase-thrift ---
[INFO] Compiling 6 source files to <https://builds.apache.org/job/HBase-1.1/ws/hbase-thrift/target/test-classes>
[INFO] 
[INFO] --- maven-surefire-plugin:2.18:test (default-test) @ hbase-thrift ---
[INFO] Surefire report directory: <https://builds.apache.org/job/HBase-1.1/ws/hbase-thrift/target/surefire-reports>
[INFO] Using configured provider org.apache.maven.surefire.junitcore.JUnitCoreProvider
[INFO] parallel='none', perCoreThreadCount=true, threadCount=0, useUnlimitedThreads=false,
threadCountSuites=0, threadCountClasses=0, threadCountMethods=0, parallelOptimized=true

-------------------------------------------------------
 T E S T S
-------------------------------------------------------
Running org.apache.hadoop.hbase.thrift2.TestThriftHBaseServiceHandler
Tests run: 21, Failures: 0, Errors: 0, Skipped: 0, Time elapsed: 7.789 sec - in org.apache.hadoop.hbase.thrift2.TestThriftHBaseServiceHandler
Running org.apache.hadoop.hbase.thrift2.TestThriftHBaseServiceHandlerWithLabels
Tests run: 6, Failures: 0, Errors: 0, Skipped: 0, Time elapsed: 7.139 sec - in org.apache.hadoop.hbase.thrift2.TestThriftHBaseServiceHandlerWithLabels
Running org.apache.hadoop.hbase.thrift.TestCallQueue
Tests run: 18, Failures: 0, Errors: 0, Skipped: 0, Time elapsed: 0.361 sec - in org.apache.hadoop.hbase.thrift.TestCallQueue
Running org.apache.hadoop.hbase.thrift.TestThriftHttpServer
Tests run: 1, Failures: 0, Errors: 1, Skipped: 0, Time elapsed: 609.177 sec <<< FAILURE!
- in org.apache.hadoop.hbase.thrift.TestThriftHttpServer
testRunThriftServer(org.apache.hadoop.hbase.thrift.TestThriftHttpServer)  Time elapsed: 600.018
sec  <<< ERROR!
java.lang.Exception: test timed out after 600000 milliseconds
	at java.net.SocketInputStream.socketRead0(Native Method)
	at java.net.SocketInputStream.read(SocketInputStream.java:152)
	at java.net.SocketInputStream.read(SocketInputStream.java:122)
	at java.io.BufferedInputStream.fill(BufferedInputStream.java:235)
	at java.io.BufferedInputStream.read1(BufferedInputStream.java:275)
	at java.io.BufferedInputStream.read(BufferedInputStream.java:334)
	at sun.net.www.http.HttpClient.parseHTTPHeader(HttpClient.java:687)
	at sun.net.www.http.HttpClient.parseHTTP(HttpClient.java:633)
	at sun.net.www.protocol.http.HttpURLConnection.getInputStream(HttpURLConnection.java:1323)
	at java.net.HttpURLConnection.getResponseCode(HttpURLConnection.java:468)
	at org.apache.thrift.transport.THttpClient.flush(THttpClient.java:331)
	at org.apache.thrift.TServiceClient.sendBase(TServiceClient.java:65)
	at org.apache.hadoop.hbase.thrift.generated.Hbase$Client.send_getTableNames(Hbase.java:897)
	at org.apache.hadoop.hbase.thrift.generated.Hbase$Client.getTableNames(Hbase.java:890)
	at org.apache.hadoop.hbase.thrift.TestThriftServer.createTestTables(TestThriftServer.java:230)
	at org.apache.hadoop.hbase.thrift.TestThriftHttpServer.talkToThriftServer(TestThriftHttpServer.java:143)
	at org.apache.hadoop.hbase.thrift.TestThriftHttpServer.testRunThriftServer(TestThriftHttpServer.java:119)

Tests run: 1, Failures: 0, Errors: 1, Skipped: 0, Time elapsed: 631.53 sec <<< FAILURE!
- in org.apache.hadoop.hbase.thrift.TestThriftHttpServer
testRunThriftServer(org.apache.hadoop.hbase.thrift.TestThriftHttpServer)  Time elapsed: 10.048
sec  <<< ERROR!
java.lang.Exception: java.net.BindException: Port in use: 0.0.0.0:9095
	at org.apache.hadoop.hbase.thrift.TestThriftHttpServer.stopHttpServerThread(TestThriftHttpServer.java:159)
	at org.apache.hadoop.hbase.thrift.TestThriftHttpServer.testRunThriftServer(TestThriftHttpServer.java:123)
Caused by: java.net.BindException: Port in use: 0.0.0.0:9095
	at org.apache.hadoop.hbase.http.HttpServer.openListeners(HttpServer.java:1014)
	at org.apache.hadoop.hbase.http.HttpServer.start(HttpServer.java:950)
	at org.apache.hadoop.hbase.http.InfoServer.start(InfoServer.java:90)
	at org.apache.hadoop.hbase.thrift.ThriftServer.doMain(ThriftServer.java:102)
	at org.apache.hadoop.hbase.thrift.TestThriftHttpServer$1.run(TestThriftHttpServer.java:89)
	at java.lang.Thread.run(Thread.java:744)
Caused by: java.net.BindException: Address already in use
	at sun.nio.ch.Net.bind0(Native Method)
	at sun.nio.ch.Net.bind(Net.java:444)
	at sun.nio.ch.Net.bind(Net.java:436)
	at sun.nio.ch.ServerSocketChannelImpl.bind(ServerSocketChannelImpl.java:214)
	at sun.nio.ch.ServerSocketAdaptor.bind(ServerSocketAdaptor.java:74)
	at org.mortbay.jetty.nio.SelectChannelConnector.open(SelectChannelConnector.java:216)
	at org.apache.hadoop.hbase.http.HttpServer.openListeners(HttpServer.java:1009)
	at org.apache.hadoop.hbase.http.HttpServer.start(HttpServer.java:950)
	at org.apache.hadoop.hbase.http.InfoServer.start(InfoServer.java:90)
	at org.apache.hadoop.hbase.thrift.ThriftServer.doMain(ThriftServer.java:102)
	at org.apache.hadoop.hbase.thrift.TestThriftHttpServer$1.run(TestThriftHttpServer.java:89)
	at java.lang.Thread.run(Thread.java:744)

Tests run: 1, Failures: 0, Errors: 1, Skipped: 0, Time elapsed: 653.923 sec <<< FAILURE!
- in org.apache.hadoop.hbase.thrift.TestThriftHttpServer
testRunThriftServer(org.apache.hadoop.hbase.thrift.TestThriftHttpServer)  Time elapsed: 10.042
sec  <<< ERROR!
java.lang.Exception: java.net.BindException: Port in use: 0.0.0.0:9095
	at org.apache.hadoop.hbase.thrift.TestThriftHttpServer.stopHttpServerThread(TestThriftHttpServer.java:159)
	at org.apache.hadoop.hbase.thrift.TestThriftHttpServer.testRunThriftServer(TestThriftHttpServer.java:123)
Caused by: java.net.BindException: Port in use: 0.0.0.0:9095
	at org.apache.hadoop.hbase.http.HttpServer.openListeners(HttpServer.java:1014)
	at org.apache.hadoop.hbase.http.HttpServer.start(HttpServer.java:950)
	at org.apache.hadoop.hbase.http.InfoServer.start(InfoServer.java:90)
	at org.apache.hadoop.hbase.thrift.ThriftServer.doMain(ThriftServer.java:102)
	at org.apache.hadoop.hbase.thrift.TestThriftHttpServer$1.run(TestThriftHttpServer.java:89)
	at java.lang.Thread.run(Thread.java:744)
Caused by: java.net.BindException: Address already in use
	at sun.nio.ch.Net.bind0(Native Method)
	at sun.nio.ch.Net.bind(Net.java:444)
	at sun.nio.ch.Net.bind(Net.java:436)
	at sun.nio.ch.ServerSocketChannelImpl.bind(ServerSocketChannelImpl.java:214)
	at sun.nio.ch.ServerSocketAdaptor.bind(ServerSocketAdaptor.java:74)
	at org.mortbay.jetty.nio.SelectChannelConnector.open(SelectChannelConnector.java:216)
	at org.apache.hadoop.hbase.http.HttpServer.openListeners(HttpServer.java:1009)
	at org.apache.hadoop.hbase.http.HttpServer.start(HttpServer.java:950)
	at org.apache.hadoop.hbase.http.InfoServer.start(InfoServer.java:90)
	at org.apache.hadoop.hbase.thrift.ThriftServer.doMain(ThriftServer.java:102)
	at org.apache.hadoop.hbase.thrift.TestThriftHttpServer$1.run(TestThriftHttpServer.java:89)
	at java.lang.Thread.run(Thread.java:744)

Running org.apache.hadoop.hbase.thrift.TestThriftServer
Tests run: 1, Failures: 0, Errors: 0, Skipped: 0, Time elapsed: 89.125 sec - in org.apache.hadoop.hbase.thrift.TestThriftServer
Running org.apache.hadoop.hbase.thrift.TestThriftServerCmdLine
Tests run: 32, Failures: 0, Errors: 0, Skipped: 0, Time elapsed: 59.056 sec - in org.apache.hadoop.hbase.thrift.TestThriftServerCmdLine

Results :


Tests in error: 
org.apache.hadoop.hbase.thrift.TestThriftHttpServer.testRunThriftServer(org.apache.hadoop.hbase.thrift.TestThriftHttpServer)
  Run 1: TestThriftHttpServer.testRunThriftServer:119->talkToThriftServer:143 ยป  test
t...
  Run 2: TestThriftHttpServer.testRunThriftServer:123->stopHttpServerThread:159  java.n...
  Run 3: TestThriftHttpServer.testRunThriftServer:123->stopHttpServerThread:159  java.n...



Tests run: 79, Failures: 0, Errors: 1, Skipped: 0

[INFO] ------------------------------------------------------------------------
[INFO] Reactor Summary:
[INFO] 
[INFO] HBase ............................................. SUCCESS [3.084s]
[INFO] HBase - Checkstyle ................................ SUCCESS [0.625s]
[INFO] HBase - Annotations ............................... SUCCESS [0.906s]
[INFO] HBase - Protocol .................................. SUCCESS [12.400s]
[INFO] HBase - Common .................................... SUCCESS [1:23.876s]
[INFO] HBase - Procedure ................................. SUCCESS [1:12.356s]
[INFO] HBase - Client .................................... SUCCESS [1:21.471s]
[INFO] HBase - Hadoop Compatibility ...................... SUCCESS [7.064s]
[INFO] HBase - Hadoop Two Compatibility .................. SUCCESS [6.328s]
[INFO] HBase - Prefix Tree ............................... SUCCESS [8.821s]
[INFO] HBase - Server .................................... SUCCESS [1:25:24.014s]
[INFO] HBase - Testing Util .............................. SUCCESS [1.090s]
[INFO] HBase - Thrift .................................... FAILURE [14:31.964s]
[INFO] HBase - Rest ...................................... SKIPPED
[INFO] HBase - Shell ..................................... SKIPPED
[INFO] HBase - Integration Tests ......................... SKIPPED
[INFO] HBase - Examples .................................. SKIPPED
[INFO] HBase - Assembly .................................. SKIPPED
[INFO] HBase - Shaded .................................... SKIPPED
[INFO] HBase - Shaded - Client ........................... SKIPPED
[INFO] HBase - Shaded - Server ........................... SKIPPED
[INFO] ------------------------------------------------------------------------
[INFO] BUILD FAILURE
[INFO] ------------------------------------------------------------------------
[INFO] Total time: 1:44:36.069s
[INFO] Finished at: Tue Jun 09 19:16:35 UTC 2015
[INFO] Final Memory: 102M/556M
[INFO] ------------------------------------------------------------------------
[ERROR] Failed to execute goal org.apache.maven.plugins:maven-surefire-plugin:2.18:test (default-test)
on project hbase-thrift: There are test failures.
[ERROR] 
[ERROR] Please refer to <https://builds.apache.org/job/HBase-1.1/ws/hbase-thrift/target/surefire-reports>
for the individual test results.
[ERROR] -> [Help 1]
[ERROR] 
[ERROR] To see the full stack trace of the errors, re-run Maven with the -e switch.
[ERROR] Re-run Maven using the -X switch to enable full debug logging.
[ERROR] 
[ERROR] For more information about the errors and possible solutions, please read the following
articles:
[ERROR] [Help 1] http://cwiki.apache.org/confluence/display/MAVEN/MojoFailureException
[ERROR] 
[ERROR] After correcting the problems, you can resume the build with the command
[ERROR]   mvn <goals> -rf :hbase-thrift
Build step 'Invoke top-level Maven targets' marked build as failure
Performing Post build task...
Match found for :.* : True
Logical operation result is TRUE
Running script  :   ZOMBIE_TESTS_COUNT=`jps | grep surefirebooter | wc -l`
  if [[ $ZOMBIE_TESTS_COUNT != 0 ]] ; then
    #It seems sometimes the tests are not dying immediately. Let's give them 10s
    echo "Suspicious java process found - waiting 10s to see if there are just slow to stop"
    sleep 10   
    ZOMBIE_TESTS_COUNT=`jps | grep surefirebooter | wc -l`
    if [[ $ZOMBIE_TESTS_COUNT != 0 ]] ; then
      echo "There are $ZOMBIE_TESTS_COUNT zombie tests, they should have been killed by surefire
but survived"
      echo "************ BEGIN zombies jstack extract"
      ZB_STACK=`jps | grep surefirebooter | cut -d ' ' -f 1 | xargs -n 1 jstack | grep ".test"
| grep "\.java"`
      jps | grep surefirebooter | cut -d ' ' -f 1 | xargs -n 1 jstack
      echo "************ END  zombies jstack extract"
      JIRA_COMMENT="$JIRA_COMMENT

     {color:red}-1 core zombie tests{color}.  There are ${ZOMBIE_TESTS_COUNT} zombie test(s):
${ZB_STACK}"
      BAD=1
      jps | grep surefirebooter | cut -d ' ' -f 1 | xargs kill -9
    else
      echo "We're ok: there is no zombie test, but some tests took some time to stop"
    fi
  else
    echo "We're ok: there is no zombie test"
  fi
[HBase-1.1] $ /bin/bash -xe /tmp/hudson1315331773830072783.sh
++ grep surefirebooter
++ wc -l
++ jps
+ ZOMBIE_TESTS_COUNT=0
+ [[ 0 != 0 ]]
+ echo 'We'\''re ok: there is no zombie test'
We're ok: there is no zombie test
POST BUILD TASK : SUCCESS
END OF POST BUILD TASK : 0
Archiving artifacts
Sending artifact delta relative to HBase-1.1 #530
Archived 2082 artifacts
Archive block size is 32768
Received 28 blocks and 508030747 bytes
Compression is 0.2%
Took 3 min 31 sec
Recording test results
Updating HBASE-13845

Mime
View raw message