hbase-builds mailing list archives

Site index · List index
Message view « Date » · « Thread »
Top « Date » · « Thread »
From Apache Jenkins Server <jenk...@builds.apache.org>
Subject Build failed in Jenkins: HBase-TRUNK #6611
Date Sat, 27 Jun 2015 03:31:51 GMT
See <https://builds.apache.org/job/HBase-TRUNK/6611/changes>

Changes:

[ndimiduk] HBASE-13930 Exclude Findbugs packages from shaded jars

------------------------------------------
[...truncated 4312 lines...]
Running org.apache.hadoop.hbase.regionserver.TestEncryptionRandomKeying
Tests run: 1, Failures: 0, Errors: 0, Skipped: 0, Time elapsed: 1.773 sec - in org.apache.hadoop.hbase.regionserver.TestEncryptionRandomKeying
Running org.apache.hadoop.hbase.TestRegionRebalancing
Tests run: 2, Failures: 0, Errors: 0, Skipped: 0, Time elapsed: 21.74 sec - in org.apache.hadoop.hbase.regionserver.TestEndToEndSplitTransaction
Running org.apache.hadoop.hbase.quotas.TestQuotaThrottle
Tests run: 94, Failures: 0, Errors: 0, Skipped: 0, Time elapsed: 188.296 sec - in org.apache.hadoop.hbase.regionserver.TestHRegion
Running org.apache.hadoop.hbase.quotas.TestQuotaAdmin
Tests run: 3, Failures: 0, Errors: 0, Skipped: 0, Time elapsed: 4.655 sec - in org.apache.hadoop.hbase.quotas.TestQuotaAdmin
Tests run: 2, Failures: 0, Errors: 0, Skipped: 0, Time elapsed: 40.737 sec - in org.apache.hadoop.hbase.TestRegionRebalancing
Running org.apache.hadoop.hbase.io.encoding.TestEncodedSeekers
Tests run: 12, Failures: 0, Errors: 0, Skipped: 0, Time elapsed: 25.366 sec - in org.apache.hadoop.hbase.quotas.TestQuotaThrottle
Running org.apache.hadoop.hbase.io.encoding.TestDataBlockEncoders
Running org.apache.hadoop.hbase.quotas.TestQuotaTableUtil
Tests run: 3, Failures: 0, Errors: 0, Skipped: 0, Time elapsed: 2.407 sec - in org.apache.hadoop.hbase.quotas.TestQuotaTableUtil
Running org.apache.hadoop.hbase.io.encoding.TestLoadAndSwitchEncodeOnDisk
Tests run: 13, Failures: 0, Errors: 0, Skipped: 0, Time elapsed: 61.509 sec - in org.apache.hadoop.hbase.TestPartialResultsFromClientSide
Running org.apache.hadoop.hbase.io.encoding.TestBufferedDataBlockEncoder
Running org.apache.hadoop.hbase.io.encoding.TestChangingEncoding
Tests run: 1, Failures: 0, Errors: 0, Skipped: 0, Time elapsed: 33.038 sec - in org.apache.hadoop.hbase.io.encoding.TestLoadAndSwitchEncodeOnDisk
Tests run: 2, Failures: 0, Errors: 0, Skipped: 0, Time elapsed: 30.997 sec - in org.apache.hadoop.hbase.io.encoding.TestBufferedDataBlockEncoder
Running org.apache.hadoop.hbase.io.hfile.TestCacheOnWrite
Running org.apache.hadoop.hbase.io.hfile.TestCacheConfig
Tests run: 6, Failures: 0, Errors: 0, Skipped: 0, Time elapsed: 2.38 sec - in org.apache.hadoop.hbase.io.hfile.TestCacheConfig
Running org.apache.hadoop.hbase.io.hfile.TestHFileSeek
Tests run: 1, Failures: 0, Errors: 0, Skipped: 0, Time elapsed: 3.243 sec - in org.apache.hadoop.hbase.io.hfile.TestHFileSeek
Running org.apache.hadoop.hbase.io.hfile.TestHFileBlock
Tests run: 3, Failures: 0, Errors: 0, Skipped: 0, Time elapsed: 148.554 sec - in org.apache.hadoop.hbase.io.encoding.TestChangingEncoding
Tests run: 20, Failures: 0, Errors: 0, Skipped: 0, Time elapsed: 169.998 sec - in org.apache.hadoop.hbase.io.encoding.TestEncodedSeekers
Running org.apache.hadoop.hbase.io.hfile.TestForceCacheImportantBlocks
Tests run: 28, Failures: 0, Errors: 0, Skipped: 0, Time elapsed: 91.275 sec - in org.apache.hadoop.hbase.io.hfile.TestHFileBlock
Running org.apache.hadoop.hbase.io.hfile.TestScannerSelectionUsingTTL
Running org.apache.hadoop.hbase.io.hfile.TestHFileBlockIndex
Tests run: 10, Failures: 0, Errors: 0, Skipped: 0, Time elapsed: 10.688 sec - in org.apache.hadoop.hbase.io.hfile.TestHFileBlockIndex
Running org.apache.hadoop.hbase.io.TestFileLink
Tests run: 2, Failures: 0, Errors: 0, Skipped: 0, Time elapsed: 28.17 sec - in org.apache.hadoop.hbase.io.hfile.TestForceCacheImportantBlocks
Tests run: 5, Failures: 0, Errors: 0, Skipped: 0, Time elapsed: 16.087 sec - in org.apache.hadoop.hbase.io.TestFileLink
Running org.apache.hadoop.hbase.security.access.TestAccessController
Running org.apache.hadoop.hbase.security.access.TestTablePermissions
Tests run: 7, Failures: 0, Errors: 0, Skipped: 0, Time elapsed: 16.535 sec - in org.apache.hadoop.hbase.security.access.TestTablePermissions
Tests run: 6, Failures: 0, Errors: 0, Skipped: 0, Time elapsed: 63.978 sec - in org.apache.hadoop.hbase.io.hfile.TestScannerSelectionUsingTTL
Running org.apache.hadoop.hbase.security.access.TestCellACLs
Running org.apache.hadoop.hbase.security.access.TestAccessControlFilter
Tests run: 1, Failures: 0, Errors: 0, Skipped: 0, Time elapsed: 5.285 sec - in org.apache.hadoop.hbase.security.access.TestAccessControlFilter
Tests run: 2, Failures: 0, Errors: 0, Skipped: 0, Time elapsed: 17.835 sec - in org.apache.hadoop.hbase.security.access.TestCellACLs
Running org.apache.hadoop.hbase.security.access.TestNamespaceCommands
Tests run: 56, Failures: 0, Errors: 0, Skipped: 0, Time elapsed: 67.535 sec - in org.apache.hadoop.hbase.security.access.TestAccessController
Tests run: 7, Failures: 0, Errors: 0, Skipped: 0, Time elapsed: 4.672 sec - in org.apache.hadoop.hbase.security.access.TestNamespaceCommands
Running org.apache.hadoop.hbase.security.access.TestCellACLWithMultipleVersions
Running org.apache.hadoop.hbase.security.access.TestAccessController2
Running org.apache.hadoop.hbase.security.access.TestZKPermissionsWatcher
Tests run: 28, Failures: 0, Errors: 0, Skipped: 0, Time elapsed: 308.347 sec - in org.apache.hadoop.hbase.io.encoding.TestDataBlockEncoders
Tests run: 1, Failures: 0, Errors: 0, Skipped: 0, Time elapsed: 4.661 sec - in org.apache.hadoop.hbase.security.access.TestZKPermissionsWatcher
Running org.apache.hadoop.hbase.security.access.TestWithDisabledAuthorization
Running org.apache.hadoop.hbase.security.access.TestScanEarlyTermination
Tests run: 1, Failures: 0, Errors: 0, Skipped: 0, Time elapsed: 6.605 sec - in org.apache.hadoop.hbase.security.access.TestScanEarlyTermination
Tests run: 5, Failures: 0, Errors: 0, Skipped: 0, Time elapsed: 41.931 sec - in org.apache.hadoop.hbase.security.access.TestAccessController2
Running org.apache.hadoop.hbase.security.visibility.TestVisibilityLablesWithGroups
Tests run: 8, Failures: 0, Errors: 0, Skipped: 0, Time elapsed: 53.58 sec - in org.apache.hadoop.hbase.security.access.TestCellACLWithMultipleVersions
Tests run: 1, Failures: 0, Errors: 0, Skipped: 0, Time elapsed: 4.459 sec - in org.apache.hadoop.hbase.security.visibility.TestVisibilityLablesWithGroups
Tests run: 6, Failures: 0, Errors: 0, Skipped: 0, Time elapsed: 36.798 sec - in org.apache.hadoop.hbase.security.access.TestWithDisabledAuthorization
Running org.apache.hadoop.hbase.security.visibility.TestVisibilityLabelsWithDeletes
Running org.apache.hadoop.hbase.security.visibility.TestVisibilityLabelsWithDefaultVisLabelService
Running org.apache.hadoop.hbase.security.visibility.TestVisibilityLabelsWithCustomVisLabService
Running org.apache.hadoop.hbase.security.visibility.TestDefaultScanLabelGeneratorStack
Tests run: 1, Failures: 0, Errors: 0, Skipped: 0, Time elapsed: 5.062 sec - in org.apache.hadoop.hbase.security.visibility.TestDefaultScanLabelGeneratorStack
Tests run: 20, Failures: 0, Errors: 0, Skipped: 0, Time elapsed: 28.881 sec - in org.apache.hadoop.hbase.security.visibility.TestVisibilityLabelsWithCustomVisLabService
Running org.apache.hadoop.hbase.security.visibility.TestVisibilityWithCheckAuths
Tests run: 24, Failures: 0, Errors: 0, Skipped: 0, Time elapsed: 31.96 sec - in org.apache.hadoop.hbase.security.visibility.TestVisibilityLabelsWithDefaultVisLabelService
Tests run: 2, Failures: 0, Errors: 0, Skipped: 0, Time elapsed: 5.058 sec - in org.apache.hadoop.hbase.security.visibility.TestVisibilityWithCheckAuths
Running org.apache.hadoop.hbase.security.visibility.TestVisibilityLabelsWithDistributedLogReplay
Running org.apache.hadoop.hbase.security.visibility.TestVisibilityLabelsOpWithDifferentUsersNoACL
Tests run: 1, Failures: 0, Errors: 0, Skipped: 0, Time elapsed: 1.838 sec - in org.apache.hadoop.hbase.security.visibility.TestVisibilityLabelsOpWithDifferentUsersNoACL
Running org.apache.hadoop.hbase.security.visibility.TestVisibilityLabelsWithSLGStack
Tests run: 1, Failures: 0, Errors: 0, Skipped: 0, Time elapsed: 4.457 sec - in org.apache.hadoop.hbase.security.visibility.TestVisibilityLabelsWithSLGStack
Running org.apache.hadoop.hbase.security.visibility.TestVisibilityLabelsReplication
Running org.apache.hadoop.hbase.security.visibility.TestEnforcingScanLabelGenerator
Tests run: 1, Failures: 0, Errors: 0, Skipped: 0, Time elapsed: 4.267 sec - in org.apache.hadoop.hbase.security.visibility.TestEnforcingScanLabelGenerator
Running org.apache.hadoop.hbase.security.visibility.TestVisibilityLabelReplicationWithExpAsString
Tests run: 24, Failures: 0, Errors: 0, Skipped: 0, Time elapsed: 32.294 sec - in org.apache.hadoop.hbase.security.visibility.TestVisibilityLabelsWithDistributedLogReplay
Tests run: 39, Failures: 0, Errors: 0, Skipped: 0, Time elapsed: 85.678 sec - in org.apache.hadoop.hbase.security.visibility.TestVisibilityLabelsWithDeletes
Tests run: 1, Failures: 0, Errors: 0, Skipped: 0, Time elapsed: 27.994 sec - in org.apache.hadoop.hbase.security.visibility.TestVisibilityLabelsReplication
Running org.apache.hadoop.hbase.security.visibility.TestVisibilityLabelsWithACL
Running org.apache.hadoop.hbase.security.visibility.TestWithDisabledAuthorization
Running org.apache.hadoop.hbase.security.token.TestZKSecretWatcher
Tests run: 1, Failures: 0, Errors: 0, Skipped: 0, Time elapsed: 28.021 sec - in org.apache.hadoop.hbase.security.visibility.TestVisibilityLabelReplicationWithExpAsString
Tests run: 2, Failures: 0, Errors: 0, Skipped: 0, Time elapsed: 3.429 sec - in org.apache.hadoop.hbase.security.visibility.TestWithDisabledAuthorization
Tests run: 5, Failures: 0, Errors: 0, Skipped: 0, Time elapsed: 7.938 sec - in org.apache.hadoop.hbase.security.visibility.TestVisibilityLabelsWithACL
Running org.apache.hadoop.hbase.security.token.TestTokenAuthentication
Tests run: 3, Failures: 0, Errors: 0, Skipped: 0, Time elapsed: 0.814 sec - in org.apache.hadoop.hbase.security.token.TestTokenAuthentication
Tests run: 1, Failures: 0, Errors: 0, Skipped: 0, Time elapsed: 13.258 sec - in org.apache.hadoop.hbase.security.token.TestZKSecretWatcher
Running org.apache.hadoop.hbase.TestHBaseOnOtherDfsCluster
Tests run: 1, Failures: 0, Errors: 0, Skipped: 0, Time elapsed: 16.157 sec - in org.apache.hadoop.hbase.TestHBaseOnOtherDfsCluster
Running org.apache.hadoop.hbase.security.token.TestGenerateDelegationToken
Tests run: 1, Failures: 0, Errors: 0, Skipped: 0, Time elapsed: 2.73 sec - in org.apache.hadoop.hbase.security.token.TestGenerateDelegationToken
Tests run: 216, Failures: 0, Errors: 0, Skipped: 0, Time elapsed: 503.823 sec - in org.apache.hadoop.hbase.io.hfile.TestCacheOnWrite

Results :

Failed tests: 
  TestIOFencing.testFencingAroundCompactionAfterWALSync:240->doTest:338 After compaction,
does not exist: hdfs://localhost:48952/user/jenkins/test-data/ac0b2e2c-2da6-4fc2-9f30-d72ff7de3820/data/default/tabletest/e0f12fcfa7128a5d95598d71797d4cbe/family/f878c1c3aa99455b8a1667bcb703b20c

Tests in error: 
  TestRegionReplicaReplicationEndpointNoMaster.beforeClass:134 ยป NullPointer


Tests run: 2453, Failures: 1, Errors: 1, Skipped: 18

[INFO] ------------------------------------------------------------------------
[INFO] Reactor Summary:
[INFO] 
[INFO] HBase ............................................. SUCCESS [  2.924 s]
[INFO] HBase - Checkstyle ................................ SUCCESS [  0.634 s]
[INFO] HBase - Annotations ............................... SUCCESS [  0.218 s]
[INFO] HBase - Protocol .................................. SUCCESS [  2.654 s]
[INFO] HBase - Common .................................... SUCCESS [02:39 min]
[INFO] HBase - Procedure ................................. SUCCESS [02:05 min]
[INFO] HBase - Client .................................... SUCCESS [02:11 min]
[INFO] HBase - Hadoop Compatibility ...................... SUCCESS [ 14.254 s]
[INFO] HBase - Hadoop Two Compatibility .................. SUCCESS [ 17.374 s]
[INFO] HBase - Prefix Tree ............................... SUCCESS [ 21.964 s]
[INFO] HBase - Server .................................... FAILURE [  01:59 h]
[INFO] HBase - Testing Util .............................. SKIPPED
[INFO] HBase - Thrift .................................... SKIPPED
[INFO] HBase - Shell ..................................... SKIPPED
[INFO] HBase - Integration Tests ......................... SKIPPED
[INFO] HBase - Examples .................................. SKIPPED
[INFO] HBase - Rest ...................................... SKIPPED
[INFO] HBase - Assembly .................................. SKIPPED
[INFO] HBase - Shaded .................................... SKIPPED
[INFO] HBase - Shaded - Client ........................... SKIPPED
[INFO] HBase - Shaded - Server ........................... SKIPPED
[INFO] ------------------------------------------------------------------------
[INFO] BUILD FAILURE
[INFO] ------------------------------------------------------------------------
[INFO] Total time: 02:07 h
[INFO] Finished at: 2015-06-27T03:24:19+00:00
[INFO] Final Memory: 61M/566M
[INFO] ------------------------------------------------------------------------
[ERROR] Failed to execute goal org.apache.maven.plugins:maven-surefire-plugin:2.18:test (secondPartTestsExecution)
on project hbase-server: ExecutionException: java.lang.RuntimeException: The forked VM terminated
without properly saying goodbye. VM crash or System.exit called?
[ERROR] Command was /bin/sh -c cd <https://builds.apache.org/job/HBase-TRUNK/ws/hbase-server>
&& /home/jenkins/jenkins-slave/tools/hudson.model.JDK/jdk-1.7u51/jre/bin/java -enableassertions
-XX:MaxDirectMemorySize=1G -Xmx2800m -XX:MaxPermSize=256m -Djava.security.egd=file:/dev/./urandom
-Djava.net.preferIPv4Stack=true -Djava.awt.headless=true '-javaagent:/home/jenkins/.m2/repository/org/jacoco/org.jacoco.agent/0.7.5.201505241946/org.jacoco.agent-0.7.5.201505241946-runtime.jar=destfile=<https://builds.apache.org/job/HBase-TRUNK/ws/hbase-server/target/jacoco.exec,excludes=**/generated/**/*.class'>
-jar <https://builds.apache.org/job/HBase-TRUNK/ws/hbase-server/target/surefire/surefirebooter2958931988934960925.jar>
<https://builds.apache.org/job/HBase-TRUNK/ws/hbase-server/target/surefire/surefire4689996704690928061tmp>
<https://builds.apache.org/job/HBase-TRUNK/ws/hbase-server/target/surefire/surefire_10561521984819841843570tmp>
[ERROR] -> [Help 1]
[ERROR] 
[ERROR] To see the full stack trace of the errors, re-run Maven with the -e switch.
[ERROR] Re-run Maven using the -X switch to enable full debug logging.
[ERROR] 
[ERROR] For more information about the errors and possible solutions, please read the following
articles:
[ERROR] [Help 1] http://cwiki.apache.org/confluence/display/MAVEN/MojoFailureException
[ERROR] 
[ERROR] After correcting the problems, you can resume the build with the command
[ERROR]   mvn <goals> -rf :hbase-server
Build step 'Invoke top-level Maven targets' marked build as failure
Performing Post build task...
Match found for :.* : True
Logical operation result is TRUE
Running script  :   ZOMBIE_TESTS_COUNT=`jps | grep surefirebooter | wc -l`
  if [[ $ZOMBIE_TESTS_COUNT != 0 ]] ; then
    #It seems sometimes the tests are not dying immediately. Let's give them 10s
    echo "Suspicious java process found - waiting 10s to see if there are just slow to stop"
    sleep 10   
    ZOMBIE_TESTS_COUNT=`jps | grep surefirebooter | wc -l`
    if [[ $ZOMBIE_TESTS_COUNT != 0 ]] ; then
      echo "There are $ZOMBIE_TESTS_COUNT zombie tests, they should have been killed by surefire
but survived"
      echo "************ BEGIN zombies jstack extract"
      ZB_STACK=`jps | grep surefirebooter | cut -d ' ' -f 1 | xargs -n 1 jstack | grep ".test"
| grep "\.java"`
      jps | grep surefirebooter | cut -d ' ' -f 1 | xargs -n 1 jstack
      echo "************ END  zombies jstack extract"
      JIRA_COMMENT="$JIRA_COMMENT

     {color:red}-1 core zombie tests{color}.  There are ${ZOMBIE_TESTS_COUNT} zombie test(s):
${ZB_STACK}"
      BAD=1
      jps | grep surefirebooter | cut -d ' ' -f 1 | xargs kill -9
    else
      echo "We're ok: there is no zombie test, but some tests took some time to stop"
    fi
  else
    echo "We're ok: there is no zombie test"
  fi
[HBase-TRUNK] $ /bin/bash -xe /tmp/hudson3988179574690123052.sh
++ jps
++ grep surefirebooter
++ wc -l
+ ZOMBIE_TESTS_COUNT=0
+ [[ 0 != 0 ]]
+ echo 'We'\''re ok: there is no zombie test'
We're ok: there is no zombie test
POST BUILD TASK : SUCCESS
END OF POST BUILD TASK : 0
Archiving artifacts
Sending artifact delta relative to HBase-TRUNK #6580
Archived 2222 artifacts
Archive block size is 32768
Received 55 blocks and 424320594 bytes
Compression is 0.4%
Took 2 min 51 sec
Recording test results
[FINDBUGS] Collecting findbugs analysis files...
[FINDBUGS] Finding all files that match the pattern **/findbugs.xml,**/findbugsXml.xml
[FINDBUGS] Parsing 24 files in <https://builds.apache.org/job/HBase-TRUNK/ws/>
[FINDBUGS] Successfully parsed file <https://builds.apache.org/job/HBase-TRUNK/6611/artifact/hbase-annotations/target/findbugs.xml>
of module  with 0 warnings.
[FINDBUGS] Successfully parsed file <https://builds.apache.org/job/HBase-TRUNK/6611/artifact/hbase-annotations/target/findbugsXml.xml>
of module  with 0 warnings.
[FINDBUGS] Successfully parsed file <https://builds.apache.org/job/HBase-TRUNK/6611/artifact/hbase-client/target/findbugs.xml>
of module  with 0 warnings.
[FINDBUGS] Successfully parsed file <https://builds.apache.org/job/HBase-TRUNK/6611/artifact/hbase-client/target/findbugsXml.xml>
of module  with 10 warnings.
[FINDBUGS] Successfully parsed file <https://builds.apache.org/job/HBase-TRUNK/6611/artifact/hbase-common/target/findbugs.xml>
of module  with 0 warnings.
[FINDBUGS] Successfully parsed file <https://builds.apache.org/job/HBase-TRUNK/6611/artifact/hbase-common/target/findbugsXml.xml>
of module  with 1 warnings.
[FINDBUGS] Successfully parsed file <https://builds.apache.org/job/HBase-TRUNK/6611/artifact/hbase-examples/target/findbugs.xml>
of module  with 0 warnings.
[FINDBUGS] Successfully parsed file <https://builds.apache.org/job/HBase-TRUNK/6611/artifact/hbase-examples/target/findbugsXml.xml>
of module  with 0 warnings.
[FINDBUGS] Successfully parsed file <https://builds.apache.org/job/HBase-TRUNK/6611/artifact/hbase-hadoop-compat/target/findbugs.xml>
of module  with 0 warnings.
[FINDBUGS] Successfully parsed file <https://builds.apache.org/job/HBase-TRUNK/6611/artifact/hbase-hadoop-compat/target/findbugsXml.xml>
of module  with 0 warnings.
[FINDBUGS] Successfully parsed file <https://builds.apache.org/job/HBase-TRUNK/6611/artifact/hbase-hadoop2-compat/target/findbugs.xml>
of module  with 0 warnings.
[FINDBUGS] Successfully parsed file <https://builds.apache.org/job/HBase-TRUNK/6611/artifact/hbase-hadoop2-compat/target/findbugsXml.xml>
of module  with 0 warnings.
[FINDBUGS] Successfully parsed file <https://builds.apache.org/job/HBase-TRUNK/6611/artifact/hbase-prefix-tree/target/findbugs.xml>
of module  with 0 warnings.
[FINDBUGS] Successfully parsed file <https://builds.apache.org/job/HBase-TRUNK/6611/artifact/hbase-prefix-tree/target/findbugsXml.xml>
of module  with 0 warnings.
[FINDBUGS] Successfully parsed file <https://builds.apache.org/job/HBase-TRUNK/6611/artifact/hbase-procedure/target/findbugs.xml>
of module  with 0 warnings.
[FINDBUGS] Successfully parsed file <https://builds.apache.org/job/HBase-TRUNK/6611/artifact/hbase-procedure/target/findbugsXml.xml>
of module  with 0 warnings.
[FINDBUGS] Successfully parsed file <https://builds.apache.org/job/HBase-TRUNK/6611/artifact/hbase-protocol/target/findbugs.xml>
of module  with 0 warnings.
[FINDBUGS] Successfully parsed file <https://builds.apache.org/job/HBase-TRUNK/6611/artifact/hbase-protocol/target/findbugsXml.xml>
of module  with 0 warnings.
[FINDBUGS] Successfully parsed file <https://builds.apache.org/job/HBase-TRUNK/6611/artifact/hbase-rest/target/findbugs.xml>
of module  with 0 warnings.
[FINDBUGS] Successfully parsed file <https://builds.apache.org/job/HBase-TRUNK/6611/artifact/hbase-rest/target/findbugsXml.xml>
of module  with 2 warnings.
[FINDBUGS] Successfully parsed file <https://builds.apache.org/job/HBase-TRUNK/6611/artifact/hbase-server/target/findbugs.xml>
of module  with 0 warnings.
[FINDBUGS] Successfully parsed file <https://builds.apache.org/job/HBase-TRUNK/6611/artifact/hbase-server/target/findbugsXml.xml>
of module  with 74 warnings.
[FINDBUGS] Successfully parsed file <https://builds.apache.org/job/HBase-TRUNK/6611/artifact/hbase-thrift/target/findbugs.xml>
of module  with 0 warnings.
[FINDBUGS] Successfully parsed file <https://builds.apache.org/job/HBase-TRUNK/6611/artifact/hbase-thrift/target/findbugsXml.xml>
of module  with 0 warnings.
[FINDBUGS] Computing warning deltas based on reference build #6580
[CHECKSTYLE] Collecting checkstyle analysis files...
[CHECKSTYLE] Finding all files that match the pattern **/checkstyle-result.xml
[CHECKSTYLE] Parsing 21 files in <https://builds.apache.org/job/HBase-TRUNK/ws/>
[CHECKSTYLE] Successfully parsed file <https://builds.apache.org/job/HBase-TRUNK/6611/artifact/hbase-annotations/target/checkstyle-result.xml>
of module  with 0 warnings.
[CHECKSTYLE] Successfully parsed file <https://builds.apache.org/job/HBase-TRUNK/6611/artifact/hbase-assembly/target/checkstyle-result.xml>
of module  with 0 warnings.
[CHECKSTYLE] Successfully parsed file <https://builds.apache.org/job/HBase-TRUNK/6611/artifact/hbase-checkstyle/target/checkstyle-result.xml>
of module  with 0 warnings.
[CHECKSTYLE] Successfully parsed file <https://builds.apache.org/job/HBase-TRUNK/6611/artifact/hbase-client/target/checkstyle-result.xml>
of module  with 209 warnings.
[CHECKSTYLE] Successfully parsed file <https://builds.apache.org/job/HBase-TRUNK/6611/artifact/hbase-common/target/checkstyle-result.xml>
of module  with 124 warnings.
[CHECKSTYLE] Successfully parsed file <https://builds.apache.org/job/HBase-TRUNK/6611/artifact/hbase-examples/target/checkstyle-result.xml>
of module  with 28 warnings.
[CHECKSTYLE] Successfully parsed file <https://builds.apache.org/job/HBase-TRUNK/6611/artifact/hbase-hadoop-compat/target/checkstyle-result.xml>
of module  with 2 warnings.
[CHECKSTYLE] Successfully parsed file <https://builds.apache.org/job/HBase-TRUNK/6611/artifact/hbase-hadoop2-compat/target/checkstyle-result.xml>
of module  with 47 warnings.
[CHECKSTYLE] Successfully parsed file <https://builds.apache.org/job/HBase-TRUNK/6611/artifact/hbase-it/target/checkstyle-result.xml>
of module  with 0 warnings.
[CHECKSTYLE] Successfully parsed file <https://builds.apache.org/job/HBase-TRUNK/6611/artifact/hbase-prefix-tree/target/checkstyle-result.xml>
of module  with 23 warnings.
[CHECKSTYLE] Successfully parsed file <https://builds.apache.org/job/HBase-TRUNK/6611/artifact/hbase-procedure/target/checkstyle-result.xml>
of module  with 0 warnings.
[CHECKSTYLE] Successfully parsed file <https://builds.apache.org/job/HBase-TRUNK/6611/artifact/hbase-protocol/target/checkstyle-result.xml>
of module  with 2 warnings.
[CHECKSTYLE] Successfully parsed file <https://builds.apache.org/job/HBase-TRUNK/6611/artifact/hbase-rest/target/checkstyle-result.xml>
of module  with 42 warnings.
[CHECKSTYLE] Successfully parsed file <https://builds.apache.org/job/HBase-TRUNK/6611/artifact/hbase-server/target/checkstyle-result.xml>
of module  with 1395 warnings.
[CHECKSTYLE] Successfully parsed file <https://builds.apache.org/job/HBase-TRUNK/6611/artifact/hbase-shaded/hbase-shaded-client/target/checkstyle-result.xml>
of module  with 0 warnings.
[CHECKSTYLE] Successfully parsed file <https://builds.apache.org/job/HBase-TRUNK/6611/artifact/hbase-shaded/hbase-shaded-server/target/checkstyle-result.xml>
of module  with 0 warnings.
[CHECKSTYLE] Successfully parsed file <https://builds.apache.org/job/HBase-TRUNK/6611/artifact/hbase-shaded/target/checkstyle-result.xml>
of module  with 0 warnings.
[CHECKSTYLE] Successfully parsed file <https://builds.apache.org/job/HBase-TRUNK/6611/artifact/hbase-shell/target/checkstyle-result.xml>
of module  with 0 warnings.
[CHECKSTYLE] Successfully parsed file <https://builds.apache.org/job/HBase-TRUNK/6611/artifact/hbase-testing-util/target/checkstyle-result.xml>
of module  with 0 warnings.
[CHECKSTYLE] Successfully parsed file <https://builds.apache.org/job/HBase-TRUNK/6611/artifact/hbase-thrift/target/checkstyle-result.xml>
of module  with 27 warnings.
[CHECKSTYLE] Successfully parsed file <https://builds.apache.org/job/HBase-TRUNK/6611/artifact/target/checkstyle-result.xml>
of module  with 0 warnings.
[CHECKSTYLE] Computing warning deltas based on reference build #6580
Updating HBASE-13930

Mime
View raw message