hbase-builds mailing list archives

Site index · List index
Message view « Date » · « Thread »
Top « Date » · « Thread »
From Apache Jenkins Server <jenk...@builds.apache.org>
Subject Build failed in Jenkins: HBase-TRUNK #6606
Date Fri, 26 Jun 2015 15:05:30 GMT
See <https://builds.apache.org/job/HBase-TRUNK/6606/changes>

Changes:

[busbey] HBASE-13963 Do not leak jdk.tools dependency from hbase-annotations

------------------------------------------
[...truncated 3555 lines...]
Tests run: 3, Failures: 0, Errors: 0, Skipped: 0, Time elapsed: 1.329 sec - in org.apache.hadoop.hbase.wal.TestWALMethods
Running org.apache.hadoop.hbase.master.TestHMasterCommandLine
Tests run: 1, Failures: 0, Errors: 0, Skipped: 0, Time elapsed: 0.349 sec - in org.apache.hadoop.hbase.master.TestHMasterCommandLine
Running org.apache.hadoop.hbase.master.procedure.TestMasterProcedureQueue
Tests run: 5, Failures: 0, Errors: 0, Skipped: 0, Time elapsed: 18.896 sec - in org.apache.hadoop.hbase.master.procedure.TestMasterProcedureQueue
Running org.apache.hadoop.hbase.master.TestRegionStates
Tests run: 2, Failures: 0, Errors: 0, Skipped: 0, Time elapsed: 1.534 sec - in org.apache.hadoop.hbase.master.TestRegionStates
Running org.apache.hadoop.hbase.master.TestRegionPlan
Tests run: 1, Failures: 0, Errors: 0, Skipped: 0, Time elapsed: 0.489 sec - in org.apache.hadoop.hbase.master.TestRegionPlan
Running org.apache.hadoop.hbase.master.normalizer.TestSimpleRegionNormalizer
Tests run: 6, Failures: 0, Errors: 0, Skipped: 0, Time elapsed: 1.325 sec - in org.apache.hadoop.hbase.master.normalizer.TestSimpleRegionNormalizer
Running org.apache.hadoop.hbase.master.TestClockSkewDetection
Tests run: 1, Failures: 0, Errors: 0, Skipped: 0, Time elapsed: 0.834 sec - in org.apache.hadoop.hbase.master.TestClockSkewDetection
Running org.apache.hadoop.hbase.master.snapshot.TestSnapshotManager
Tests run: 2, Failures: 0, Errors: 0, Skipped: 0, Time elapsed: 0.498 sec - in org.apache.hadoop.hbase.master.snapshot.TestSnapshotManager
Running org.apache.hadoop.hbase.master.snapshot.TestSnapshotHFileCleaner
Tests run: 1, Failures: 0, Errors: 0, Skipped: 0, Time elapsed: 0.851 sec - in org.apache.hadoop.hbase.master.snapshot.TestSnapshotHFileCleaner
Running org.apache.hadoop.hbase.master.snapshot.TestSnapshotLogCleaner
Tests run: 1, Failures: 0, Errors: 0, Skipped: 0, Time elapsed: 0.815 sec - in org.apache.hadoop.hbase.master.snapshot.TestSnapshotLogCleaner
Running org.apache.hadoop.hbase.master.cleaner.TestHFileLinkCleaner
Tests run: 1, Failures: 0, Errors: 0, Skipped: 0, Time elapsed: 11.117 sec - in org.apache.hadoop.hbase.master.cleaner.TestHFileLinkCleaner
Running org.apache.hadoop.hbase.master.cleaner.TestCleanerChore
Tests run: 6, Failures: 0, Errors: 0, Skipped: 0, Time elapsed: 1.528 sec - in org.apache.hadoop.hbase.master.cleaner.TestCleanerChore
Running org.apache.hadoop.hbase.master.TestRegionState
Tests run: 1, Failures: 0, Errors: 0, Skipped: 0, Time elapsed: 2.06 sec - in org.apache.hadoop.hbase.master.TestRegionState
Running org.apache.hadoop.hbase.master.TestCatalogJanitor
Tests run: 7, Failures: 0, Errors: 0, Skipped: 0, Time elapsed: 13.535 sec - in org.apache.hadoop.hbase.master.TestCatalogJanitor
Running org.apache.hadoop.hbase.master.balancer.TestServerAndLoad
Tests run: 1, Failures: 0, Errors: 0, Skipped: 0, Time elapsed: 0.336 sec - in org.apache.hadoop.hbase.master.balancer.TestServerAndLoad
Running org.apache.hadoop.hbase.master.balancer.TestFavoredNodeAssignmentHelper
Tests run: 8, Failures: 0, Errors: 0, Skipped: 0, Time elapsed: 18.267 sec - in org.apache.hadoop.hbase.master.balancer.TestFavoredNodeAssignmentHelper
Running org.apache.hadoop.hbase.mapred.TestGroupingTableMap
Tests run: 4, Failures: 0, Errors: 0, Skipped: 0, Time elapsed: 1.612 sec - in org.apache.hadoop.hbase.mapred.TestGroupingTableMap
Running org.apache.hadoop.hbase.mapred.TestIdentityTableMap
Tests run: 1, Failures: 0, Errors: 0, Skipped: 0, Time elapsed: 1.011 sec - in org.apache.hadoop.hbase.mapred.TestIdentityTableMap
Running org.apache.hadoop.hbase.mapred.TestRowCounter
Tests run: 4, Failures: 0, Errors: 0, Skipped: 0, Time elapsed: 4.592 sec - in org.apache.hadoop.hbase.mapred.TestRowCounter
Running org.apache.hadoop.hbase.mapred.TestSplitTable
Tests run: 3, Failures: 0, Errors: 0, Skipped: 0, Time elapsed: 0.41 sec - in org.apache.hadoop.hbase.mapred.TestSplitTable
Running org.apache.hadoop.hbase.mapred.TestDriver
Tests run: 1, Failures: 0, Errors: 0, Skipped: 0, Time elapsed: 0.799 sec - in org.apache.hadoop.hbase.mapred.TestDriver
Running org.apache.hadoop.hbase.errorhandling.TestTimeoutExceptionInjector
Tests run: 4, Failures: 0, Errors: 0, Skipped: 0, Time elapsed: 0.623 sec - in org.apache.hadoop.hbase.errorhandling.TestTimeoutExceptionInjector
Running org.apache.hadoop.hbase.errorhandling.TestForeignExceptionDispatcher
Tests run: 3, Failures: 0, Errors: 0, Skipped: 0, Time elapsed: 0.567 sec - in org.apache.hadoop.hbase.errorhandling.TestForeignExceptionDispatcher
Running org.apache.hadoop.hbase.errorhandling.TestForeignExceptionSerialization
Tests run: 2, Failures: 0, Errors: 0, Skipped: 0, Time elapsed: 0.551 sec - in org.apache.hadoop.hbase.errorhandling.TestForeignExceptionSerialization
Running org.apache.hadoop.hbase.TestServerLoad
Tests run: 3, Failures: 0, Errors: 0, Skipped: 0, Time elapsed: 0.529 sec - in org.apache.hadoop.hbase.TestServerLoad
Running org.apache.hadoop.hbase.TestHDFSBlocksDistribution
Tests run: 2, Failures: 0, Errors: 0, Skipped: 0, Time elapsed: 0.323 sec - in org.apache.hadoop.hbase.TestHDFSBlocksDistribution
Running org.apache.hadoop.hbase.TestIPv6NIOServerSocketChannel
Tests run: 2, Failures: 0, Errors: 0, Skipped: 0, Time elapsed: 1.029 sec - in org.apache.hadoop.hbase.TestIPv6NIOServerSocketChannel
Running org.apache.hadoop.hbase.TestCompare
Tests run: 1, Failures: 0, Errors: 0, Skipped: 0, Time elapsed: 1.412 sec - in org.apache.hadoop.hbase.TestCompare
Running org.apache.hadoop.hbase.TestSerialization
Tests run: 9, Failures: 0, Errors: 0, Skipped: 0, Time elapsed: 2.547 sec - in org.apache.hadoop.hbase.TestSerialization
Running org.apache.hadoop.hbase.util.TestHFileArchiveUtil
Tests run: 4, Failures: 0, Errors: 0, Skipped: 0, Time elapsed: 2.484 sec - in org.apache.hadoop.hbase.util.TestHFileArchiveUtil
Running org.apache.hadoop.hbase.util.TestSortedCopyOnWriteSet
Tests run: 2, Failures: 0, Errors: 0, Skipped: 0, Time elapsed: 0.357 sec - in org.apache.hadoop.hbase.util.TestSortedCopyOnWriteSet
Running org.apache.hadoop.hbase.util.TestConfigurationUtil
Tests run: 2, Failures: 0, Errors: 0, Skipped: 0, Time elapsed: 0.869 sec - in org.apache.hadoop.hbase.util.TestConfigurationUtil
Running org.apache.hadoop.hbase.util.TestBloomFilterChunk
Tests run: 5, Failures: 0, Errors: 0, Skipped: 0, Time elapsed: 1.143 sec - in org.apache.hadoop.hbase.util.TestBloomFilterChunk
Running org.apache.hadoop.hbase.util.TestByteBufferUtils
Tests run: 15, Failures: 0, Errors: 0, Skipped: 0, Time elapsed: 1.126 sec - in org.apache.hadoop.hbase.util.TestByteBufferUtils
Running org.apache.hadoop.hbase.util.TestStealJobQueue
Tests run: 7, Failures: 0, Errors: 0, Skipped: 0, Time elapsed: 0.675 sec - in org.apache.hadoop.hbase.util.TestStealJobQueue
Running org.apache.hadoop.hbase.util.TestRootPath
Tests run: 1, Failures: 0, Errors: 0, Skipped: 0, Time elapsed: 0.143 sec - in org.apache.hadoop.hbase.util.TestRootPath
Running org.apache.hadoop.hbase.util.TestPoolMap$TestRoundRobinPoolType
Tests run: 3, Failures: 0, Errors: 0, Skipped: 0, Time elapsed: 0.358 sec - in org.apache.hadoop.hbase.util.TestPoolMap$TestRoundRobinPoolType
Running org.apache.hadoop.hbase.util.TestIncrementingEnvironmentEdge
Tests run: 1, Failures: 0, Errors: 0, Skipped: 0, Time elapsed: 0.3 sec - in org.apache.hadoop.hbase.util.TestIncrementingEnvironmentEdge
Running org.apache.hadoop.hbase.util.TestBoundedConcurrentLinkedQueue
Tests run: 4, Failures: 0, Errors: 0, Skipped: 0, Time elapsed: 5.397 sec - in org.apache.hadoop.hbase.util.TestBoundedConcurrentLinkedQueue
Running org.apache.hadoop.hbase.util.TestPoolMap$TestRoundRobinPoolType
Tests run: 3, Failures: 0, Errors: 0, Skipped: 0, Time elapsed: 0.369 sec - in org.apache.hadoop.hbase.util.TestPoolMap$TestRoundRobinPoolType
Running org.apache.hadoop.hbase.util.TestPoolMap$TestThreadLocalPoolType
Tests run: 3, Failures: 0, Errors: 0, Skipped: 0, Time elapsed: 0.099 sec - in org.apache.hadoop.hbase.util.TestPoolMap$TestThreadLocalPoolType
Running org.apache.hadoop.hbase.util.TestPoolMap$TestReusablePoolType
Tests run: 3, Failures: 0, Errors: 0, Skipped: 0, Time elapsed: 0.088 sec - in org.apache.hadoop.hbase.util.TestPoolMap$TestReusablePoolType
Running org.apache.hadoop.hbase.util.TestPoolMap$TestReusablePoolType
Tests run: 3, Failures: 0, Errors: 0, Skipped: 0, Time elapsed: 0.37 sec - in org.apache.hadoop.hbase.util.TestPoolMap$TestReusablePoolType
Running org.apache.hadoop.hbase.util.TestRegionSizeCalculator
Tests run: 3, Failures: 0, Errors: 0, Skipped: 0, Time elapsed: 1.243 sec - in org.apache.hadoop.hbase.util.TestRegionSizeCalculator
Running org.apache.hadoop.hbase.util.TestHBaseFsckComparator
Tests run: 6, Failures: 0, Errors: 0, Skipped: 0, Time elapsed: 0.393 sec - in org.apache.hadoop.hbase.util.TestHBaseFsckComparator
Running org.apache.hadoop.hbase.util.TestPoolMap$TestThreadLocalPoolType
Tests run: 3, Failures: 0, Errors: 0, Skipped: 0, Time elapsed: 0.339 sec - in org.apache.hadoop.hbase.util.TestPoolMap$TestThreadLocalPoolType
Running org.apache.hadoop.hbase.util.TestBoundedPriorityBlockingQueue
Tests run: 7, Failures: 0, Errors: 0, Skipped: 0, Time elapsed: 1.489 sec - in org.apache.hadoop.hbase.util.TestBoundedPriorityBlockingQueue
Running org.apache.hadoop.hbase.util.TestRegionSplitCalculator
Tests run: 15, Failures: 0, Errors: 0, Skipped: 0, Time elapsed: 0.598 sec - in org.apache.hadoop.hbase.util.TestRegionSplitCalculator
Running org.apache.hadoop.hbase.util.TestEncryptionTest
Tests run: 3, Failures: 0, Errors: 0, Skipped: 0, Time elapsed: 1.75 sec - in org.apache.hadoop.hbase.util.TestEncryptionTest
Running org.apache.hadoop.hbase.util.TestCompressionTest
Tests run: 2, Failures: 0, Errors: 0, Skipped: 0, Time elapsed: 0.837 sec - in org.apache.hadoop.hbase.util.TestCompressionTest
Running org.apache.hadoop.hbase.TestServerName
Tests run: 6, Failures: 0, Errors: 0, Skipped: 0, Time elapsed: 0.48 sec - in org.apache.hadoop.hbase.TestServerName

Results :




Tests run: 958, Failures: 0, Errors: 0, Skipped: 6

[INFO] ------------------------------------------------------------------------
[INFO] Reactor Summary:
[INFO] 
[INFO] HBase ............................................. SUCCESS [  2.838 s]
[INFO] HBase - Checkstyle ................................ SUCCESS [  0.647 s]
[INFO] HBase - Annotations ............................... SUCCESS [  0.197 s]
[INFO] HBase - Protocol .................................. SUCCESS [  2.783 s]
[INFO] HBase - Common .................................... SUCCESS [02:39 min]
[INFO] HBase - Procedure ................................. SUCCESS [02:06 min]
[INFO] HBase - Client .................................... SUCCESS [02:09 min]
[INFO] HBase - Hadoop Compatibility ...................... SUCCESS [ 14.935 s]
[INFO] HBase - Hadoop Two Compatibility .................. SUCCESS [ 28.826 s]
[INFO] HBase - Prefix Tree ............................... SUCCESS [ 23.187 s]
[INFO] HBase - Server .................................... FAILURE [40:56 min]
[INFO] HBase - Testing Util .............................. SKIPPED
[INFO] HBase - Thrift .................................... SKIPPED
[INFO] HBase - Shell ..................................... SKIPPED
[INFO] HBase - Integration Tests ......................... SKIPPED
[INFO] HBase - Examples .................................. SKIPPED
[INFO] HBase - Rest ...................................... SKIPPED
[INFO] HBase - Assembly .................................. SKIPPED
[INFO] HBase - Shaded .................................... SKIPPED
[INFO] HBase - Shaded - Client ........................... SKIPPED
[INFO] HBase - Shaded - Server ........................... SKIPPED
[INFO] ------------------------------------------------------------------------
[INFO] BUILD FAILURE
[INFO] ------------------------------------------------------------------------
[INFO] Total time: 49:06 min
[INFO] Finished at: 2015-06-26T15:03:02+00:00
[INFO] Final Memory: 65M/635M
[INFO] ------------------------------------------------------------------------
[ERROR] Failed to execute goal org.apache.maven.plugins:maven-surefire-plugin:2.18:test (default-test)
on project hbase-server: There was a timeout or other error in the fork -> [Help 1]
[ERROR] 
[ERROR] To see the full stack trace of the errors, re-run Maven with the -e switch.
[ERROR] Re-run Maven using the -X switch to enable full debug logging.
[ERROR] 
[ERROR] For more information about the errors and possible solutions, please read the following
articles:
[ERROR] [Help 1] http://cwiki.apache.org/confluence/display/MAVEN/MojoFailureException
[ERROR] 
[ERROR] After correcting the problems, you can resume the build with the command
[ERROR]   mvn <goals> -rf :hbase-server
Build step 'Invoke top-level Maven targets' marked build as failure
Performing Post build task...
Match found for :.* : True
Logical operation result is TRUE
Running script  :   ZOMBIE_TESTS_COUNT=`jps | grep surefirebooter | wc -l`
  if [[ $ZOMBIE_TESTS_COUNT != 0 ]] ; then
    #It seems sometimes the tests are not dying immediately. Let's give them 10s
    echo "Suspicious java process found - waiting 10s to see if there are just slow to stop"
    sleep 10   
    ZOMBIE_TESTS_COUNT=`jps | grep surefirebooter | wc -l`
    if [[ $ZOMBIE_TESTS_COUNT != 0 ]] ; then
      echo "There are $ZOMBIE_TESTS_COUNT zombie tests, they should have been killed by surefire
but survived"
      echo "************ BEGIN zombies jstack extract"
      ZB_STACK=`jps | grep surefirebooter | cut -d ' ' -f 1 | xargs -n 1 jstack | grep ".test"
| grep "\.java"`
      jps | grep surefirebooter | cut -d ' ' -f 1 | xargs -n 1 jstack
      echo "************ END  zombies jstack extract"
      JIRA_COMMENT="$JIRA_COMMENT

     {color:red}-1 core zombie tests{color}.  There are ${ZOMBIE_TESTS_COUNT} zombie test(s):
${ZB_STACK}"
      BAD=1
      jps | grep surefirebooter | cut -d ' ' -f 1 | xargs kill -9
    else
      echo "We're ok: there is no zombie test, but some tests took some time to stop"
    fi
  else
    echo "We're ok: there is no zombie test"
  fi
[HBase-TRUNK] $ /bin/bash -xe /tmp/hudson9108703861876998689.sh
++ jps
++ grep surefirebooter
++ wc -l
+ ZOMBIE_TESTS_COUNT=0
+ [[ 0 != 0 ]]
+ echo 'We'\''re ok: there is no zombie test'
We're ok: there is no zombie test
POST BUILD TASK : SUCCESS
END OF POST BUILD TASK : 0
Archiving artifacts
Sending artifact delta relative to HBase-TRUNK #6580
Archived 1154 artifacts
Archive block size is 32768
Received 30 blocks and 39274434 bytes
Compression is 2.4%
Took 2 min 10 sec
Recording test results
[FINDBUGS] Collecting findbugs analysis files...
[FINDBUGS] Finding all files that match the pattern **/findbugs.xml,**/findbugsXml.xml
[FINDBUGS] Parsing 24 files in <https://builds.apache.org/job/HBase-TRUNK/ws/>
[FINDBUGS] Successfully parsed file <https://builds.apache.org/job/HBase-TRUNK/6606/artifact/hbase-annotations/target/findbugs.xml>
of module  with 0 warnings.
[FINDBUGS] Successfully parsed file <https://builds.apache.org/job/HBase-TRUNK/6606/artifact/hbase-annotations/target/findbugsXml.xml>
of module  with 0 warnings.
[FINDBUGS] Successfully parsed file <https://builds.apache.org/job/HBase-TRUNK/6606/artifact/hbase-client/target/findbugs.xml>
of module  with 0 warnings.
[FINDBUGS] Successfully parsed file <https://builds.apache.org/job/HBase-TRUNK/6606/artifact/hbase-client/target/findbugsXml.xml>
of module  with 10 warnings.
[FINDBUGS] Successfully parsed file <https://builds.apache.org/job/HBase-TRUNK/6606/artifact/hbase-common/target/findbugs.xml>
of module  with 0 warnings.
[FINDBUGS] Successfully parsed file <https://builds.apache.org/job/HBase-TRUNK/6606/artifact/hbase-common/target/findbugsXml.xml>
of module  with 1 warnings.
[FINDBUGS] Successfully parsed file <https://builds.apache.org/job/HBase-TRUNK/6606/artifact/hbase-examples/target/findbugs.xml>
of module  with 0 warnings.
[FINDBUGS] Successfully parsed file <https://builds.apache.org/job/HBase-TRUNK/6606/artifact/hbase-examples/target/findbugsXml.xml>
of module  with 0 warnings.
[FINDBUGS] Successfully parsed file <https://builds.apache.org/job/HBase-TRUNK/6606/artifact/hbase-hadoop-compat/target/findbugs.xml>
of module  with 0 warnings.
[FINDBUGS] Successfully parsed file <https://builds.apache.org/job/HBase-TRUNK/6606/artifact/hbase-hadoop-compat/target/findbugsXml.xml>
of module  with 0 warnings.
[FINDBUGS] Successfully parsed file <https://builds.apache.org/job/HBase-TRUNK/6606/artifact/hbase-hadoop2-compat/target/findbugs.xml>
of module  with 0 warnings.
[FINDBUGS] Successfully parsed file <https://builds.apache.org/job/HBase-TRUNK/6606/artifact/hbase-hadoop2-compat/target/findbugsXml.xml>
of module  with 0 warnings.
[FINDBUGS] Successfully parsed file <https://builds.apache.org/job/HBase-TRUNK/6606/artifact/hbase-prefix-tree/target/findbugs.xml>
of module  with 0 warnings.
[FINDBUGS] Successfully parsed file <https://builds.apache.org/job/HBase-TRUNK/6606/artifact/hbase-prefix-tree/target/findbugsXml.xml>
of module  with 0 warnings.
[FINDBUGS] Successfully parsed file <https://builds.apache.org/job/HBase-TRUNK/6606/artifact/hbase-procedure/target/findbugs.xml>
of module  with 0 warnings.
[FINDBUGS] Successfully parsed file <https://builds.apache.org/job/HBase-TRUNK/6606/artifact/hbase-procedure/target/findbugsXml.xml>
of module  with 0 warnings.
[FINDBUGS] Successfully parsed file <https://builds.apache.org/job/HBase-TRUNK/6606/artifact/hbase-protocol/target/findbugs.xml>
of module  with 0 warnings.
[FINDBUGS] Successfully parsed file <https://builds.apache.org/job/HBase-TRUNK/6606/artifact/hbase-protocol/target/findbugsXml.xml>
of module  with 0 warnings.
[FINDBUGS] Successfully parsed file <https://builds.apache.org/job/HBase-TRUNK/6606/artifact/hbase-rest/target/findbugs.xml>
of module  with 0 warnings.
[FINDBUGS] Successfully parsed file <https://builds.apache.org/job/HBase-TRUNK/6606/artifact/hbase-rest/target/findbugsXml.xml>
of module  with 2 warnings.
[FINDBUGS] Successfully parsed file <https://builds.apache.org/job/HBase-TRUNK/6606/artifact/hbase-server/target/findbugs.xml>
of module  with 0 warnings.
[FINDBUGS] Successfully parsed file <https://builds.apache.org/job/HBase-TRUNK/6606/artifact/hbase-server/target/findbugsXml.xml>
of module  with 74 warnings.
[FINDBUGS] Successfully parsed file <https://builds.apache.org/job/HBase-TRUNK/6606/artifact/hbase-thrift/target/findbugs.xml>
of module  with 0 warnings.
[FINDBUGS] Successfully parsed file <https://builds.apache.org/job/HBase-TRUNK/6606/artifact/hbase-thrift/target/findbugsXml.xml>
of module  with 0 warnings.
[FINDBUGS] Computing warning deltas based on reference build #6580
[CHECKSTYLE] Collecting checkstyle analysis files...
[CHECKSTYLE] Finding all files that match the pattern **/checkstyle-result.xml
[CHECKSTYLE] Parsing 21 files in <https://builds.apache.org/job/HBase-TRUNK/ws/>
[CHECKSTYLE] Successfully parsed file <https://builds.apache.org/job/HBase-TRUNK/6606/artifact/hbase-annotations/target/checkstyle-result.xml>
of module  with 0 warnings.
[CHECKSTYLE] Successfully parsed file <https://builds.apache.org/job/HBase-TRUNK/6606/artifact/hbase-assembly/target/checkstyle-result.xml>
of module  with 0 warnings.
[CHECKSTYLE] Successfully parsed file <https://builds.apache.org/job/HBase-TRUNK/6606/artifact/hbase-checkstyle/target/checkstyle-result.xml>
of module  with 0 warnings.
[CHECKSTYLE] Successfully parsed file <https://builds.apache.org/job/HBase-TRUNK/6606/artifact/hbase-client/target/checkstyle-result.xml>
of module  with 209 warnings.
[CHECKSTYLE] Successfully parsed file <https://builds.apache.org/job/HBase-TRUNK/6606/artifact/hbase-common/target/checkstyle-result.xml>
of module  with 124 warnings.
[CHECKSTYLE] Successfully parsed file <https://builds.apache.org/job/HBase-TRUNK/6606/artifact/hbase-examples/target/checkstyle-result.xml>
of module  with 28 warnings.
[CHECKSTYLE] Successfully parsed file <https://builds.apache.org/job/HBase-TRUNK/6606/artifact/hbase-hadoop-compat/target/checkstyle-result.xml>
of module  with 2 warnings.
[CHECKSTYLE] Successfully parsed file <https://builds.apache.org/job/HBase-TRUNK/6606/artifact/hbase-hadoop2-compat/target/checkstyle-result.xml>
of module  with 47 warnings.
[CHECKSTYLE] Successfully parsed file <https://builds.apache.org/job/HBase-TRUNK/6606/artifact/hbase-it/target/checkstyle-result.xml>
of module  with 0 warnings.
[CHECKSTYLE] Successfully parsed file <https://builds.apache.org/job/HBase-TRUNK/6606/artifact/hbase-prefix-tree/target/checkstyle-result.xml>
of module  with 23 warnings.
[CHECKSTYLE] Successfully parsed file <https://builds.apache.org/job/HBase-TRUNK/6606/artifact/hbase-procedure/target/checkstyle-result.xml>
of module  with 0 warnings.
[CHECKSTYLE] Successfully parsed file <https://builds.apache.org/job/HBase-TRUNK/6606/artifact/hbase-protocol/target/checkstyle-result.xml>
of module  with 2 warnings.
[CHECKSTYLE] Successfully parsed file <https://builds.apache.org/job/HBase-TRUNK/6606/artifact/hbase-rest/target/checkstyle-result.xml>
of module  with 42 warnings.
[CHECKSTYLE] Successfully parsed file <https://builds.apache.org/job/HBase-TRUNK/6606/artifact/hbase-server/target/checkstyle-result.xml>
of module  with 1396 warnings.
[CHECKSTYLE] Successfully parsed file <https://builds.apache.org/job/HBase-TRUNK/6606/artifact/hbase-shaded/hbase-shaded-client/target/checkstyle-result.xml>
of module  with 0 warnings.
[CHECKSTYLE] Successfully parsed file <https://builds.apache.org/job/HBase-TRUNK/6606/artifact/hbase-shaded/hbase-shaded-server/target/checkstyle-result.xml>
of module  with 0 warnings.
[CHECKSTYLE] Successfully parsed file <https://builds.apache.org/job/HBase-TRUNK/6606/artifact/hbase-shaded/target/checkstyle-result.xml>
of module  with 0 warnings.
[CHECKSTYLE] Successfully parsed file <https://builds.apache.org/job/HBase-TRUNK/6606/artifact/hbase-shell/target/checkstyle-result.xml>
of module  with 0 warnings.
[CHECKSTYLE] Successfully parsed file <https://builds.apache.org/job/HBase-TRUNK/6606/artifact/hbase-testing-util/target/checkstyle-result.xml>
of module  with 0 warnings.
[CHECKSTYLE] Successfully parsed file <https://builds.apache.org/job/HBase-TRUNK/6606/artifact/hbase-thrift/target/checkstyle-result.xml>
of module  with 27 warnings.
[CHECKSTYLE] Successfully parsed file <https://builds.apache.org/job/HBase-TRUNK/6606/artifact/target/checkstyle-result.xml>
of module  with 0 warnings.
[CHECKSTYLE] Computing warning deltas based on reference build #6580
Updating HBASE-13963

Mime
View raw message