hbase-builds mailing list archives

Site index · List index
Message view « Date » · « Thread »
Top « Date » · « Thread »
From Apache Jenkins Server <jenk...@builds.apache.org>
Subject Build failed in Jenkins: HBase-0.98 #994
Date Mon, 18 May 2015 20:08:12 GMT
See <https://builds.apache.org/job/HBase-0.98/994/changes>

Changes:

[busbey] HBASE-13677 changed RecoverableZooKeeper logs about retries from info and warn to
debug

------------------------------------------
[...truncated 1830 lines...]
Tests run: 2, Failures: 0, Errors: 0, Skipped: 0, Time elapsed: 20.941 sec - in org.apache.hadoop.hbase.coprocessor.TestRegionServerCoprocessorExceptionWithAbort
Running org.apache.hadoop.hbase.coprocessor.TestCoprocessorTableEndpoint
Tests run: 2, Failures: 0, Errors: 0, Skipped: 0, Time elapsed: 5.045 sec - in org.apache.hadoop.hbase.coprocessor.TestCoprocessorTableEndpoint
Running org.apache.hadoop.hbase.coprocessor.TestCoprocessorEndpoint
Tests run: 6, Failures: 0, Errors: 0, Skipped: 0, Time elapsed: 1.683 sec - in org.apache.hadoop.hbase.coprocessor.TestCoprocessorEndpoint
Running org.apache.hadoop.hbase.coprocessor.TestBigDecimalColumnInterpreter
Tests run: 38, Failures: 0, Errors: 0, Skipped: 0, Time elapsed: 3.972 sec - in org.apache.hadoop.hbase.coprocessor.TestBigDecimalColumnInterpreter
Running org.apache.hadoop.hbase.coprocessor.TestClassLoading
Tests run: 9, Failures: 0, Errors: 0, Skipped: 0, Time elapsed: 13.614 sec - in org.apache.hadoop.hbase.coprocessor.TestClassLoading
Running org.apache.hadoop.hbase.coprocessor.TestRegionObserverBypass
Tests run: 2, Failures: 0, Errors: 0, Skipped: 0, Time elapsed: 2.515 sec - in org.apache.hadoop.hbase.coprocessor.TestRegionObserverBypass
Running org.apache.hadoop.hbase.coprocessor.TestRowProcessorEndpoint
Tests run: 4, Failures: 0, Errors: 0, Skipped: 0, Time elapsed: 6.781 sec - in org.apache.hadoop.hbase.coprocessor.TestRowProcessorEndpoint
Running org.apache.hadoop.hbase.coprocessor.TestRegionServerCoprocessorExceptionWithRemove
Tests run: 1, Failures: 0, Errors: 0, Skipped: 0, Time elapsed: 13.712 sec - in org.apache.hadoop.hbase.coprocessor.TestRegionServerCoprocessorExceptionWithRemove
Running org.apache.hadoop.hbase.TestJMXListener
Tests run: 2, Failures: 0, Errors: 0, Skipped: 0, Time elapsed: 16.42 sec - in org.apache.hadoop.hbase.TestJMXListener
Running org.apache.hadoop.hbase.TestHBaseTestingUtility
Tests run: 7, Failures: 0, Errors: 0, Skipped: 0, Time elapsed: 37.673 sec - in org.apache.hadoop.hbase.TestHBaseTestingUtility

Results :




Tests run: 2258, Failures: 0, Errors: 0, Skipped: 22

[INFO] 
[INFO] --- maven-jar-plugin:2.4:test-jar (default) @ hbase-server ---
[INFO] Building jar: <https://builds.apache.org/job/HBase-0.98/ws/hbase-server/target/hbase-server-0.98.13-SNAPSHOT-tests.jar>
[INFO] 
[INFO] --- maven-source-plugin:2.2.1:jar-no-fork (attach-sources) @ hbase-server ---
[INFO] Building jar: <https://builds.apache.org/job/HBase-0.98/ws/hbase-server/target/hbase-server-0.98.13-SNAPSHOT-sources.jar>
[INFO] 
[INFO] --- jacoco-maven-plugin:0.6.2.201302030002:report (report) @ hbase-server ---
[INFO] Skipping JaCoCo execution
[INFO] 
[INFO] --- maven-jar-plugin:2.4:jar (default-jar) @ hbase-server ---
[INFO] Building jar: <https://builds.apache.org/job/HBase-0.98/ws/hbase-server/target/hbase-server-0.98.13-SNAPSHOT.jar>
[INFO] 
[INFO] --- maven-install-plugin:2.3.1:install (default-install) @ hbase-server ---
[INFO] Installing <https://builds.apache.org/job/HBase-0.98/ws/hbase-server/target/hbase-server-0.98.13-SNAPSHOT.jar>
to /home/jenkins/.m2/repository/org/apache/hbase/hbase-server/0.98.13-SNAPSHOT/hbase-server-0.98.13-SNAPSHOT.jar
[INFO] Installing <https://builds.apache.org/job/HBase-0.98/ws/hbase-server/pom.xml>
to /home/jenkins/.m2/repository/org/apache/hbase/hbase-server/0.98.13-SNAPSHOT/hbase-server-0.98.13-SNAPSHOT.pom
[INFO] Installing <https://builds.apache.org/job/HBase-0.98/ws/hbase-server/target/hbase-server-0.98.13-SNAPSHOT-tests.jar>
to /home/jenkins/.m2/repository/org/apache/hbase/hbase-server/0.98.13-SNAPSHOT/hbase-server-0.98.13-SNAPSHOT-tests.jar
[INFO] Installing <https://builds.apache.org/job/HBase-0.98/ws/hbase-server/target/hbase-server-0.98.13-SNAPSHOT-sources.jar>
to /home/jenkins/.m2/repository/org/apache/hbase/hbase-server/0.98.13-SNAPSHOT/hbase-server-0.98.13-SNAPSHOT-sources.jar
[INFO]                                                                         
[INFO] ------------------------------------------------------------------------
[INFO] Building HBase - Testing Util 0.98.13-SNAPSHOT
[INFO] ------------------------------------------------------------------------
[INFO] 
[INFO] --- maven-enforcer-plugin:1.0.1:enforce (enforce) @ hbase-testing-util ---
[INFO] 
[INFO] --- jacoco-maven-plugin:0.6.2.201302030002:prepare-agent (prepare-agent) @ hbase-testing-util
---
[INFO] Skipping JaCoCo execution
[INFO] argLine set to 
[INFO] 
[INFO] --- maven-remote-resources-plugin:1.4:process (default) @ hbase-testing-util ---
[INFO] 
[INFO] --- maven-resources-plugin:2.6:resources (default-resources) @ hbase-testing-util ---
[INFO] Using 'UTF-8' encoding to copy filtered resources.
[INFO] skip non existing resourceDirectory <https://builds.apache.org/job/HBase-0.98/ws/hbase-testing-util/src/main/resources>
[INFO] Copying 3 resources
[INFO] 
[INFO] --- maven-compiler-plugin:2.5.1:compile (default-compile) @ hbase-testing-util ---
[INFO] No sources to compile
[INFO] 
[INFO] --- maven-resources-plugin:2.6:testResources (default-testResources) @ hbase-testing-util
---
[INFO] Using 'UTF-8' encoding to copy filtered resources.
[INFO] skip non existing resourceDirectory <https://builds.apache.org/job/HBase-0.98/ws/hbase-testing-util/src/test/resources>
[INFO] Copying 3 resources
[INFO] 
[INFO] --- maven-compiler-plugin:2.5.1:testCompile (default-testCompile) @ hbase-testing-util
---
[INFO] No sources to compile
[INFO] 
[INFO] --- maven-surefire-plugin:2.18:test (default-test) @ hbase-testing-util ---
[INFO] 
[INFO] --- maven-surefire-plugin:2.18:test (secondPartTestsExecution) @ hbase-testing-util
---
[INFO] 
[INFO] --- jacoco-maven-plugin:0.6.2.201302030002:report (report) @ hbase-testing-util ---
[INFO] Skipping JaCoCo execution
[INFO] 
[INFO] --- maven-jar-plugin:2.4:test-jar (default) @ hbase-testing-util ---
[INFO] Building jar: <https://builds.apache.org/job/HBase-0.98/ws/hbase-testing-util/target/hbase-testing-util-0.98.13-SNAPSHOT-tests.jar>
[INFO] 
[INFO] --- maven-jar-plugin:2.4:jar (default-jar) @ hbase-testing-util ---
[INFO] Building jar: <https://builds.apache.org/job/HBase-0.98/ws/hbase-testing-util/target/hbase-testing-util-0.98.13-SNAPSHOT.jar>
[INFO] 
[INFO] --- maven-install-plugin:2.3.1:install (default-install) @ hbase-testing-util ---
[INFO] Installing <https://builds.apache.org/job/HBase-0.98/ws/hbase-testing-util/target/hbase-testing-util-0.98.13-SNAPSHOT.jar>
to /home/jenkins/.m2/repository/org/apache/hbase/hbase-testing-util/0.98.13-SNAPSHOT/hbase-testing-util-0.98.13-SNAPSHOT.jar
[INFO] Installing <https://builds.apache.org/job/HBase-0.98/ws/hbase-testing-util/pom.xml>
to /home/jenkins/.m2/repository/org/apache/hbase/hbase-testing-util/0.98.13-SNAPSHOT/hbase-testing-util-0.98.13-SNAPSHOT.pom
[INFO] Installing <https://builds.apache.org/job/HBase-0.98/ws/hbase-testing-util/target/hbase-testing-util-0.98.13-SNAPSHOT-tests.jar>
to /home/jenkins/.m2/repository/org/apache/hbase/hbase-testing-util/0.98.13-SNAPSHOT/hbase-testing-util-0.98.13-SNAPSHOT-tests.jar
[INFO]                                                                         
[INFO] ------------------------------------------------------------------------
[INFO] Building HBase - Thrift 0.98.13-SNAPSHOT
[INFO] ------------------------------------------------------------------------
[INFO] 
[INFO] --- maven-enforcer-plugin:1.0.1:enforce (enforce) @ hbase-thrift ---
[INFO] 
[INFO] --- jacoco-maven-plugin:0.6.2.201302030002:prepare-agent (prepare-agent) @ hbase-thrift
---
[INFO] Skipping JaCoCo execution
[INFO] argLine set to 
[INFO] 
[INFO] --- maven-antrun-plugin:1.6:run (generate) @ hbase-thrift ---
[INFO] Executing tasks

main:
    [mkdir] Created dir: <https://builds.apache.org/job/HBase-0.98/ws/hbase-thrift/target/hbase-webapps>
     [copy] Copying 17 files to <https://builds.apache.org/job/HBase-0.98/ws/hbase-thrift/target/hbase-webapps>
log4j:WARN No appenders could be found for logger (org.mortbay.log).
log4j:WARN Please initialize the log4j system properly.
log4j:WARN See http://logging.apache.org/log4j/1.2/faq.html#noconfig for more info.
    [mkdir] Created dir: <https://builds.apache.org/job/HBase-0.98/ws/hbase-thrift/target/hbase-webapps/thrift/WEB-INF>
[INFO] Executed tasks
[INFO] 
[INFO] --- build-helper-maven-plugin:1.5:add-source (jspcSource-packageInfo-source) @ hbase-thrift
---
[INFO] Source directory: <https://builds.apache.org/job/HBase-0.98/ws/hbase-thrift/target/generated-sources/java>
added.
[INFO] 
[INFO] --- maven-remote-resources-plugin:1.4:process (default) @ hbase-thrift ---
[INFO] 
[INFO] --- maven-resources-plugin:2.6:resources (default-resources) @ hbase-thrift ---
[INFO] Using 'UTF-8' encoding to copy filtered resources.
[INFO] Copying 18 resources
[INFO] Copying 3 resources
[INFO] 
[INFO] --- maven-compiler-plugin:2.5.1:compile (default-compile) @ hbase-thrift ---
[INFO] Compiling 47 source files to <https://builds.apache.org/job/HBase-0.98/ws/hbase-thrift/target/classes>
[INFO] 
[INFO] --- maven-dependency-plugin:2.1:build-classpath (create-mrapp-generated-classpath)
@ hbase-thrift ---
[INFO] Wrote classpath file '<https://builds.apache.org/job/HBase-0.98/ws/hbase-thrift/target/test-classes/mrapp-generated-classpath'.>
[INFO] 
[INFO] --- maven-resources-plugin:2.6:testResources (default-testResources) @ hbase-thrift
---
[INFO] Using 'UTF-8' encoding to copy filtered resources.
[INFO] skip non existing resourceDirectory <https://builds.apache.org/job/HBase-0.98/ws/hbase-thrift/src/test/resources>
[INFO] Copying 3 resources
[INFO] 
[INFO] --- maven-compiler-plugin:2.5.1:testCompile (default-testCompile) @ hbase-thrift ---
[INFO] Compiling 5 source files to <https://builds.apache.org/job/HBase-0.98/ws/hbase-thrift/target/test-classes>
[INFO] 
[INFO] --- maven-surefire-plugin:2.18:test (default-test) @ hbase-thrift ---
[INFO] Surefire report directory: <https://builds.apache.org/job/HBase-0.98/ws/hbase-thrift/target/surefire-reports>
[INFO] Using configured provider org.apache.maven.surefire.junitcore.JUnitCoreProvider
[INFO] parallel='none', perCoreThreadCount=true, threadCount=0, useUnlimitedThreads=false,
threadCountSuites=0, threadCountClasses=0, threadCountMethods=0, parallelOptimized=true

-------------------------------------------------------
 T E S T S
-------------------------------------------------------
Running org.apache.hadoop.hbase.thrift2.TestThriftHBaseServiceHandler
Tests run: 21, Failures: 0, Errors: 0, Skipped: 0, Time elapsed: 7.903 sec - in org.apache.hadoop.hbase.thrift2.TestThriftHBaseServiceHandler
Running org.apache.hadoop.hbase.thrift2.TestThriftHBaseServiceHandlerWithLabels
Tests run: 6, Failures: 0, Errors: 0, Skipped: 0, Time elapsed: 7.947 sec - in org.apache.hadoop.hbase.thrift2.TestThriftHBaseServiceHandlerWithLabels
Running org.apache.hadoop.hbase.thrift.TestThriftServerCmdLine
Killed
Running org.apache.hadoop.hbase.thrift.TestCallQueue
Tests run: 18, Failures: 0, Errors: 0, Skipped: 0, Time elapsed: 0.299 sec - in org.apache.hadoop.hbase.thrift.TestCallQueue
Running org.apache.hadoop.hbase.thrift.TestThriftServer
Tests run: 1, Failures: 0, Errors: 0, Skipped: 0, Time elapsed: 48.613 sec - in org.apache.hadoop.hbase.thrift.TestThriftServer

Results :




Tests run: 46, Failures: 0, Errors: 0, Skipped: 0

[INFO] ------------------------------------------------------------------------
[INFO] Reactor Summary:
[INFO] 
[INFO] HBase ............................................. SUCCESS [3.677s]
[INFO] HBase - Checkstyle ................................ SUCCESS [0.755s]
[INFO] HBase - Annotations ............................... SUCCESS [0.883s]
[INFO] HBase - Common .................................... SUCCESS [46.930s]
[INFO] HBase - Protocol .................................. SUCCESS [9.435s]
[INFO] HBase - Client .................................... SUCCESS [54.177s]
[INFO] HBase - Hadoop Compatibility ...................... SUCCESS [7.035s]
[INFO] HBase - Hadoop Two Compatibility .................. SUCCESS [6.382s]
[INFO] HBase - Prefix Tree ............................... SUCCESS [8.355s]
[INFO] HBase - Server .................................... SUCCESS [3:33:06.262s]
[INFO] HBase - Testing Util .............................. SUCCESS [1.570s]
[INFO] HBase - Thrift .................................... FAILURE [2:27.214s]
[INFO] HBase - Rest ...................................... SKIPPED
[INFO] HBase - Shell ..................................... SKIPPED
[INFO] HBase - Integration Tests ......................... SKIPPED
[INFO] HBase - Examples .................................. SKIPPED
[INFO] HBase - Assembly .................................. SKIPPED
[INFO] ------------------------------------------------------------------------
[INFO] BUILD FAILURE
[INFO] ------------------------------------------------------------------------
[INFO] Total time: 3:37:53.529s
[INFO] Finished at: Mon May 18 20:05:19 UTC 2015
[INFO] Final Memory: 54M/301M
[INFO] ------------------------------------------------------------------------
[ERROR] Failed to execute goal org.apache.maven.plugins:maven-surefire-plugin:2.18:test (default-test)
on project hbase-thrift: ExecutionException: java.lang.RuntimeException: The forked VM terminated
without properly saying goodbye. VM crash or System.exit called?
[ERROR] Command was /bin/sh -c cd <https://builds.apache.org/job/HBase-0.98/ws/hbase-thrift>
&& /home/jenkins/tools/java/jdk1.7.0_25-32/jre/bin/java -enableassertions -XX:MaxDirectMemorySize=1G
-Xmx2800m -XX:MaxPermSize=256m -Djava.security.egd=file:/dev/./urandom -Djava.net.preferIPv4Stack=true
-Djava.awt.headless=true -jar <https://builds.apache.org/job/HBase-0.98/ws/hbase-thrift/target/surefire/surefirebooter8195935064536250581.jar>
<https://builds.apache.org/job/HBase-0.98/ws/hbase-thrift/target/surefire/surefire3557799325250586032tmp>
<https://builds.apache.org/job/HBase-0.98/ws/hbase-thrift/target/surefire/surefire_10941803909099220497551tmp>
[ERROR] -> [Help 1]
[ERROR] 
[ERROR] To see the full stack trace of the errors, re-run Maven with the -e switch.
[ERROR] Re-run Maven using the -X switch to enable full debug logging.
[ERROR] 
[ERROR] For more information about the errors and possible solutions, please read the following
articles:
[ERROR] [Help 1] http://cwiki.apache.org/confluence/display/MAVEN/MojoFailureException
[ERROR] 
[ERROR] After correcting the problems, you can resume the build with the command
[ERROR]   mvn <goals> -rf :hbase-thrift
Build step 'Invoke top-level Maven targets' marked build as failure
Performing Post build task...
Match found for :.* : True
Logical operation result is TRUE
Running script  :   ZOMBIE_TESTS_COUNT=`jps | grep surefirebooter | wc -l`
  if [[ $ZOMBIE_TESTS_COUNT != 0 ]] ; then
    #It seems sometimes the tests are not dying immediately. Let's give them 10s
    echo "Suspicious java process found - waiting 10s to see if there are just slow to stop"
    sleep 10   
    ZOMBIE_TESTS_COUNT=`jps | grep surefirebooter | wc -l`
    if [[ $ZOMBIE_TESTS_COUNT != 0 ]] ; then
      echo "There are $ZOMBIE_TESTS_COUNT zombie tests, they should have been killed by surefire
but survived"
      echo "************ BEGIN zombies jstack extract"
      ZB_STACK=`jps | grep surefirebooter | cut -d ' ' -f 1 | xargs -n 1 jstack | grep ".test"
| grep "\.java"`
      jps | grep surefirebooter | cut -d ' ' -f 1 | xargs -n 1 jstack
      echo "************ END  zombies jstack extract"
      JIRA_COMMENT="$JIRA_COMMENT

     {color:red}-1 core zombie tests{color}.  There are ${ZOMBIE_TESTS_COUNT} zombie test(s):
${ZB_STACK}"
      BAD=1
      jps | grep surefirebooter | cut -d ' ' -f 1 | xargs kill -9
    else
      echo "We're ok: there is no zombie test, but some tests took some time to stop"
    fi
  else
    echo "We're ok: there is no zombie test"
  fi
[HBase-0.98] $ /bin/bash -xe /tmp/hudson9206112783227875193.sh
++ jps
++ grep surefirebooter
++ wc -l
+ ZOMBIE_TESTS_COUNT=0
+ [[ 0 != 0 ]]
+ echo 'We'\''re ok: there is no zombie test'
We're ok: there is no zombie test
POST BUILD TASK : SUCCESS
END OF POST BUILD TASK : 0
Archiving artifacts
Sending artifact delta relative to HBase-0.98 #993
Archived 1756 artifacts
Archive block size is 32768
Received 19 blocks and 288780989 bytes
Compression is 0.2%
Took 2 min 40 sec
Recording test results
Updating HBASE-13677

Mime
View raw message